Buildbot-status
Threads by month
- ----- 2026 -----
- September
- August
- July
- June
- May
- April
- March
- February
- January
- ----- 2025 -----
- December
- November
- October
- September
- August
- July
- June
- May
- April
- March
- February
- January
- ----- 2024 -----
- December
- November
- October
- September
- August
- July
- June
- May
- April
- March
- February
- January
- ----- 2023 -----
- December
- November
- October
- September
- August
- July
- June
- May
- April
- March
- February
- January
- ----- 2022 -----
- December
- November
- October
- September
- August
- July
- June
- May
- April
- March
- February
- January
- ----- 2021 -----
- December
- November
- October
- September
- August
- July
- June
- May
- April
- March
- February
- January
- ----- 2020 -----
- December
- November
- October
- September
- August
- July
- June
- May
- April
- March
- February
- January
- ----- 2019 -----
- December
- November
- October
- September
- August
- July
- June
- May
- April
- March
- February
- January
- ----- 2018 -----
- December
- November
- October
- September
- August
- July
- June
- May
- April
- March
- February
- January
- ----- 2017 -----
- December
- November
- October
- September
- August
- July
- June
- May
November 2020
- 3 participants
- 208 discussions
Nov. 2, 2020
The Buildbot has detected a new failure on builder AMD64 Fedora Rawhide Refleaks 3.x while building Python.
Full details are available at:
https://buildbot.python.org/all/#builders/565/builds/70
Buildbot URL: https://buildbot.python.org/all/
Worker for this Build: cstratak-fedora-rawhide-x86_64
Build Reason: <unknown>
Blamelist:
BUILD FAILED: failed test (failure)
Summary of the results of the build (if available):
===================================================
== Tests result: FAILURE then FAILURE ==
408 tests OK.
10 slowest tests:
- test_asyncio: 36 min
- test_signal: 31 min 5 sec
- test_pydoc: 30 min 4 sec
- test_concurrent_futures: 19 min 9 sec
- test_shelve: 16 min 10 sec
- test_peg_generator: 15 min 14 sec
- test_multiprocessing_spawn: 12 min 8 sec
- test_zipfile: 11 min 45 sec
- test_largefile: 11 min 3 sec
- test_mailbox: 10 min 32 sec
2 tests failed:
test_logging test_socketserver
14 tests skipped:
test_devpoll test_gdb test_ioctl test_kqueue test_msilib
test_ossaudiodev test_startfile test_tix test_tk test_ttk_guionly
test_winconsoleio test_winreg test_winsound test_zipfile64
2 re-run tests:
test_logging test_socketserver
Total duration: 51 min 32 sec
Captured traceback
==================
Traceback (most recent call last):
File "/home/buildbot/buildarea/3.x.cstratak-fedora-rawhide-x86_64.refleak/build/Lib/multiprocessing/util.py", line 300, in _run_finalizers
finalizer()
File "/home/buildbot/buildarea/3.x.cstratak-fedora-rawhide-x86_64.refleak/build/Lib/multiprocessing/util.py", line 224, in __call__
res = self._callback(*self._args, **self._kwargs)
File "/home/buildbot/buildarea/3.x.cstratak-fedora-rawhide-x86_64.refleak/build/Lib/multiprocessing/synchronize.py", line 87, in _cleanup
sem_unlink(name)
FileNotFoundError: [Errno 2] No such file or directory
Traceback (most recent call last):
File "/home/buildbot/buildarea/3.x.cstratak-fedora-rawhide-x86_64.refleak/build/Lib/multiprocessing/util.py", line 300, in _run_finalizers
finalizer()
File "/home/buildbot/buildarea/3.x.cstratak-fedora-rawhide-x86_64.refleak/build/Lib/multiprocessing/util.py", line 224, in __call__
res = self._callback(*self._args, **self._kwargs)
File "/home/buildbot/buildarea/3.x.cstratak-fedora-rawhide-x86_64.refleak/build/Lib/multiprocessing/synchronize.py", line 87, in _cleanup
sem_unlink(name)
FileNotFoundError: [Errno 2] No such file or directory
Traceback (most recent call last):
File "/home/buildbot/buildarea/3.x.cstratak-fedora-rawhide-x86_64.refleak/build/Lib/multiprocessing/util.py", line 300, in _run_finalizers
finalizer()
File "/home/buildbot/buildarea/3.x.cstratak-fedora-rawhide-x86_64.refleak/build/Lib/multiprocessing/util.py", line 224, in __call__
res = self._callback(*self._args, **self._kwargs)
File "/home/buildbot/buildarea/3.x.cstratak-fedora-rawhide-x86_64.refleak/build/Lib/multiprocessing/synchronize.py", line 87, in _cleanup
sem_unlink(name)
FileNotFoundError: [Errno 2] No such file or directory
Traceback (most recent call last):
File "/home/buildbot/buildarea/3.x.cstratak-fedora-rawhide-x86_64.refleak/build/Lib/multiprocessing/util.py", line 300, in _run_finalizers
finalizer()
File "/home/buildbot/buildarea/3.x.cstratak-fedora-rawhide-x86_64.refleak/build/Lib/multiprocessing/util.py", line 224, in __call__
res = self._callback(*self._args, **self._kwargs)
File "/home/buildbot/buildarea/3.x.cstratak-fedora-rawhide-x86_64.refleak/build/Lib/multiprocessing/synchronize.py", line 87, in _cleanup
sem_unlink(name)
FileNotFoundError: [Errno 2] No such file or directory
Traceback (most recent call last):
File "/home/buildbot/buildarea/3.x.cstratak-fedora-rawhide-x86_64.refleak/build/Lib/multiprocessing/util.py", line 300, in _run_finalizers
finalizer()
File "/home/buildbot/buildarea/3.x.cstratak-fedora-rawhide-x86_64.refleak/build/Lib/multiprocessing/util.py", line 224, in __call__
res = self._callback(*self._args, **self._kwargs)
File "/home/buildbot/buildarea/3.x.cstratak-fedora-rawhide-x86_64.refleak/build/Lib/multiprocessing/synchronize.py", line 87, in _cleanup
sem_unlink(name)
FileNotFoundError: [Errno 2] No such file or directory
Traceback (most recent call last):
File "/home/buildbot/buildarea/3.x.cstratak-fedora-rawhide-x86_64.refleak/build/Lib/multiprocessing/util.py", line 300, in _run_finalizers
finalizer()
File "/home/buildbot/buildarea/3.x.cstratak-fedora-rawhide-x86_64.refleak/build/Lib/multiprocessing/util.py", line 224, in __call__
res = self._callback(*self._args, **self._kwargs)
File "/home/buildbot/buildarea/3.x.cstratak-fedora-rawhide-x86_64.refleak/build/Lib/multiprocessing/synchronize.py", line 87, in _cleanup
sem_unlink(name)
FileNotFoundError: [Errno 2] No such file or directory
./home/buildbot/buildarea/3.x.cstratak-fedora-rawhide-x86_64.refleak/build/Lib/multiprocessing/resource_tracker.py:216: UserWarning: resource_tracker: There appear to be 6 leaked semaphore objects to clean up at shutdown
warnings.warn('resource_tracker: There appear to be %d '
Traceback (most recent call last):
File "/home/buildbot/buildarea/3.x.cstratak-fedora-rawhide-x86_64.refleak/build/Lib/multiprocessing/util.py", line 300, in _run_finalizers
finalizer()
File "/home/buildbot/buildarea/3.x.cstratak-fedora-rawhide-x86_64.refleak/build/Lib/multiprocessing/util.py", line 224, in __call__
res = self._callback(*self._args, **self._kwargs)
File "/home/buildbot/buildarea/3.x.cstratak-fedora-rawhide-x86_64.refleak/build/Lib/multiprocessing/synchronize.py", line 87, in _cleanup
sem_unlink(name)
FileNotFoundError: [Errno 2] No such file or directory
Traceback (most recent call last):
File "/home/buildbot/buildarea/3.x.cstratak-fedora-rawhide-x86_64.refleak/build/Lib/multiprocessing/util.py", line 300, in _run_finalizers
finalizer()
File "/home/buildbot/buildarea/3.x.cstratak-fedora-rawhide-x86_64.refleak/build/Lib/multiprocessing/util.py", line 224, in __call__
res = self._callback(*self._args, **self._kwargs)
File "/home/buildbot/buildarea/3.x.cstratak-fedora-rawhide-x86_64.refleak/build/Lib/multiprocessing/synchronize.py", line 87, in _cleanup
sem_unlink(name)
FileNotFoundError: [Errno 2] No such file or directory
Traceback (most recent call last):
File "/home/buildbot/buildarea/3.x.cstratak-fedora-rawhide-x86_64.refleak/build/Lib/multiprocessing/util.py", line 300, in _run_finalizers
finalizer()
File "/home/buildbot/buildarea/3.x.cstratak-fedora-rawhide-x86_64.refleak/build/Lib/multiprocessing/util.py", line 224, in __call__
res = self._callback(*self._args, **self._kwargs)
File "/home/buildbot/buildarea/3.x.cstratak-fedora-rawhide-x86_64.refleak/build/Lib/multiprocessing/synchronize.py", line 87, in _cleanup
sem_unlink(name)
FileNotFoundError: [Errno 2] No such file or directory
Traceback (most recent call last):
File "/home/buildbot/buildarea/3.x.cstratak-fedora-rawhide-x86_64.refleak/build/Lib/multiprocessing/util.py", line 300, in _run_finalizers
finalizer()
File "/home/buildbot/buildarea/3.x.cstratak-fedora-rawhide-x86_64.refleak/build/Lib/multiprocessing/util.py", line 224, in __call__
res = self._callback(*self._args, **self._kwargs)
File "/home/buildbot/buildarea/3.x.cstratak-fedora-rawhide-x86_64.refleak/build/Lib/multiprocessing/synchronize.py", line 87, in _cleanup
sem_unlink(name)
FileNotFoundError: [Errno 2] No such file or directory
Traceback (most recent call last):
File "/home/buildbot/buildarea/3.x.cstratak-fedora-rawhide-x86_64.refleak/build/Lib/multiprocessing/util.py", line 300, in _run_finalizers
finalizer()
File "/home/buildbot/buildarea/3.x.cstratak-fedora-rawhide-x86_64.refleak/build/Lib/multiprocessing/util.py", line 224, in __call__
res = self._callback(*self._args, **self._kwargs)
File "/home/buildbot/buildarea/3.x.cstratak-fedora-rawhide-x86_64.refleak/build/Lib/multiprocessing/synchronize.py", line 87, in _cleanup
sem_unlink(name)
FileNotFoundError: [Errno 2] No such file or directory
Traceback (most recent call last):
File "/home/buildbot/buildarea/3.x.cstratak-fedora-rawhide-x86_64.refleak/build/Lib/multiprocessing/util.py", line 300, in _run_finalizers
finalizer()
File "/home/buildbot/buildarea/3.x.cstratak-fedora-rawhide-x86_64.refleak/build/Lib/multiprocessing/util.py", line 224, in __call__
res = self._callback(*self._args, **self._kwargs)
File "/home/buildbot/buildarea/3.x.cstratak-fedora-rawhide-x86_64.refleak/build/Lib/multiprocessing/synchronize.py", line 87, in _cleanup
sem_unlink(name)
FileNotFoundError: [Errno 2] No such file or directory
./home/buildbot/buildarea/3.x.cstratak-fedora-rawhide-x86_64.refleak/build/Lib/multiprocessing/resource_tracker.py:216: UserWarning: resource_tracker: There appear to be 6 leaked semaphore objects to clean up at shutdown
warnings.warn('resource_tracker: There appear to be %d '
Traceback (most recent call last):
File "/home/buildbot/buildarea/3.x.cstratak-fedora-rawhide-x86_64.refleak/build/Lib/multiprocessing/util.py", line 300, in _run_finalizers
finalizer()
File "/home/buildbot/buildarea/3.x.cstratak-fedora-rawhide-x86_64.refleak/build/Lib/multiprocessing/util.py", line 224, in __call__
res = self._callback(*self._args, **self._kwargs)
File "/home/buildbot/buildarea/3.x.cstratak-fedora-rawhide-x86_64.refleak/build/Lib/multiprocessing/synchronize.py", line 87, in _cleanup
sem_unlink(name)
FileNotFoundError: [Errno 2] No such file or directory
Traceback (most recent call last):
File "/home/buildbot/buildarea/3.x.cstratak-fedora-rawhide-x86_64.refleak/build/Lib/multiprocessing/util.py", line 300, in _run_finalizers
finalizer()
File "/home/buildbot/buildarea/3.x.cstratak-fedora-rawhide-x86_64.refleak/build/Lib/multiprocessing/util.py", line 224, in __call__
res = self._callback(*self._args, **self._kwargs)
File "/home/buildbot/buildarea/3.x.cstratak-fedora-rawhide-x86_64.refleak/build/Lib/multiprocessing/synchronize.py", line 87, in _cleanup
sem_unlink(name)
FileNotFoundError: [Errno 2] No such file or directory
Traceback (most recent call last):
File "/home/buildbot/buildarea/3.x.cstratak-fedora-rawhide-x86_64.refleak/build/Lib/multiprocessing/util.py", line 300, in _run_finalizers
finalizer()
File "/home/buildbot/buildarea/3.x.cstratak-fedora-rawhide-x86_64.refleak/build/Lib/multiprocessing/util.py", line 224, in __call__
res = self._callback(*self._args, **self._kwargs)
File "/home/buildbot/buildarea/3.x.cstratak-fedora-rawhide-x86_64.refleak/build/Lib/multiprocessing/synchronize.py", line 87, in _cleanup
sem_unlink(name)
FileNotFoundError: [Errno 2] No such file or directory
Traceback (most recent call last):
File "/home/buildbot/buildarea/3.x.cstratak-fedora-rawhide-x86_64.refleak/build/Lib/multiprocessing/util.py", line 300, in _run_finalizers
finalizer()
File "/home/buildbot/buildarea/3.x.cstratak-fedora-rawhide-x86_64.refleak/build/Lib/multiprocessing/util.py", line 224, in __call__
res = self._callback(*self._args, **self._kwargs)
File "/home/buildbot/buildarea/3.x.cstratak-fedora-rawhide-x86_64.refleak/build/Lib/multiprocessing/synchronize.py", line 87, in _cleanup
sem_unlink(name)
FileNotFoundError: [Errno 2] No such file or directory
Traceback (most recent call last):
File "/home/buildbot/buildarea/3.x.cstratak-fedora-rawhide-x86_64.refleak/build/Lib/multiprocessing/util.py", line 300, in _run_finalizers
finalizer()
File "/home/buildbot/buildarea/3.x.cstratak-fedora-rawhide-x86_64.refleak/build/Lib/multiprocessing/util.py", line 224, in __call__
res = self._callback(*self._args, **self._kwargs)
File "/home/buildbot/buildarea/3.x.cstratak-fedora-rawhide-x86_64.refleak/build/Lib/multiprocessing/synchronize.py", line 87, in _cleanup
sem_unlink(name)
FileNotFoundError: [Errno 2] No such file or directory
Traceback (most recent call last):
File "/home/buildbot/buildarea/3.x.cstratak-fedora-rawhide-x86_64.refleak/build/Lib/multiprocessing/util.py", line 300, in _run_finalizers
finalizer()
File "/home/buildbot/buildarea/3.x.cstratak-fedora-rawhide-x86_64.refleak/build/Lib/multiprocessing/util.py", line 224, in __call__
res = self._callback(*self._args, **self._kwargs)
File "/home/buildbot/buildarea/3.x.cstratak-fedora-rawhide-x86_64.refleak/build/Lib/multiprocessing/synchronize.py", line 87, in _cleanup
sem_unlink(name)
FileNotFoundError: [Errno 2] No such file or directory
./home/buildbot/buildarea/3.x.cstratak-fedora-rawhide-x86_64.refleak/build/Lib/multiprocessing/resource_tracker.py:216: UserWarning: resource_tracker: There appear to be 6 leaked semaphore objects to clean up at shutdown
warnings.warn('resource_tracker: There appear to be %d '
Traceback (most recent call last):
File "/home/buildbot/buildarea/3.x.cstratak-fedora-rawhide-x86_64.refleak/build/Lib/multiprocessing/util.py", line 300, in _run_finalizers
finalizer()
File "/home/buildbot/buildarea/3.x.cstratak-fedora-rawhide-x86_64.refleak/build/Lib/multiprocessing/util.py", line 224, in __call__
res = self._callback(*self._args, **self._kwargs)
File "/home/buildbot/buildarea/3.x.cstratak-fedora-rawhide-x86_64.refleak/build/Lib/multiprocessing/synchronize.py", line 87, in _cleanup
sem_unlink(name)
FileNotFoundError: [Errno 2] No such file or directory
Traceback (most recent call last):
File "/home/buildbot/buildarea/3.x.cstratak-fedora-rawhide-x86_64.refleak/build/Lib/multiprocessing/util.py", line 300, in _run_finalizers
finalizer()
File "/home/buildbot/buildarea/3.x.cstratak-fedora-rawhide-x86_64.refleak/build/Lib/multiprocessing/util.py", line 224, in __call__
res = self._callback(*self._args, **self._kwargs)
File "/home/buildbot/buildarea/3.x.cstratak-fedora-rawhide-x86_64.refleak/build/Lib/multiprocessing/synchronize.py", line 87, in _cleanup
sem_unlink(name)
FileNotFoundError: [Errno 2] No such file or directory
Traceback (most recent call last):
File "/home/buildbot/buildarea/3.x.cstratak-fedora-rawhide-x86_64.refleak/build/Lib/multiprocessing/util.py", line 300, in _run_finalizers
finalizer()
File "/home/buildbot/buildarea/3.x.cstratak-fedora-rawhide-x86_64.refleak/build/Lib/multiprocessing/util.py", line 224, in __call__
res = self._callback(*self._args, **self._kwargs)
File "/home/buildbot/buildarea/3.x.cstratak-fedora-rawhide-x86_64.refleak/build/Lib/multiprocessing/synchronize.py", line 87, in _cleanup
sem_unlink(name)
FileNotFoundError: [Errno 2] No such file or directory
Traceback (most recent call last):
File "/home/buildbot/buildarea/3.x.cstratak-fedora-rawhide-x86_64.refleak/build/Lib/multiprocessing/util.py", line 300, in _run_finalizers
finalizer()
File "/home/buildbot/buildarea/3.x.cstratak-fedora-rawhide-x86_64.refleak/build/Lib/multiprocessing/util.py", line 224, in __call__
res = self._callback(*self._args, **self._kwargs)
File "/home/buildbot/buildarea/3.x.cstratak-fedora-rawhide-x86_64.refleak/build/Lib/multiprocessing/synchronize.py", line 87, in _cleanup
sem_unlink(name)
FileNotFoundError: [Errno 2] No such file or directory
Traceback (most recent call last):
File "/home/buildbot/buildarea/3.x.cstratak-fedora-rawhide-x86_64.refleak/build/Lib/multiprocessing/util.py", line 300, in _run_finalizers
finalizer()
File "/home/buildbot/buildarea/3.x.cstratak-fedora-rawhide-x86_64.refleak/build/Lib/multiprocessing/util.py", line 224, in __call__
res = self._callback(*self._args, **self._kwargs)
File "/home/buildbot/buildarea/3.x.cstratak-fedora-rawhide-x86_64.refleak/build/Lib/multiprocessing/synchronize.py", line 87, in _cleanup
sem_unlink(name)
FileNotFoundError: [Errno 2] No such file or directory
Traceback (most recent call last):
File "/home/buildbot/buildarea/3.x.cstratak-fedora-rawhide-x86_64.refleak/build/Lib/multiprocessing/util.py", line 300, in _run_finalizers
finalizer()
File "/home/buildbot/buildarea/3.x.cstratak-fedora-rawhide-x86_64.refleak/build/Lib/multiprocessing/util.py", line 224, in __call__
res = self._callback(*self._args, **self._kwargs)
File "/home/buildbot/buildarea/3.x.cstratak-fedora-rawhide-x86_64.refleak/build/Lib/multiprocessing/synchronize.py", line 87, in _cleanup
sem_unlink(name)
FileNotFoundError: [Errno 2] No such file or directory
./home/buildbot/buildarea/3.x.cstratak-fedora-rawhide-x86_64.refleak/build/Lib/multiprocessing/resource_tracker.py:216: UserWarning: resource_tracker: There appear to be 6 leaked semaphore objects to clean up at shutdown
warnings.warn('resource_tracker: There appear to be %d '
Traceback (most recent call last):
File "/home/buildbot/buildarea/3.x.cstratak-fedora-rawhide-x86_64.refleak/build/Lib/multiprocessing/util.py", line 300, in _run_finalizers
finalizer()
File "/home/buildbot/buildarea/3.x.cstratak-fedora-rawhide-x86_64.refleak/build/Lib/multiprocessing/util.py", line 224, in __call__
res = self._callback(*self._args, **self._kwargs)
File "/home/buildbot/buildarea/3.x.cstratak-fedora-rawhide-x86_64.refleak/build/Lib/multiprocessing/synchronize.py", line 87, in _cleanup
sem_unlink(name)
FileNotFoundError: [Errno 2] No such file or directory
Traceback (most recent call last):
File "/home/buildbot/buildarea/3.x.cstratak-fedora-rawhide-x86_64.refleak/build/Lib/multiprocessing/util.py", line 300, in _run_finalizers
finalizer()
File "/home/buildbot/buildarea/3.x.cstratak-fedora-rawhide-x86_64.refleak/build/Lib/multiprocessing/util.py", line 224, in __call__
res = self._callback(*self._args, **self._kwargs)
File "/home/buildbot/buildarea/3.x.cstratak-fedora-rawhide-x86_64.refleak/build/Lib/multiprocessing/synchronize.py", line 87, in _cleanup
sem_unlink(name)
FileNotFoundError: [Errno 2] No such file or directory
Traceback (most recent call last):
File "/home/buildbot/buildarea/3.x.cstratak-fedora-rawhide-x86_64.refleak/build/Lib/multiprocessing/util.py", line 300, in _run_finalizers
finalizer()
File "/home/buildbot/buildarea/3.x.cstratak-fedora-rawhide-x86_64.refleak/build/Lib/multiprocessing/util.py", line 224, in __call__
res = self._callback(*self._args, **self._kwargs)
File "/home/buildbot/buildarea/3.x.cstratak-fedora-rawhide-x86_64.refleak/build/Lib/multiprocessing/synchronize.py", line 87, in _cleanup
sem_unlink(name)
FileNotFoundError: [Errno 2] No such file or directory
Traceback (most recent call last):
File "/home/buildbot/buildarea/3.x.cstratak-fedora-rawhide-x86_64.refleak/build/Lib/multiprocessing/util.py", line 300, in _run_finalizers
finalizer()
File "/home/buildbot/buildarea/3.x.cstratak-fedora-rawhide-x86_64.refleak/build/Lib/multiprocessing/util.py", line 224, in __call__
res = self._callback(*self._args, **self._kwargs)
File "/home/buildbot/buildarea/3.x.cstratak-fedora-rawhide-x86_64.refleak/build/Lib/multiprocessing/synchronize.py", line 87, in _cleanup
sem_unlink(name)
FileNotFoundError: [Errno 2] No such file or directory
Traceback (most recent call last):
File "/home/buildbot/buildarea/3.x.cstratak-fedora-rawhide-x86_64.refleak/build/Lib/multiprocessing/util.py", line 300, in _run_finalizers
finalizer()
File "/home/buildbot/buildarea/3.x.cstratak-fedora-rawhide-x86_64.refleak/build/Lib/multiprocessing/util.py", line 224, in __call__
res = self._callback(*self._args, **self._kwargs)
File "/home/buildbot/buildarea/3.x.cstratak-fedora-rawhide-x86_64.refleak/build/Lib/multiprocessing/synchronize.py", line 87, in _cleanup
sem_unlink(name)
FileNotFoundError: [Errno 2] No such file or directory
Traceback (most recent call last):
File "/home/buildbot/buildarea/3.x.cstratak-fedora-rawhide-x86_64.refleak/build/Lib/multiprocessing/util.py", line 300, in _run_finalizers
finalizer()
File "/home/buildbot/buildarea/3.x.cstratak-fedora-rawhide-x86_64.refleak/build/Lib/multiprocessing/util.py", line 224, in __call__
res = self._callback(*self._args, **self._kwargs)
File "/home/buildbot/buildarea/3.x.cstratak-fedora-rawhide-x86_64.refleak/build/Lib/multiprocessing/synchronize.py", line 87, in _cleanup
sem_unlink(name)
FileNotFoundError: [Errno 2] No such file or directory
./home/buildbot/buildarea/3.x.cstratak-fedora-rawhide-x86_64.refleak/build/Lib/multiprocessing/resource_tracker.py:216: UserWarning: resource_tracker: There appear to be 6 leaked semaphore objects to clean up at shutdown
warnings.warn('resource_tracker: There appear to be %d '
Traceback (most recent call last):
File "/home/buildbot/buildarea/3.x.cstratak-fedora-rawhide-x86_64.refleak/build/Lib/multiprocessing/util.py", line 300, in _run_finalizers
finalizer()
File "/home/buildbot/buildarea/3.x.cstratak-fedora-rawhide-x86_64.refleak/build/Lib/multiprocessing/util.py", line 224, in __call__
res = self._callback(*self._args, **self._kwargs)
File "/home/buildbot/buildarea/3.x.cstratak-fedora-rawhide-x86_64.refleak/build/Lib/multiprocessing/synchronize.py", line 87, in _cleanup
sem_unlink(name)
FileNotFoundError: [Errno 2] No such file or directory
Traceback (most recent call last):
File "/home/buildbot/buildarea/3.x.cstratak-fedora-rawhide-x86_64.refleak/build/Lib/multiprocessing/util.py", line 300, in _run_finalizers
finalizer()
File "/home/buildbot/buildarea/3.x.cstratak-fedora-rawhide-x86_64.refleak/build/Lib/multiprocessing/util.py", line 224, in __call__
res = self._callback(*self._args, **self._kwargs)
File "/home/buildbot/buildarea/3.x.cstratak-fedora-rawhide-x86_64.refleak/build/Lib/multiprocessing/synchronize.py", line 87, in _cleanup
sem_unlink(name)
FileNotFoundError: [Errno 2] No such file or directory
Traceback (most recent call last):
File "/home/buildbot/buildarea/3.x.cstratak-fedora-rawhide-x86_64.refleak/build/Lib/multiprocessing/util.py", line 300, in _run_finalizers
finalizer()
File "/home/buildbot/buildarea/3.x.cstratak-fedora-rawhide-x86_64.refleak/build/Lib/multiprocessing/util.py", line 224, in __call__
res = self._callback(*self._args, **self._kwargs)
File "/home/buildbot/buildarea/3.x.cstratak-fedora-rawhide-x86_64.refleak/build/Lib/multiprocessing/synchronize.py", line 87, in _cleanup
sem_unlink(name)
FileNotFoundError: [Errno 2] No such file or directory
Traceback (most recent call last):
File "/home/buildbot/buildarea/3.x.cstratak-fedora-rawhide-x86_64.refleak/build/Lib/multiprocessing/util.py", line 300, in _run_finalizers
finalizer()
File "/home/buildbot/buildarea/3.x.cstratak-fedora-rawhide-x86_64.refleak/build/Lib/multiprocessing/util.py", line 224, in __call__
res = self._callback(*self._args, **self._kwargs)
File "/home/buildbot/buildarea/3.x.cstratak-fedora-rawhide-x86_64.refleak/build/Lib/multiprocessing/synchronize.py", line 87, in _cleanup
sem_unlink(name)
FileNotFoundError: [Errno 2] No such file or directory
Traceback (most recent call last):
File "/home/buildbot/buildarea/3.x.cstratak-fedora-rawhide-x86_64.refleak/build/Lib/multiprocessing/util.py", line 300, in _run_finalizers
finalizer()
File "/home/buildbot/buildarea/3.x.cstratak-fedora-rawhide-x86_64.refleak/build/Lib/multiprocessing/util.py", line 224, in __call__
res = self._callback(*self._args, **self._kwargs)
File "/home/buildbot/buildarea/3.x.cstratak-fedora-rawhide-x86_64.refleak/build/Lib/multiprocessing/synchronize.py", line 87, in _cleanup
sem_unlink(name)
FileNotFoundError: [Errno 2] No such file or directory
Traceback (most recent call last):
File "/home/buildbot/buildarea/3.x.cstratak-fedora-rawhide-x86_64.refleak/build/Lib/multiprocessing/util.py", line 300, in _run_finalizers
finalizer()
File "/home/buildbot/buildarea/3.x.cstratak-fedora-rawhide-x86_64.refleak/build/Lib/multiprocessing/util.py", line 224, in __call__
res = self._callback(*self._args, **self._kwargs)
File "/home/buildbot/buildarea/3.x.cstratak-fedora-rawhide-x86_64.refleak/build/Lib/multiprocessing/synchronize.py", line 87, in _cleanup
sem_unlink(name)
FileNotFoundError: [Errno 2] No such file or directory
.
Test report
===========
Failed tests:
- test_socketserver
- test_logging
Test leaking resources:
- test_logging: references
- test_socketserver: references
- test_logging: memory blocks
- test_socketserver: memory blocks
Sincerely,
-The Buildbot
1
0
Nov. 2, 2020
The Buildbot has detected a new failure on builder aarch64 RHEL8 Refleaks 3.x while building Python.
Full details are available at:
https://buildbot.python.org/all/#builders/551/builds/77
Buildbot URL: https://buildbot.python.org/all/
Worker for this Build: cstratak-RHEL8-aarch64
Build Reason: <unknown>
Blamelist:
BUILD FAILED: failed test (failure)
Summary of the results of the build (if available):
===================================================
== Tests result: FAILURE then FAILURE ==
409 tests OK.
10 slowest tests:
- test_asyncio: 54 min 3 sec
- test_signal: 31 min 8 sec
- test_pydoc: 29 min 48 sec
- test_concurrent_futures: 21 min 29 sec
- test_peg_generator: 17 min 11 sec
- test_multiprocessing_spawn: 12 min 39 sec
- test_gdb: 11 min 21 sec
- test_multiprocessing_forkserver: 8 min 15 sec
- test_nntplib: 8 min 4 sec
- test_lib2to3: 7 min 22 sec
2 tests failed:
test_logging test_socketserver
13 tests skipped:
test_devpoll test_ioctl test_kqueue test_msilib test_ossaudiodev
test_startfile test_tix test_tk test_ttk_guionly test_winconsoleio
test_winreg test_winsound test_zipfile64
2 re-run tests:
test_logging test_socketserver
Total duration: 57 min 37 sec
Captured traceback
==================
Traceback (most recent call last):
File "/home/buildbot/buildarea/3.x.cstratak-RHEL8-aarch64.refleak/build/Lib/multiprocessing/util.py", line 300, in _run_finalizers
finalizer()
File "/home/buildbot/buildarea/3.x.cstratak-RHEL8-aarch64.refleak/build/Lib/multiprocessing/util.py", line 224, in __call__
res = self._callback(*self._args, **self._kwargs)
File "/home/buildbot/buildarea/3.x.cstratak-RHEL8-aarch64.refleak/build/Lib/multiprocessing/synchronize.py", line 87, in _cleanup
sem_unlink(name)
FileNotFoundError: [Errno 2] No such file or directory
Traceback (most recent call last):
File "/home/buildbot/buildarea/3.x.cstratak-RHEL8-aarch64.refleak/build/Lib/multiprocessing/util.py", line 300, in _run_finalizers
finalizer()
File "/home/buildbot/buildarea/3.x.cstratak-RHEL8-aarch64.refleak/build/Lib/multiprocessing/util.py", line 224, in __call__
res = self._callback(*self._args, **self._kwargs)
File "/home/buildbot/buildarea/3.x.cstratak-RHEL8-aarch64.refleak/build/Lib/multiprocessing/synchronize.py", line 87, in _cleanup
sem_unlink(name)
FileNotFoundError: [Errno 2] No such file or directory
Traceback (most recent call last):
File "/home/buildbot/buildarea/3.x.cstratak-RHEL8-aarch64.refleak/build/Lib/multiprocessing/util.py", line 300, in _run_finalizers
finalizer()
File "/home/buildbot/buildarea/3.x.cstratak-RHEL8-aarch64.refleak/build/Lib/multiprocessing/util.py", line 224, in __call__
res = self._callback(*self._args, **self._kwargs)
File "/home/buildbot/buildarea/3.x.cstratak-RHEL8-aarch64.refleak/build/Lib/multiprocessing/synchronize.py", line 87, in _cleanup
sem_unlink(name)
FileNotFoundError: [Errno 2] No such file or directory
Traceback (most recent call last):
File "/home/buildbot/buildarea/3.x.cstratak-RHEL8-aarch64.refleak/build/Lib/multiprocessing/util.py", line 300, in _run_finalizers
finalizer()
File "/home/buildbot/buildarea/3.x.cstratak-RHEL8-aarch64.refleak/build/Lib/multiprocessing/util.py", line 224, in __call__
res = self._callback(*self._args, **self._kwargs)
File "/home/buildbot/buildarea/3.x.cstratak-RHEL8-aarch64.refleak/build/Lib/multiprocessing/synchronize.py", line 87, in _cleanup
sem_unlink(name)
FileNotFoundError: [Errno 2] No such file or directory
Traceback (most recent call last):
File "/home/buildbot/buildarea/3.x.cstratak-RHEL8-aarch64.refleak/build/Lib/multiprocessing/util.py", line 300, in _run_finalizers
finalizer()
File "/home/buildbot/buildarea/3.x.cstratak-RHEL8-aarch64.refleak/build/Lib/multiprocessing/util.py", line 224, in __call__
res = self._callback(*self._args, **self._kwargs)
File "/home/buildbot/buildarea/3.x.cstratak-RHEL8-aarch64.refleak/build/Lib/multiprocessing/synchronize.py", line 87, in _cleanup
sem_unlink(name)
FileNotFoundError: [Errno 2] No such file or directory
Traceback (most recent call last):
File "/home/buildbot/buildarea/3.x.cstratak-RHEL8-aarch64.refleak/build/Lib/multiprocessing/util.py", line 300, in _run_finalizers
finalizer()
File "/home/buildbot/buildarea/3.x.cstratak-RHEL8-aarch64.refleak/build/Lib/multiprocessing/util.py", line 224, in __call__
res = self._callback(*self._args, **self._kwargs)
File "/home/buildbot/buildarea/3.x.cstratak-RHEL8-aarch64.refleak/build/Lib/multiprocessing/synchronize.py", line 87, in _cleanup
sem_unlink(name)
FileNotFoundError: [Errno 2] No such file or directory
./home/buildbot/buildarea/3.x.cstratak-RHEL8-aarch64.refleak/build/Lib/multiprocessing/resource_tracker.py:216: UserWarning: resource_tracker: There appear to be 6 leaked semaphore objects to clean up at shutdown
warnings.warn('resource_tracker: There appear to be %d '
Traceback (most recent call last):
File "/home/buildbot/buildarea/3.x.cstratak-RHEL8-aarch64.refleak/build/Lib/multiprocessing/util.py", line 300, in _run_finalizers
finalizer()
File "/home/buildbot/buildarea/3.x.cstratak-RHEL8-aarch64.refleak/build/Lib/multiprocessing/util.py", line 224, in __call__
res = self._callback(*self._args, **self._kwargs)
File "/home/buildbot/buildarea/3.x.cstratak-RHEL8-aarch64.refleak/build/Lib/multiprocessing/synchronize.py", line 87, in _cleanup
sem_unlink(name)
FileNotFoundError: [Errno 2] No such file or directory
Traceback (most recent call last):
File "/home/buildbot/buildarea/3.x.cstratak-RHEL8-aarch64.refleak/build/Lib/multiprocessing/util.py", line 300, in _run_finalizers
finalizer()
File "/home/buildbot/buildarea/3.x.cstratak-RHEL8-aarch64.refleak/build/Lib/multiprocessing/util.py", line 224, in __call__
res = self._callback(*self._args, **self._kwargs)
File "/home/buildbot/buildarea/3.x.cstratak-RHEL8-aarch64.refleak/build/Lib/multiprocessing/synchronize.py", line 87, in _cleanup
sem_unlink(name)
FileNotFoundError: [Errno 2] No such file or directory
Traceback (most recent call last):
File "/home/buildbot/buildarea/3.x.cstratak-RHEL8-aarch64.refleak/build/Lib/multiprocessing/util.py", line 300, in _run_finalizers
finalizer()
File "/home/buildbot/buildarea/3.x.cstratak-RHEL8-aarch64.refleak/build/Lib/multiprocessing/util.py", line 224, in __call__
res = self._callback(*self._args, **self._kwargs)
File "/home/buildbot/buildarea/3.x.cstratak-RHEL8-aarch64.refleak/build/Lib/multiprocessing/synchronize.py", line 87, in _cleanup
sem_unlink(name)
FileNotFoundError: [Errno 2] No such file or directory
Traceback (most recent call last):
File "/home/buildbot/buildarea/3.x.cstratak-RHEL8-aarch64.refleak/build/Lib/multiprocessing/util.py", line 300, in _run_finalizers
finalizer()
File "/home/buildbot/buildarea/3.x.cstratak-RHEL8-aarch64.refleak/build/Lib/multiprocessing/util.py", line 224, in __call__
res = self._callback(*self._args, **self._kwargs)
File "/home/buildbot/buildarea/3.x.cstratak-RHEL8-aarch64.refleak/build/Lib/multiprocessing/synchronize.py", line 87, in _cleanup
sem_unlink(name)
FileNotFoundError: [Errno 2] No such file or directory
Traceback (most recent call last):
File "/home/buildbot/buildarea/3.x.cstratak-RHEL8-aarch64.refleak/build/Lib/multiprocessing/util.py", line 300, in _run_finalizers
finalizer()
File "/home/buildbot/buildarea/3.x.cstratak-RHEL8-aarch64.refleak/build/Lib/multiprocessing/util.py", line 224, in __call__
res = self._callback(*self._args, **self._kwargs)
File "/home/buildbot/buildarea/3.x.cstratak-RHEL8-aarch64.refleak/build/Lib/multiprocessing/synchronize.py", line 87, in _cleanup
sem_unlink(name)
FileNotFoundError: [Errno 2] No such file or directory
Traceback (most recent call last):
File "/home/buildbot/buildarea/3.x.cstratak-RHEL8-aarch64.refleak/build/Lib/multiprocessing/util.py", line 300, in _run_finalizers
finalizer()
File "/home/buildbot/buildarea/3.x.cstratak-RHEL8-aarch64.refleak/build/Lib/multiprocessing/util.py", line 224, in __call__
res = self._callback(*self._args, **self._kwargs)
File "/home/buildbot/buildarea/3.x.cstratak-RHEL8-aarch64.refleak/build/Lib/multiprocessing/synchronize.py", line 87, in _cleanup
sem_unlink(name)
FileNotFoundError: [Errno 2] No such file or directory
./home/buildbot/buildarea/3.x.cstratak-RHEL8-aarch64.refleak/build/Lib/multiprocessing/resource_tracker.py:216: UserWarning: resource_tracker: There appear to be 6 leaked semaphore objects to clean up at shutdown
warnings.warn('resource_tracker: There appear to be %d '
Traceback (most recent call last):
File "/home/buildbot/buildarea/3.x.cstratak-RHEL8-aarch64.refleak/build/Lib/multiprocessing/util.py", line 300, in _run_finalizers
finalizer()
File "/home/buildbot/buildarea/3.x.cstratak-RHEL8-aarch64.refleak/build/Lib/multiprocessing/util.py", line 224, in __call__
res = self._callback(*self._args, **self._kwargs)
File "/home/buildbot/buildarea/3.x.cstratak-RHEL8-aarch64.refleak/build/Lib/multiprocessing/synchronize.py", line 87, in _cleanup
sem_unlink(name)
FileNotFoundError: [Errno 2] No such file or directory
Traceback (most recent call last):
File "/home/buildbot/buildarea/3.x.cstratak-RHEL8-aarch64.refleak/build/Lib/multiprocessing/util.py", line 300, in _run_finalizers
finalizer()
File "/home/buildbot/buildarea/3.x.cstratak-RHEL8-aarch64.refleak/build/Lib/multiprocessing/util.py", line 224, in __call__
res = self._callback(*self._args, **self._kwargs)
File "/home/buildbot/buildarea/3.x.cstratak-RHEL8-aarch64.refleak/build/Lib/multiprocessing/synchronize.py", line 87, in _cleanup
sem_unlink(name)
FileNotFoundError: [Errno 2] No such file or directory
Traceback (most recent call last):
File "/home/buildbot/buildarea/3.x.cstratak-RHEL8-aarch64.refleak/build/Lib/multiprocessing/util.py", line 300, in _run_finalizers
finalizer()
File "/home/buildbot/buildarea/3.x.cstratak-RHEL8-aarch64.refleak/build/Lib/multiprocessing/util.py", line 224, in __call__
res = self._callback(*self._args, **self._kwargs)
File "/home/buildbot/buildarea/3.x.cstratak-RHEL8-aarch64.refleak/build/Lib/multiprocessing/synchronize.py", line 87, in _cleanup
sem_unlink(name)
FileNotFoundError: [Errno 2] No such file or directory
Traceback (most recent call last):
File "/home/buildbot/buildarea/3.x.cstratak-RHEL8-aarch64.refleak/build/Lib/multiprocessing/util.py", line 300, in _run_finalizers
finalizer()
File "/home/buildbot/buildarea/3.x.cstratak-RHEL8-aarch64.refleak/build/Lib/multiprocessing/util.py", line 224, in __call__
res = self._callback(*self._args, **self._kwargs)
File "/home/buildbot/buildarea/3.x.cstratak-RHEL8-aarch64.refleak/build/Lib/multiprocessing/synchronize.py", line 87, in _cleanup
sem_unlink(name)
FileNotFoundError: [Errno 2] No such file or directory
Traceback (most recent call last):
File "/home/buildbot/buildarea/3.x.cstratak-RHEL8-aarch64.refleak/build/Lib/multiprocessing/util.py", line 300, in _run_finalizers
finalizer()
File "/home/buildbot/buildarea/3.x.cstratak-RHEL8-aarch64.refleak/build/Lib/multiprocessing/util.py", line 224, in __call__
res = self._callback(*self._args, **self._kwargs)
File "/home/buildbot/buildarea/3.x.cstratak-RHEL8-aarch64.refleak/build/Lib/multiprocessing/synchronize.py", line 87, in _cleanup
sem_unlink(name)
FileNotFoundError: [Errno 2] No such file or directory
Traceback (most recent call last):
File "/home/buildbot/buildarea/3.x.cstratak-RHEL8-aarch64.refleak/build/Lib/multiprocessing/util.py", line 300, in _run_finalizers
finalizer()
File "/home/buildbot/buildarea/3.x.cstratak-RHEL8-aarch64.refleak/build/Lib/multiprocessing/util.py", line 224, in __call__
res = self._callback(*self._args, **self._kwargs)
File "/home/buildbot/buildarea/3.x.cstratak-RHEL8-aarch64.refleak/build/Lib/multiprocessing/synchronize.py", line 87, in _cleanup
sem_unlink(name)
FileNotFoundError: [Errno 2] No such file or directory
./home/buildbot/buildarea/3.x.cstratak-RHEL8-aarch64.refleak/build/Lib/multiprocessing/resource_tracker.py:216: UserWarning: resource_tracker: There appear to be 6 leaked semaphore objects to clean up at shutdown
warnings.warn('resource_tracker: There appear to be %d '
Traceback (most recent call last):
File "/home/buildbot/buildarea/3.x.cstratak-RHEL8-aarch64.refleak/build/Lib/multiprocessing/util.py", line 300, in _run_finalizers
finalizer()
File "/home/buildbot/buildarea/3.x.cstratak-RHEL8-aarch64.refleak/build/Lib/multiprocessing/util.py", line 224, in __call__
res = self._callback(*self._args, **self._kwargs)
File "/home/buildbot/buildarea/3.x.cstratak-RHEL8-aarch64.refleak/build/Lib/multiprocessing/synchronize.py", line 87, in _cleanup
sem_unlink(name)
FileNotFoundError: [Errno 2] No such file or directory
Traceback (most recent call last):
File "/home/buildbot/buildarea/3.x.cstratak-RHEL8-aarch64.refleak/build/Lib/multiprocessing/util.py", line 300, in _run_finalizers
finalizer()
File "/home/buildbot/buildarea/3.x.cstratak-RHEL8-aarch64.refleak/build/Lib/multiprocessing/util.py", line 224, in __call__
res = self._callback(*self._args, **self._kwargs)
File "/home/buildbot/buildarea/3.x.cstratak-RHEL8-aarch64.refleak/build/Lib/multiprocessing/synchronize.py", line 87, in _cleanup
sem_unlink(name)
FileNotFoundError: [Errno 2] No such file or directory
Traceback (most recent call last):
File "/home/buildbot/buildarea/3.x.cstratak-RHEL8-aarch64.refleak/build/Lib/multiprocessing/util.py", line 300, in _run_finalizers
finalizer()
File "/home/buildbot/buildarea/3.x.cstratak-RHEL8-aarch64.refleak/build/Lib/multiprocessing/util.py", line 224, in __call__
res = self._callback(*self._args, **self._kwargs)
File "/home/buildbot/buildarea/3.x.cstratak-RHEL8-aarch64.refleak/build/Lib/multiprocessing/synchronize.py", line 87, in _cleanup
sem_unlink(name)
FileNotFoundError: [Errno 2] No such file or directory
Traceback (most recent call last):
File "/home/buildbot/buildarea/3.x.cstratak-RHEL8-aarch64.refleak/build/Lib/multiprocessing/util.py", line 300, in _run_finalizers
finalizer()
File "/home/buildbot/buildarea/3.x.cstratak-RHEL8-aarch64.refleak/build/Lib/multiprocessing/util.py", line 224, in __call__
res = self._callback(*self._args, **self._kwargs)
File "/home/buildbot/buildarea/3.x.cstratak-RHEL8-aarch64.refleak/build/Lib/multiprocessing/synchronize.py", line 87, in _cleanup
sem_unlink(name)
FileNotFoundError: [Errno 2] No such file or directory
Traceback (most recent call last):
File "/home/buildbot/buildarea/3.x.cstratak-RHEL8-aarch64.refleak/build/Lib/multiprocessing/util.py", line 300, in _run_finalizers
finalizer()
File "/home/buildbot/buildarea/3.x.cstratak-RHEL8-aarch64.refleak/build/Lib/multiprocessing/util.py", line 224, in __call__
res = self._callback(*self._args, **self._kwargs)
File "/home/buildbot/buildarea/3.x.cstratak-RHEL8-aarch64.refleak/build/Lib/multiprocessing/synchronize.py", line 87, in _cleanup
sem_unlink(name)
FileNotFoundError: [Errno 2] No such file or directory
Traceback (most recent call last):
File "/home/buildbot/buildarea/3.x.cstratak-RHEL8-aarch64.refleak/build/Lib/multiprocessing/util.py", line 300, in _run_finalizers
finalizer()
File "/home/buildbot/buildarea/3.x.cstratak-RHEL8-aarch64.refleak/build/Lib/multiprocessing/util.py", line 224, in __call__
res = self._callback(*self._args, **self._kwargs)
File "/home/buildbot/buildarea/3.x.cstratak-RHEL8-aarch64.refleak/build/Lib/multiprocessing/synchronize.py", line 87, in _cleanup
sem_unlink(name)
FileNotFoundError: [Errno 2] No such file or directory
./home/buildbot/buildarea/3.x.cstratak-RHEL8-aarch64.refleak/build/Lib/multiprocessing/resource_tracker.py:216: UserWarning: resource_tracker: There appear to be 6 leaked semaphore objects to clean up at shutdown
warnings.warn('resource_tracker: There appear to be %d '
Traceback (most recent call last):
File "/home/buildbot/buildarea/3.x.cstratak-RHEL8-aarch64.refleak/build/Lib/multiprocessing/util.py", line 300, in _run_finalizers
finalizer()
File "/home/buildbot/buildarea/3.x.cstratak-RHEL8-aarch64.refleak/build/Lib/multiprocessing/util.py", line 224, in __call__
res = self._callback(*self._args, **self._kwargs)
File "/home/buildbot/buildarea/3.x.cstratak-RHEL8-aarch64.refleak/build/Lib/multiprocessing/synchronize.py", line 87, in _cleanup
sem_unlink(name)
FileNotFoundError: [Errno 2] No such file or directory
Traceback (most recent call last):
File "/home/buildbot/buildarea/3.x.cstratak-RHEL8-aarch64.refleak/build/Lib/multiprocessing/util.py", line 300, in _run_finalizers
finalizer()
File "/home/buildbot/buildarea/3.x.cstratak-RHEL8-aarch64.refleak/build/Lib/multiprocessing/util.py", line 224, in __call__
res = self._callback(*self._args, **self._kwargs)
File "/home/buildbot/buildarea/3.x.cstratak-RHEL8-aarch64.refleak/build/Lib/multiprocessing/synchronize.py", line 87, in _cleanup
sem_unlink(name)
FileNotFoundError: [Errno 2] No such file or directory
Traceback (most recent call last):
File "/home/buildbot/buildarea/3.x.cstratak-RHEL8-aarch64.refleak/build/Lib/multiprocessing/util.py", line 300, in _run_finalizers
finalizer()
File "/home/buildbot/buildarea/3.x.cstratak-RHEL8-aarch64.refleak/build/Lib/multiprocessing/util.py", line 224, in __call__
res = self._callback(*self._args, **self._kwargs)
File "/home/buildbot/buildarea/3.x.cstratak-RHEL8-aarch64.refleak/build/Lib/multiprocessing/synchronize.py", line 87, in _cleanup
sem_unlink(name)
FileNotFoundError: [Errno 2] No such file or directory
Traceback (most recent call last):
File "/home/buildbot/buildarea/3.x.cstratak-RHEL8-aarch64.refleak/build/Lib/multiprocessing/util.py", line 300, in _run_finalizers
finalizer()
File "/home/buildbot/buildarea/3.x.cstratak-RHEL8-aarch64.refleak/build/Lib/multiprocessing/util.py", line 224, in __call__
res = self._callback(*self._args, **self._kwargs)
File "/home/buildbot/buildarea/3.x.cstratak-RHEL8-aarch64.refleak/build/Lib/multiprocessing/synchronize.py", line 87, in _cleanup
sem_unlink(name)
FileNotFoundError: [Errno 2] No such file or directory
Traceback (most recent call last):
File "/home/buildbot/buildarea/3.x.cstratak-RHEL8-aarch64.refleak/build/Lib/multiprocessing/util.py", line 300, in _run_finalizers
finalizer()
File "/home/buildbot/buildarea/3.x.cstratak-RHEL8-aarch64.refleak/build/Lib/multiprocessing/util.py", line 224, in __call__
res = self._callback(*self._args, **self._kwargs)
File "/home/buildbot/buildarea/3.x.cstratak-RHEL8-aarch64.refleak/build/Lib/multiprocessing/synchronize.py", line 87, in _cleanup
sem_unlink(name)
FileNotFoundError: [Errno 2] No such file or directory
Traceback (most recent call last):
File "/home/buildbot/buildarea/3.x.cstratak-RHEL8-aarch64.refleak/build/Lib/multiprocessing/util.py", line 300, in _run_finalizers
finalizer()
File "/home/buildbot/buildarea/3.x.cstratak-RHEL8-aarch64.refleak/build/Lib/multiprocessing/util.py", line 224, in __call__
res = self._callback(*self._args, **self._kwargs)
File "/home/buildbot/buildarea/3.x.cstratak-RHEL8-aarch64.refleak/build/Lib/multiprocessing/synchronize.py", line 87, in _cleanup
sem_unlink(name)
FileNotFoundError: [Errno 2] No such file or directory
./home/buildbot/buildarea/3.x.cstratak-RHEL8-aarch64.refleak/build/Lib/multiprocessing/resource_tracker.py:216: UserWarning: resource_tracker: There appear to be 6 leaked semaphore objects to clean up at shutdown
warnings.warn('resource_tracker: There appear to be %d '
Traceback (most recent call last):
File "/home/buildbot/buildarea/3.x.cstratak-RHEL8-aarch64.refleak/build/Lib/multiprocessing/util.py", line 300, in _run_finalizers
finalizer()
File "/home/buildbot/buildarea/3.x.cstratak-RHEL8-aarch64.refleak/build/Lib/multiprocessing/util.py", line 224, in __call__
res = self._callback(*self._args, **self._kwargs)
File "/home/buildbot/buildarea/3.x.cstratak-RHEL8-aarch64.refleak/build/Lib/multiprocessing/synchronize.py", line 87, in _cleanup
sem_unlink(name)
FileNotFoundError: [Errno 2] No such file or directory
Traceback (most recent call last):
File "/home/buildbot/buildarea/3.x.cstratak-RHEL8-aarch64.refleak/build/Lib/multiprocessing/util.py", line 300, in _run_finalizers
finalizer()
File "/home/buildbot/buildarea/3.x.cstratak-RHEL8-aarch64.refleak/build/Lib/multiprocessing/util.py", line 224, in __call__
res = self._callback(*self._args, **self._kwargs)
File "/home/buildbot/buildarea/3.x.cstratak-RHEL8-aarch64.refleak/build/Lib/multiprocessing/synchronize.py", line 87, in _cleanup
sem_unlink(name)
FileNotFoundError: [Errno 2] No such file or directory
Traceback (most recent call last):
File "/home/buildbot/buildarea/3.x.cstratak-RHEL8-aarch64.refleak/build/Lib/multiprocessing/util.py", line 300, in _run_finalizers
finalizer()
File "/home/buildbot/buildarea/3.x.cstratak-RHEL8-aarch64.refleak/build/Lib/multiprocessing/util.py", line 224, in __call__
res = self._callback(*self._args, **self._kwargs)
File "/home/buildbot/buildarea/3.x.cstratak-RHEL8-aarch64.refleak/build/Lib/multiprocessing/synchronize.py", line 87, in _cleanup
sem_unlink(name)
FileNotFoundError: [Errno 2] No such file or directory
Traceback (most recent call last):
File "/home/buildbot/buildarea/3.x.cstratak-RHEL8-aarch64.refleak/build/Lib/multiprocessing/util.py", line 300, in _run_finalizers
finalizer()
File "/home/buildbot/buildarea/3.x.cstratak-RHEL8-aarch64.refleak/build/Lib/multiprocessing/util.py", line 224, in __call__
res = self._callback(*self._args, **self._kwargs)
File "/home/buildbot/buildarea/3.x.cstratak-RHEL8-aarch64.refleak/build/Lib/multiprocessing/synchronize.py", line 87, in _cleanup
sem_unlink(name)
FileNotFoundError: [Errno 2] No such file or directory
Traceback (most recent call last):
File "/home/buildbot/buildarea/3.x.cstratak-RHEL8-aarch64.refleak/build/Lib/multiprocessing/util.py", line 300, in _run_finalizers
finalizer()
File "/home/buildbot/buildarea/3.x.cstratak-RHEL8-aarch64.refleak/build/Lib/multiprocessing/util.py", line 224, in __call__
res = self._callback(*self._args, **self._kwargs)
File "/home/buildbot/buildarea/3.x.cstratak-RHEL8-aarch64.refleak/build/Lib/multiprocessing/synchronize.py", line 87, in _cleanup
sem_unlink(name)
FileNotFoundError: [Errno 2] No such file or directory
Traceback (most recent call last):
File "/home/buildbot/buildarea/3.x.cstratak-RHEL8-aarch64.refleak/build/Lib/multiprocessing/util.py", line 300, in _run_finalizers
finalizer()
File "/home/buildbot/buildarea/3.x.cstratak-RHEL8-aarch64.refleak/build/Lib/multiprocessing/util.py", line 224, in __call__
res = self._callback(*self._args, **self._kwargs)
File "/home/buildbot/buildarea/3.x.cstratak-RHEL8-aarch64.refleak/build/Lib/multiprocessing/synchronize.py", line 87, in _cleanup
sem_unlink(name)
FileNotFoundError: [Errno 2] No such file or directory
.
Test report
===========
Failed tests:
- test_socketserver
- test_logging
Test leaking resources:
- test_logging: references
- test_socketserver: references
- test_logging: memory blocks
- test_socketserver: memory blocks
Sincerely,
-The Buildbot
1
0
Nov. 2, 2020
The Buildbot has detected a new failure on builder aarch64 RHEL7 Refleaks 3.x while building Python.
Full details are available at:
https://buildbot.python.org/all/#builders/131/builds/88
Buildbot URL: https://buildbot.python.org/all/
Worker for this Build: cstratak-RHEL7-aarch64
Build Reason: <unknown>
Blamelist:
BUILD FAILED: failed test (failure)
Summary of the results of the build (if available):
===================================================
== Tests result: FAILURE then FAILURE ==
408 tests OK.
10 slowest tests:
- test_asyncio: 54 min 32 sec
- test_signal: 31 min 10 sec
- test_pydoc: 29 min 59 sec
- test_concurrent_futures: 21 min 17 sec
- test_peg_generator: 14 min 58 sec
- test_multiprocessing_spawn: 14 min 16 sec
- test_multiprocessing_forkserver: 8 min 54 sec
- test_lib2to3: 8 min 16 sec
- test_nntplib: 8 min 6 sec
- test_multiprocessing_fork: 6 min 45 sec
2 tests failed:
test_logging test_socketserver
14 tests skipped:
test_devpoll test_gdb test_ioctl test_kqueue test_msilib
test_ossaudiodev test_startfile test_tix test_tk test_ttk_guionly
test_winconsoleio test_winreg test_winsound test_zipfile64
2 re-run tests:
test_logging test_socketserver
Total duration: 1 hour 8 min
Captured traceback
==================
Traceback (most recent call last):
File "/home/buildbot/buildarea/3.x.cstratak-RHEL7-aarch64.refleak/build/Lib/multiprocessing/util.py", line 300, in _run_finalizers
finalizer()
File "/home/buildbot/buildarea/3.x.cstratak-RHEL7-aarch64.refleak/build/Lib/multiprocessing/util.py", line 224, in __call__
res = self._callback(*self._args, **self._kwargs)
File "/home/buildbot/buildarea/3.x.cstratak-RHEL7-aarch64.refleak/build/Lib/multiprocessing/synchronize.py", line 87, in _cleanup
sem_unlink(name)
FileNotFoundError: [Errno 2] No such file or directory
Traceback (most recent call last):
File "/home/buildbot/buildarea/3.x.cstratak-RHEL7-aarch64.refleak/build/Lib/multiprocessing/util.py", line 300, in _run_finalizers
finalizer()
File "/home/buildbot/buildarea/3.x.cstratak-RHEL7-aarch64.refleak/build/Lib/multiprocessing/util.py", line 224, in __call__
res = self._callback(*self._args, **self._kwargs)
File "/home/buildbot/buildarea/3.x.cstratak-RHEL7-aarch64.refleak/build/Lib/multiprocessing/synchronize.py", line 87, in _cleanup
sem_unlink(name)
FileNotFoundError: [Errno 2] No such file or directory
Traceback (most recent call last):
File "/home/buildbot/buildarea/3.x.cstratak-RHEL7-aarch64.refleak/build/Lib/multiprocessing/util.py", line 300, in _run_finalizers
finalizer()
File "/home/buildbot/buildarea/3.x.cstratak-RHEL7-aarch64.refleak/build/Lib/multiprocessing/util.py", line 224, in __call__
res = self._callback(*self._args, **self._kwargs)
File "/home/buildbot/buildarea/3.x.cstratak-RHEL7-aarch64.refleak/build/Lib/multiprocessing/synchronize.py", line 87, in _cleanup
sem_unlink(name)
FileNotFoundError: [Errno 2] No such file or directory
Traceback (most recent call last):
File "/home/buildbot/buildarea/3.x.cstratak-RHEL7-aarch64.refleak/build/Lib/multiprocessing/util.py", line 300, in _run_finalizers
finalizer()
File "/home/buildbot/buildarea/3.x.cstratak-RHEL7-aarch64.refleak/build/Lib/multiprocessing/util.py", line 224, in __call__
res = self._callback(*self._args, **self._kwargs)
File "/home/buildbot/buildarea/3.x.cstratak-RHEL7-aarch64.refleak/build/Lib/multiprocessing/synchronize.py", line 87, in _cleanup
sem_unlink(name)
FileNotFoundError: [Errno 2] No such file or directory
Traceback (most recent call last):
File "/home/buildbot/buildarea/3.x.cstratak-RHEL7-aarch64.refleak/build/Lib/multiprocessing/util.py", line 300, in _run_finalizers
finalizer()
File "/home/buildbot/buildarea/3.x.cstratak-RHEL7-aarch64.refleak/build/Lib/multiprocessing/util.py", line 224, in __call__
res = self._callback(*self._args, **self._kwargs)
File "/home/buildbot/buildarea/3.x.cstratak-RHEL7-aarch64.refleak/build/Lib/multiprocessing/synchronize.py", line 87, in _cleanup
sem_unlink(name)
FileNotFoundError: [Errno 2] No such file or directory
Traceback (most recent call last):
File "/home/buildbot/buildarea/3.x.cstratak-RHEL7-aarch64.refleak/build/Lib/multiprocessing/util.py", line 300, in _run_finalizers
finalizer()
File "/home/buildbot/buildarea/3.x.cstratak-RHEL7-aarch64.refleak/build/Lib/multiprocessing/util.py", line 224, in __call__
res = self._callback(*self._args, **self._kwargs)
File "/home/buildbot/buildarea/3.x.cstratak-RHEL7-aarch64.refleak/build/Lib/multiprocessing/synchronize.py", line 87, in _cleanup
sem_unlink(name)
FileNotFoundError: [Errno 2] No such file or directory
./home/buildbot/buildarea/3.x.cstratak-RHEL7-aarch64.refleak/build/Lib/multiprocessing/resource_tracker.py:216: UserWarning: resource_tracker: There appear to be 6 leaked semaphore objects to clean up at shutdown
warnings.warn('resource_tracker: There appear to be %d '
Traceback (most recent call last):
File "/home/buildbot/buildarea/3.x.cstratak-RHEL7-aarch64.refleak/build/Lib/multiprocessing/util.py", line 300, in _run_finalizers
finalizer()
File "/home/buildbot/buildarea/3.x.cstratak-RHEL7-aarch64.refleak/build/Lib/multiprocessing/util.py", line 224, in __call__
res = self._callback(*self._args, **self._kwargs)
File "/home/buildbot/buildarea/3.x.cstratak-RHEL7-aarch64.refleak/build/Lib/multiprocessing/synchronize.py", line 87, in _cleanup
sem_unlink(name)
FileNotFoundError: [Errno 2] No such file or directory
Traceback (most recent call last):
File "/home/buildbot/buildarea/3.x.cstratak-RHEL7-aarch64.refleak/build/Lib/multiprocessing/util.py", line 300, in _run_finalizers
finalizer()
File "/home/buildbot/buildarea/3.x.cstratak-RHEL7-aarch64.refleak/build/Lib/multiprocessing/util.py", line 224, in __call__
res = self._callback(*self._args, **self._kwargs)
File "/home/buildbot/buildarea/3.x.cstratak-RHEL7-aarch64.refleak/build/Lib/multiprocessing/synchronize.py", line 87, in _cleanup
sem_unlink(name)
FileNotFoundError: [Errno 2] No such file or directory
Traceback (most recent call last):
File "/home/buildbot/buildarea/3.x.cstratak-RHEL7-aarch64.refleak/build/Lib/multiprocessing/util.py", line 300, in _run_finalizers
finalizer()
File "/home/buildbot/buildarea/3.x.cstratak-RHEL7-aarch64.refleak/build/Lib/multiprocessing/util.py", line 224, in __call__
res = self._callback(*self._args, **self._kwargs)
File "/home/buildbot/buildarea/3.x.cstratak-RHEL7-aarch64.refleak/build/Lib/multiprocessing/synchronize.py", line 87, in _cleanup
sem_unlink(name)
FileNotFoundError: [Errno 2] No such file or directory
Traceback (most recent call last):
File "/home/buildbot/buildarea/3.x.cstratak-RHEL7-aarch64.refleak/build/Lib/multiprocessing/util.py", line 300, in _run_finalizers
finalizer()
File "/home/buildbot/buildarea/3.x.cstratak-RHEL7-aarch64.refleak/build/Lib/multiprocessing/util.py", line 224, in __call__
res = self._callback(*self._args, **self._kwargs)
File "/home/buildbot/buildarea/3.x.cstratak-RHEL7-aarch64.refleak/build/Lib/multiprocessing/synchronize.py", line 87, in _cleanup
sem_unlink(name)
FileNotFoundError: [Errno 2] No such file or directory
Traceback (most recent call last):
File "/home/buildbot/buildarea/3.x.cstratak-RHEL7-aarch64.refleak/build/Lib/multiprocessing/util.py", line 300, in _run_finalizers
finalizer()
File "/home/buildbot/buildarea/3.x.cstratak-RHEL7-aarch64.refleak/build/Lib/multiprocessing/util.py", line 224, in __call__
res = self._callback(*self._args, **self._kwargs)
File "/home/buildbot/buildarea/3.x.cstratak-RHEL7-aarch64.refleak/build/Lib/multiprocessing/synchronize.py", line 87, in _cleanup
sem_unlink(name)
FileNotFoundError: [Errno 2] No such file or directory
Traceback (most recent call last):
File "/home/buildbot/buildarea/3.x.cstratak-RHEL7-aarch64.refleak/build/Lib/multiprocessing/util.py", line 300, in _run_finalizers
finalizer()
File "/home/buildbot/buildarea/3.x.cstratak-RHEL7-aarch64.refleak/build/Lib/multiprocessing/util.py", line 224, in __call__
res = self._callback(*self._args, **self._kwargs)
File "/home/buildbot/buildarea/3.x.cstratak-RHEL7-aarch64.refleak/build/Lib/multiprocessing/synchronize.py", line 87, in _cleanup
sem_unlink(name)
FileNotFoundError: [Errno 2] No such file or directory
./home/buildbot/buildarea/3.x.cstratak-RHEL7-aarch64.refleak/build/Lib/multiprocessing/resource_tracker.py:216: UserWarning: resource_tracker: There appear to be 6 leaked semaphore objects to clean up at shutdown
warnings.warn('resource_tracker: There appear to be %d '
Traceback (most recent call last):
File "/home/buildbot/buildarea/3.x.cstratak-RHEL7-aarch64.refleak/build/Lib/multiprocessing/util.py", line 300, in _run_finalizers
finalizer()
File "/home/buildbot/buildarea/3.x.cstratak-RHEL7-aarch64.refleak/build/Lib/multiprocessing/util.py", line 224, in __call__
res = self._callback(*self._args, **self._kwargs)
File "/home/buildbot/buildarea/3.x.cstratak-RHEL7-aarch64.refleak/build/Lib/multiprocessing/synchronize.py", line 87, in _cleanup
sem_unlink(name)
FileNotFoundError: [Errno 2] No such file or directory
Traceback (most recent call last):
File "/home/buildbot/buildarea/3.x.cstratak-RHEL7-aarch64.refleak/build/Lib/multiprocessing/util.py", line 300, in _run_finalizers
finalizer()
File "/home/buildbot/buildarea/3.x.cstratak-RHEL7-aarch64.refleak/build/Lib/multiprocessing/util.py", line 224, in __call__
res = self._callback(*self._args, **self._kwargs)
File "/home/buildbot/buildarea/3.x.cstratak-RHEL7-aarch64.refleak/build/Lib/multiprocessing/synchronize.py", line 87, in _cleanup
sem_unlink(name)
FileNotFoundError: [Errno 2] No such file or directory
Traceback (most recent call last):
File "/home/buildbot/buildarea/3.x.cstratak-RHEL7-aarch64.refleak/build/Lib/multiprocessing/util.py", line 300, in _run_finalizers
finalizer()
File "/home/buildbot/buildarea/3.x.cstratak-RHEL7-aarch64.refleak/build/Lib/multiprocessing/util.py", line 224, in __call__
res = self._callback(*self._args, **self._kwargs)
File "/home/buildbot/buildarea/3.x.cstratak-RHEL7-aarch64.refleak/build/Lib/multiprocessing/synchronize.py", line 87, in _cleanup
sem_unlink(name)
FileNotFoundError: [Errno 2] No such file or directory
Traceback (most recent call last):
File "/home/buildbot/buildarea/3.x.cstratak-RHEL7-aarch64.refleak/build/Lib/multiprocessing/util.py", line 300, in _run_finalizers
finalizer()
File "/home/buildbot/buildarea/3.x.cstratak-RHEL7-aarch64.refleak/build/Lib/multiprocessing/util.py", line 224, in __call__
res = self._callback(*self._args, **self._kwargs)
File "/home/buildbot/buildarea/3.x.cstratak-RHEL7-aarch64.refleak/build/Lib/multiprocessing/synchronize.py", line 87, in _cleanup
sem_unlink(name)
FileNotFoundError: [Errno 2] No such file or directory
Traceback (most recent call last):
File "/home/buildbot/buildarea/3.x.cstratak-RHEL7-aarch64.refleak/build/Lib/multiprocessing/util.py", line 300, in _run_finalizers
finalizer()
File "/home/buildbot/buildarea/3.x.cstratak-RHEL7-aarch64.refleak/build/Lib/multiprocessing/util.py", line 224, in __call__
res = self._callback(*self._args, **self._kwargs)
File "/home/buildbot/buildarea/3.x.cstratak-RHEL7-aarch64.refleak/build/Lib/multiprocessing/synchronize.py", line 87, in _cleanup
sem_unlink(name)
FileNotFoundError: [Errno 2] No such file or directory
Traceback (most recent call last):
File "/home/buildbot/buildarea/3.x.cstratak-RHEL7-aarch64.refleak/build/Lib/multiprocessing/util.py", line 300, in _run_finalizers
finalizer()
File "/home/buildbot/buildarea/3.x.cstratak-RHEL7-aarch64.refleak/build/Lib/multiprocessing/util.py", line 224, in __call__
res = self._callback(*self._args, **self._kwargs)
File "/home/buildbot/buildarea/3.x.cstratak-RHEL7-aarch64.refleak/build/Lib/multiprocessing/synchronize.py", line 87, in _cleanup
sem_unlink(name)
FileNotFoundError: [Errno 2] No such file or directory
./home/buildbot/buildarea/3.x.cstratak-RHEL7-aarch64.refleak/build/Lib/multiprocessing/resource_tracker.py:216: UserWarning: resource_tracker: There appear to be 6 leaked semaphore objects to clean up at shutdown
warnings.warn('resource_tracker: There appear to be %d '
Traceback (most recent call last):
File "/home/buildbot/buildarea/3.x.cstratak-RHEL7-aarch64.refleak/build/Lib/multiprocessing/util.py", line 300, in _run_finalizers
finalizer()
File "/home/buildbot/buildarea/3.x.cstratak-RHEL7-aarch64.refleak/build/Lib/multiprocessing/util.py", line 224, in __call__
res = self._callback(*self._args, **self._kwargs)
File "/home/buildbot/buildarea/3.x.cstratak-RHEL7-aarch64.refleak/build/Lib/multiprocessing/synchronize.py", line 87, in _cleanup
sem_unlink(name)
FileNotFoundError: [Errno 2] No such file or directory
Traceback (most recent call last):
File "/home/buildbot/buildarea/3.x.cstratak-RHEL7-aarch64.refleak/build/Lib/multiprocessing/util.py", line 300, in _run_finalizers
finalizer()
File "/home/buildbot/buildarea/3.x.cstratak-RHEL7-aarch64.refleak/build/Lib/multiprocessing/util.py", line 224, in __call__
res = self._callback(*self._args, **self._kwargs)
File "/home/buildbot/buildarea/3.x.cstratak-RHEL7-aarch64.refleak/build/Lib/multiprocessing/synchronize.py", line 87, in _cleanup
sem_unlink(name)
FileNotFoundError: [Errno 2] No such file or directory
Traceback (most recent call last):
File "/home/buildbot/buildarea/3.x.cstratak-RHEL7-aarch64.refleak/build/Lib/multiprocessing/util.py", line 300, in _run_finalizers
finalizer()
File "/home/buildbot/buildarea/3.x.cstratak-RHEL7-aarch64.refleak/build/Lib/multiprocessing/util.py", line 224, in __call__
res = self._callback(*self._args, **self._kwargs)
File "/home/buildbot/buildarea/3.x.cstratak-RHEL7-aarch64.refleak/build/Lib/multiprocessing/synchronize.py", line 87, in _cleanup
sem_unlink(name)
FileNotFoundError: [Errno 2] No such file or directory
Traceback (most recent call last):
File "/home/buildbot/buildarea/3.x.cstratak-RHEL7-aarch64.refleak/build/Lib/multiprocessing/util.py", line 300, in _run_finalizers
finalizer()
File "/home/buildbot/buildarea/3.x.cstratak-RHEL7-aarch64.refleak/build/Lib/multiprocessing/util.py", line 224, in __call__
res = self._callback(*self._args, **self._kwargs)
File "/home/buildbot/buildarea/3.x.cstratak-RHEL7-aarch64.refleak/build/Lib/multiprocessing/synchronize.py", line 87, in _cleanup
sem_unlink(name)
FileNotFoundError: [Errno 2] No such file or directory
Traceback (most recent call last):
File "/home/buildbot/buildarea/3.x.cstratak-RHEL7-aarch64.refleak/build/Lib/multiprocessing/util.py", line 300, in _run_finalizers
finalizer()
File "/home/buildbot/buildarea/3.x.cstratak-RHEL7-aarch64.refleak/build/Lib/multiprocessing/util.py", line 224, in __call__
res = self._callback(*self._args, **self._kwargs)
File "/home/buildbot/buildarea/3.x.cstratak-RHEL7-aarch64.refleak/build/Lib/multiprocessing/synchronize.py", line 87, in _cleanup
sem_unlink(name)
FileNotFoundError: [Errno 2] No such file or directory
Traceback (most recent call last):
File "/home/buildbot/buildarea/3.x.cstratak-RHEL7-aarch64.refleak/build/Lib/multiprocessing/util.py", line 300, in _run_finalizers
finalizer()
File "/home/buildbot/buildarea/3.x.cstratak-RHEL7-aarch64.refleak/build/Lib/multiprocessing/util.py", line 224, in __call__
res = self._callback(*self._args, **self._kwargs)
File "/home/buildbot/buildarea/3.x.cstratak-RHEL7-aarch64.refleak/build/Lib/multiprocessing/synchronize.py", line 87, in _cleanup
sem_unlink(name)
FileNotFoundError: [Errno 2] No such file or directory
./home/buildbot/buildarea/3.x.cstratak-RHEL7-aarch64.refleak/build/Lib/multiprocessing/resource_tracker.py:216: UserWarning: resource_tracker: There appear to be 6 leaked semaphore objects to clean up at shutdown
warnings.warn('resource_tracker: There appear to be %d '
Traceback (most recent call last):
File "/home/buildbot/buildarea/3.x.cstratak-RHEL7-aarch64.refleak/build/Lib/multiprocessing/util.py", line 300, in _run_finalizers
finalizer()
File "/home/buildbot/buildarea/3.x.cstratak-RHEL7-aarch64.refleak/build/Lib/multiprocessing/util.py", line 224, in __call__
res = self._callback(*self._args, **self._kwargs)
File "/home/buildbot/buildarea/3.x.cstratak-RHEL7-aarch64.refleak/build/Lib/multiprocessing/synchronize.py", line 87, in _cleanup
sem_unlink(name)
FileNotFoundError: [Errno 2] No such file or directory
Traceback (most recent call last):
File "/home/buildbot/buildarea/3.x.cstratak-RHEL7-aarch64.refleak/build/Lib/multiprocessing/util.py", line 300, in _run_finalizers
finalizer()
File "/home/buildbot/buildarea/3.x.cstratak-RHEL7-aarch64.refleak/build/Lib/multiprocessing/util.py", line 224, in __call__
res = self._callback(*self._args, **self._kwargs)
File "/home/buildbot/buildarea/3.x.cstratak-RHEL7-aarch64.refleak/build/Lib/multiprocessing/synchronize.py", line 87, in _cleanup
sem_unlink(name)
FileNotFoundError: [Errno 2] No such file or directory
Traceback (most recent call last):
File "/home/buildbot/buildarea/3.x.cstratak-RHEL7-aarch64.refleak/build/Lib/multiprocessing/util.py", line 300, in _run_finalizers
finalizer()
File "/home/buildbot/buildarea/3.x.cstratak-RHEL7-aarch64.refleak/build/Lib/multiprocessing/util.py", line 224, in __call__
res = self._callback(*self._args, **self._kwargs)
File "/home/buildbot/buildarea/3.x.cstratak-RHEL7-aarch64.refleak/build/Lib/multiprocessing/synchronize.py", line 87, in _cleanup
sem_unlink(name)
FileNotFoundError: [Errno 2] No such file or directory
Traceback (most recent call last):
File "/home/buildbot/buildarea/3.x.cstratak-RHEL7-aarch64.refleak/build/Lib/multiprocessing/util.py", line 300, in _run_finalizers
finalizer()
File "/home/buildbot/buildarea/3.x.cstratak-RHEL7-aarch64.refleak/build/Lib/multiprocessing/util.py", line 224, in __call__
res = self._callback(*self._args, **self._kwargs)
File "/home/buildbot/buildarea/3.x.cstratak-RHEL7-aarch64.refleak/build/Lib/multiprocessing/synchronize.py", line 87, in _cleanup
sem_unlink(name)
FileNotFoundError: [Errno 2] No such file or directory
Traceback (most recent call last):
File "/home/buildbot/buildarea/3.x.cstratak-RHEL7-aarch64.refleak/build/Lib/multiprocessing/util.py", line 300, in _run_finalizers
finalizer()
File "/home/buildbot/buildarea/3.x.cstratak-RHEL7-aarch64.refleak/build/Lib/multiprocessing/util.py", line 224, in __call__
res = self._callback(*self._args, **self._kwargs)
File "/home/buildbot/buildarea/3.x.cstratak-RHEL7-aarch64.refleak/build/Lib/multiprocessing/synchronize.py", line 87, in _cleanup
sem_unlink(name)
FileNotFoundError: [Errno 2] No such file or directory
Traceback (most recent call last):
File "/home/buildbot/buildarea/3.x.cstratak-RHEL7-aarch64.refleak/build/Lib/multiprocessing/util.py", line 300, in _run_finalizers
finalizer()
File "/home/buildbot/buildarea/3.x.cstratak-RHEL7-aarch64.refleak/build/Lib/multiprocessing/util.py", line 224, in __call__
res = self._callback(*self._args, **self._kwargs)
File "/home/buildbot/buildarea/3.x.cstratak-RHEL7-aarch64.refleak/build/Lib/multiprocessing/synchronize.py", line 87, in _cleanup
sem_unlink(name)
FileNotFoundError: [Errno 2] No such file or directory
./home/buildbot/buildarea/3.x.cstratak-RHEL7-aarch64.refleak/build/Lib/multiprocessing/resource_tracker.py:216: UserWarning: resource_tracker: There appear to be 6 leaked semaphore objects to clean up at shutdown
warnings.warn('resource_tracker: There appear to be %d '
Traceback (most recent call last):
File "/home/buildbot/buildarea/3.x.cstratak-RHEL7-aarch64.refleak/build/Lib/multiprocessing/util.py", line 300, in _run_finalizers
finalizer()
File "/home/buildbot/buildarea/3.x.cstratak-RHEL7-aarch64.refleak/build/Lib/multiprocessing/util.py", line 224, in __call__
res = self._callback(*self._args, **self._kwargs)
File "/home/buildbot/buildarea/3.x.cstratak-RHEL7-aarch64.refleak/build/Lib/multiprocessing/synchronize.py", line 87, in _cleanup
sem_unlink(name)
FileNotFoundError: [Errno 2] No such file or directory
Traceback (most recent call last):
File "/home/buildbot/buildarea/3.x.cstratak-RHEL7-aarch64.refleak/build/Lib/multiprocessing/util.py", line 300, in _run_finalizers
finalizer()
File "/home/buildbot/buildarea/3.x.cstratak-RHEL7-aarch64.refleak/build/Lib/multiprocessing/util.py", line 224, in __call__
res = self._callback(*self._args, **self._kwargs)
File "/home/buildbot/buildarea/3.x.cstratak-RHEL7-aarch64.refleak/build/Lib/multiprocessing/synchronize.py", line 87, in _cleanup
sem_unlink(name)
FileNotFoundError: [Errno 2] No such file or directory
Traceback (most recent call last):
File "/home/buildbot/buildarea/3.x.cstratak-RHEL7-aarch64.refleak/build/Lib/multiprocessing/util.py", line 300, in _run_finalizers
finalizer()
File "/home/buildbot/buildarea/3.x.cstratak-RHEL7-aarch64.refleak/build/Lib/multiprocessing/util.py", line 224, in __call__
res = self._callback(*self._args, **self._kwargs)
File "/home/buildbot/buildarea/3.x.cstratak-RHEL7-aarch64.refleak/build/Lib/multiprocessing/synchronize.py", line 87, in _cleanup
sem_unlink(name)
FileNotFoundError: [Errno 2] No such file or directory
Traceback (most recent call last):
File "/home/buildbot/buildarea/3.x.cstratak-RHEL7-aarch64.refleak/build/Lib/multiprocessing/util.py", line 300, in _run_finalizers
finalizer()
File "/home/buildbot/buildarea/3.x.cstratak-RHEL7-aarch64.refleak/build/Lib/multiprocessing/util.py", line 224, in __call__
res = self._callback(*self._args, **self._kwargs)
File "/home/buildbot/buildarea/3.x.cstratak-RHEL7-aarch64.refleak/build/Lib/multiprocessing/synchronize.py", line 87, in _cleanup
sem_unlink(name)
FileNotFoundError: [Errno 2] No such file or directory
Traceback (most recent call last):
File "/home/buildbot/buildarea/3.x.cstratak-RHEL7-aarch64.refleak/build/Lib/multiprocessing/util.py", line 300, in _run_finalizers
finalizer()
File "/home/buildbot/buildarea/3.x.cstratak-RHEL7-aarch64.refleak/build/Lib/multiprocessing/util.py", line 224, in __call__
res = self._callback(*self._args, **self._kwargs)
File "/home/buildbot/buildarea/3.x.cstratak-RHEL7-aarch64.refleak/build/Lib/multiprocessing/synchronize.py", line 87, in _cleanup
sem_unlink(name)
FileNotFoundError: [Errno 2] No such file or directory
Traceback (most recent call last):
File "/home/buildbot/buildarea/3.x.cstratak-RHEL7-aarch64.refleak/build/Lib/multiprocessing/util.py", line 300, in _run_finalizers
finalizer()
File "/home/buildbot/buildarea/3.x.cstratak-RHEL7-aarch64.refleak/build/Lib/multiprocessing/util.py", line 224, in __call__
res = self._callback(*self._args, **self._kwargs)
File "/home/buildbot/buildarea/3.x.cstratak-RHEL7-aarch64.refleak/build/Lib/multiprocessing/synchronize.py", line 87, in _cleanup
sem_unlink(name)
FileNotFoundError: [Errno 2] No such file or directory
.
Test report
===========
Failed tests:
- test_socketserver
- test_logging
Test leaking resources:
- test_logging: references
- test_socketserver: references
- test_logging: memory blocks
- test_socketserver: memory blocks
Sincerely,
-The Buildbot
1
0
Nov. 2, 2020
The Buildbot has detected a new failure on builder AMD64 RHEL8 Refleaks 3.x while building Python.
Full details are available at:
https://buildbot.python.org/all/#builders/259/builds/72
Buildbot URL: https://buildbot.python.org/all/
Worker for this Build: cstratak-RHEL8-x86_64
Build Reason: <unknown>
Blamelist:
BUILD FAILED: failed test (failure)
Summary of the results of the build (if available):
===================================================
== Tests result: FAILURE then FAILURE ==
409 tests OK.
10 slowest tests:
- test_asyncio: 36 min 34 sec
- test_signal: 31 min 1 sec
- test_pydoc: 30 min 1 sec
- test_concurrent_futures: 19 min 5 sec
- test_peg_generator: 10 min 46 sec
- test_multiprocessing_spawn: 10 min 27 sec
- test_gdb: 10 min 6 sec
- test_mailbox: 10 min 5 sec
- test_zipfile: 8 min 19 sec
- test_multiprocessing_forkserver: 7 min 29 sec
2 tests failed:
test_logging test_socketserver
13 tests skipped:
test_devpoll test_ioctl test_kqueue test_msilib test_ossaudiodev
test_startfile test_tix test_tk test_ttk_guionly test_winconsoleio
test_winreg test_winsound test_zipfile64
2 re-run tests:
test_logging test_socketserver
Total duration: 46 min 10 sec
Captured traceback
==================
Traceback (most recent call last):
File "/home/buildbot/buildarea/3.x.cstratak-RHEL8-x86_64.refleak/build/Lib/multiprocessing/util.py", line 300, in _run_finalizers
finalizer()
File "/home/buildbot/buildarea/3.x.cstratak-RHEL8-x86_64.refleak/build/Lib/multiprocessing/util.py", line 224, in __call__
res = self._callback(*self._args, **self._kwargs)
File "/home/buildbot/buildarea/3.x.cstratak-RHEL8-x86_64.refleak/build/Lib/multiprocessing/synchronize.py", line 87, in _cleanup
sem_unlink(name)
FileNotFoundError: [Errno 2] No such file or directory
Traceback (most recent call last):
File "/home/buildbot/buildarea/3.x.cstratak-RHEL8-x86_64.refleak/build/Lib/multiprocessing/util.py", line 300, in _run_finalizers
finalizer()
File "/home/buildbot/buildarea/3.x.cstratak-RHEL8-x86_64.refleak/build/Lib/multiprocessing/util.py", line 224, in __call__
res = self._callback(*self._args, **self._kwargs)
File "/home/buildbot/buildarea/3.x.cstratak-RHEL8-x86_64.refleak/build/Lib/multiprocessing/synchronize.py", line 87, in _cleanup
sem_unlink(name)
FileNotFoundError: [Errno 2] No such file or directory
Traceback (most recent call last):
File "/home/buildbot/buildarea/3.x.cstratak-RHEL8-x86_64.refleak/build/Lib/multiprocessing/util.py", line 300, in _run_finalizers
finalizer()
File "/home/buildbot/buildarea/3.x.cstratak-RHEL8-x86_64.refleak/build/Lib/multiprocessing/util.py", line 224, in __call__
res = self._callback(*self._args, **self._kwargs)
File "/home/buildbot/buildarea/3.x.cstratak-RHEL8-x86_64.refleak/build/Lib/multiprocessing/synchronize.py", line 87, in _cleanup
sem_unlink(name)
FileNotFoundError: [Errno 2] No such file or directory
Traceback (most recent call last):
File "/home/buildbot/buildarea/3.x.cstratak-RHEL8-x86_64.refleak/build/Lib/multiprocessing/util.py", line 300, in _run_finalizers
finalizer()
File "/home/buildbot/buildarea/3.x.cstratak-RHEL8-x86_64.refleak/build/Lib/multiprocessing/util.py", line 224, in __call__
res = self._callback(*self._args, **self._kwargs)
File "/home/buildbot/buildarea/3.x.cstratak-RHEL8-x86_64.refleak/build/Lib/multiprocessing/synchronize.py", line 87, in _cleanup
sem_unlink(name)
FileNotFoundError: [Errno 2] No such file or directory
Traceback (most recent call last):
File "/home/buildbot/buildarea/3.x.cstratak-RHEL8-x86_64.refleak/build/Lib/multiprocessing/util.py", line 300, in _run_finalizers
finalizer()
File "/home/buildbot/buildarea/3.x.cstratak-RHEL8-x86_64.refleak/build/Lib/multiprocessing/util.py", line 224, in __call__
res = self._callback(*self._args, **self._kwargs)
File "/home/buildbot/buildarea/3.x.cstratak-RHEL8-x86_64.refleak/build/Lib/multiprocessing/synchronize.py", line 87, in _cleanup
sem_unlink(name)
FileNotFoundError: [Errno 2] No such file or directory
Traceback (most recent call last):
File "/home/buildbot/buildarea/3.x.cstratak-RHEL8-x86_64.refleak/build/Lib/multiprocessing/util.py", line 300, in _run_finalizers
finalizer()
File "/home/buildbot/buildarea/3.x.cstratak-RHEL8-x86_64.refleak/build/Lib/multiprocessing/util.py", line 224, in __call__
res = self._callback(*self._args, **self._kwargs)
File "/home/buildbot/buildarea/3.x.cstratak-RHEL8-x86_64.refleak/build/Lib/multiprocessing/synchronize.py", line 87, in _cleanup
sem_unlink(name)
FileNotFoundError: [Errno 2] No such file or directory
./home/buildbot/buildarea/3.x.cstratak-RHEL8-x86_64.refleak/build/Lib/multiprocessing/resource_tracker.py:216: UserWarning: resource_tracker: There appear to be 6 leaked semaphore objects to clean up at shutdown
warnings.warn('resource_tracker: There appear to be %d '
Traceback (most recent call last):
File "/home/buildbot/buildarea/3.x.cstratak-RHEL8-x86_64.refleak/build/Lib/multiprocessing/util.py", line 300, in _run_finalizers
finalizer()
File "/home/buildbot/buildarea/3.x.cstratak-RHEL8-x86_64.refleak/build/Lib/multiprocessing/util.py", line 224, in __call__
res = self._callback(*self._args, **self._kwargs)
File "/home/buildbot/buildarea/3.x.cstratak-RHEL8-x86_64.refleak/build/Lib/multiprocessing/synchronize.py", line 87, in _cleanup
sem_unlink(name)
FileNotFoundError: [Errno 2] No such file or directory
Traceback (most recent call last):
File "/home/buildbot/buildarea/3.x.cstratak-RHEL8-x86_64.refleak/build/Lib/multiprocessing/util.py", line 300, in _run_finalizers
finalizer()
File "/home/buildbot/buildarea/3.x.cstratak-RHEL8-x86_64.refleak/build/Lib/multiprocessing/util.py", line 224, in __call__
res = self._callback(*self._args, **self._kwargs)
File "/home/buildbot/buildarea/3.x.cstratak-RHEL8-x86_64.refleak/build/Lib/multiprocessing/synchronize.py", line 87, in _cleanup
sem_unlink(name)
FileNotFoundError: [Errno 2] No such file or directory
Traceback (most recent call last):
File "/home/buildbot/buildarea/3.x.cstratak-RHEL8-x86_64.refleak/build/Lib/multiprocessing/util.py", line 300, in _run_finalizers
finalizer()
File "/home/buildbot/buildarea/3.x.cstratak-RHEL8-x86_64.refleak/build/Lib/multiprocessing/util.py", line 224, in __call__
res = self._callback(*self._args, **self._kwargs)
File "/home/buildbot/buildarea/3.x.cstratak-RHEL8-x86_64.refleak/build/Lib/multiprocessing/synchronize.py", line 87, in _cleanup
sem_unlink(name)
FileNotFoundError: [Errno 2] No such file or directory
Traceback (most recent call last):
File "/home/buildbot/buildarea/3.x.cstratak-RHEL8-x86_64.refleak/build/Lib/multiprocessing/util.py", line 300, in _run_finalizers
finalizer()
File "/home/buildbot/buildarea/3.x.cstratak-RHEL8-x86_64.refleak/build/Lib/multiprocessing/util.py", line 224, in __call__
res = self._callback(*self._args, **self._kwargs)
File "/home/buildbot/buildarea/3.x.cstratak-RHEL8-x86_64.refleak/build/Lib/multiprocessing/synchronize.py", line 87, in _cleanup
sem_unlink(name)
FileNotFoundError: [Errno 2] No such file or directory
Traceback (most recent call last):
File "/home/buildbot/buildarea/3.x.cstratak-RHEL8-x86_64.refleak/build/Lib/multiprocessing/util.py", line 300, in _run_finalizers
finalizer()
File "/home/buildbot/buildarea/3.x.cstratak-RHEL8-x86_64.refleak/build/Lib/multiprocessing/util.py", line 224, in __call__
res = self._callback(*self._args, **self._kwargs)
File "/home/buildbot/buildarea/3.x.cstratak-RHEL8-x86_64.refleak/build/Lib/multiprocessing/synchronize.py", line 87, in _cleanup
sem_unlink(name)
FileNotFoundError: [Errno 2] No such file or directory
Traceback (most recent call last):
File "/home/buildbot/buildarea/3.x.cstratak-RHEL8-x86_64.refleak/build/Lib/multiprocessing/util.py", line 300, in _run_finalizers
finalizer()
File "/home/buildbot/buildarea/3.x.cstratak-RHEL8-x86_64.refleak/build/Lib/multiprocessing/util.py", line 224, in __call__
res = self._callback(*self._args, **self._kwargs)
File "/home/buildbot/buildarea/3.x.cstratak-RHEL8-x86_64.refleak/build/Lib/multiprocessing/synchronize.py", line 87, in _cleanup
sem_unlink(name)
FileNotFoundError: [Errno 2] No such file or directory
./home/buildbot/buildarea/3.x.cstratak-RHEL8-x86_64.refleak/build/Lib/multiprocessing/resource_tracker.py:216: UserWarning: resource_tracker: There appear to be 6 leaked semaphore objects to clean up at shutdown
warnings.warn('resource_tracker: There appear to be %d '
Traceback (most recent call last):
File "/home/buildbot/buildarea/3.x.cstratak-RHEL8-x86_64.refleak/build/Lib/multiprocessing/util.py", line 300, in _run_finalizers
finalizer()
File "/home/buildbot/buildarea/3.x.cstratak-RHEL8-x86_64.refleak/build/Lib/multiprocessing/util.py", line 224, in __call__
res = self._callback(*self._args, **self._kwargs)
File "/home/buildbot/buildarea/3.x.cstratak-RHEL8-x86_64.refleak/build/Lib/multiprocessing/synchronize.py", line 87, in _cleanup
sem_unlink(name)
FileNotFoundError: [Errno 2] No such file or directory
Traceback (most recent call last):
File "/home/buildbot/buildarea/3.x.cstratak-RHEL8-x86_64.refleak/build/Lib/multiprocessing/util.py", line 300, in _run_finalizers
finalizer()
File "/home/buildbot/buildarea/3.x.cstratak-RHEL8-x86_64.refleak/build/Lib/multiprocessing/util.py", line 224, in __call__
res = self._callback(*self._args, **self._kwargs)
File "/home/buildbot/buildarea/3.x.cstratak-RHEL8-x86_64.refleak/build/Lib/multiprocessing/synchronize.py", line 87, in _cleanup
sem_unlink(name)
FileNotFoundError: [Errno 2] No such file or directory
Traceback (most recent call last):
File "/home/buildbot/buildarea/3.x.cstratak-RHEL8-x86_64.refleak/build/Lib/multiprocessing/util.py", line 300, in _run_finalizers
finalizer()
File "/home/buildbot/buildarea/3.x.cstratak-RHEL8-x86_64.refleak/build/Lib/multiprocessing/util.py", line 224, in __call__
res = self._callback(*self._args, **self._kwargs)
File "/home/buildbot/buildarea/3.x.cstratak-RHEL8-x86_64.refleak/build/Lib/multiprocessing/synchronize.py", line 87, in _cleanup
sem_unlink(name)
FileNotFoundError: [Errno 2] No such file or directory
Traceback (most recent call last):
File "/home/buildbot/buildarea/3.x.cstratak-RHEL8-x86_64.refleak/build/Lib/multiprocessing/util.py", line 300, in _run_finalizers
finalizer()
File "/home/buildbot/buildarea/3.x.cstratak-RHEL8-x86_64.refleak/build/Lib/multiprocessing/util.py", line 224, in __call__
res = self._callback(*self._args, **self._kwargs)
File "/home/buildbot/buildarea/3.x.cstratak-RHEL8-x86_64.refleak/build/Lib/multiprocessing/synchronize.py", line 87, in _cleanup
sem_unlink(name)
FileNotFoundError: [Errno 2] No such file or directory
Traceback (most recent call last):
File "/home/buildbot/buildarea/3.x.cstratak-RHEL8-x86_64.refleak/build/Lib/multiprocessing/util.py", line 300, in _run_finalizers
finalizer()
File "/home/buildbot/buildarea/3.x.cstratak-RHEL8-x86_64.refleak/build/Lib/multiprocessing/util.py", line 224, in __call__
res = self._callback(*self._args, **self._kwargs)
File "/home/buildbot/buildarea/3.x.cstratak-RHEL8-x86_64.refleak/build/Lib/multiprocessing/synchronize.py", line 87, in _cleanup
sem_unlink(name)
FileNotFoundError: [Errno 2] No such file or directory
Traceback (most recent call last):
File "/home/buildbot/buildarea/3.x.cstratak-RHEL8-x86_64.refleak/build/Lib/multiprocessing/util.py", line 300, in _run_finalizers
finalizer()
File "/home/buildbot/buildarea/3.x.cstratak-RHEL8-x86_64.refleak/build/Lib/multiprocessing/util.py", line 224, in __call__
res = self._callback(*self._args, **self._kwargs)
File "/home/buildbot/buildarea/3.x.cstratak-RHEL8-x86_64.refleak/build/Lib/multiprocessing/synchronize.py", line 87, in _cleanup
sem_unlink(name)
FileNotFoundError: [Errno 2] No such file or directory
./home/buildbot/buildarea/3.x.cstratak-RHEL8-x86_64.refleak/build/Lib/multiprocessing/resource_tracker.py:216: UserWarning: resource_tracker: There appear to be 6 leaked semaphore objects to clean up at shutdown
warnings.warn('resource_tracker: There appear to be %d '
Traceback (most recent call last):
File "/home/buildbot/buildarea/3.x.cstratak-RHEL8-x86_64.refleak/build/Lib/multiprocessing/util.py", line 300, in _run_finalizers
finalizer()
File "/home/buildbot/buildarea/3.x.cstratak-RHEL8-x86_64.refleak/build/Lib/multiprocessing/util.py", line 224, in __call__
res = self._callback(*self._args, **self._kwargs)
File "/home/buildbot/buildarea/3.x.cstratak-RHEL8-x86_64.refleak/build/Lib/multiprocessing/synchronize.py", line 87, in _cleanup
sem_unlink(name)
FileNotFoundError: [Errno 2] No such file or directory
Traceback (most recent call last):
File "/home/buildbot/buildarea/3.x.cstratak-RHEL8-x86_64.refleak/build/Lib/multiprocessing/util.py", line 300, in _run_finalizers
finalizer()
File "/home/buildbot/buildarea/3.x.cstratak-RHEL8-x86_64.refleak/build/Lib/multiprocessing/util.py", line 224, in __call__
res = self._callback(*self._args, **self._kwargs)
File "/home/buildbot/buildarea/3.x.cstratak-RHEL8-x86_64.refleak/build/Lib/multiprocessing/synchronize.py", line 87, in _cleanup
sem_unlink(name)
FileNotFoundError: [Errno 2] No such file or directory
Traceback (most recent call last):
File "/home/buildbot/buildarea/3.x.cstratak-RHEL8-x86_64.refleak/build/Lib/multiprocessing/util.py", line 300, in _run_finalizers
finalizer()
File "/home/buildbot/buildarea/3.x.cstratak-RHEL8-x86_64.refleak/build/Lib/multiprocessing/util.py", line 224, in __call__
res = self._callback(*self._args, **self._kwargs)
File "/home/buildbot/buildarea/3.x.cstratak-RHEL8-x86_64.refleak/build/Lib/multiprocessing/synchronize.py", line 87, in _cleanup
sem_unlink(name)
FileNotFoundError: [Errno 2] No such file or directory
Traceback (most recent call last):
File "/home/buildbot/buildarea/3.x.cstratak-RHEL8-x86_64.refleak/build/Lib/multiprocessing/util.py", line 300, in _run_finalizers
finalizer()
File "/home/buildbot/buildarea/3.x.cstratak-RHEL8-x86_64.refleak/build/Lib/multiprocessing/util.py", line 224, in __call__
res = self._callback(*self._args, **self._kwargs)
File "/home/buildbot/buildarea/3.x.cstratak-RHEL8-x86_64.refleak/build/Lib/multiprocessing/synchronize.py", line 87, in _cleanup
sem_unlink(name)
FileNotFoundError: [Errno 2] No such file or directory
Traceback (most recent call last):
File "/home/buildbot/buildarea/3.x.cstratak-RHEL8-x86_64.refleak/build/Lib/multiprocessing/util.py", line 300, in _run_finalizers
finalizer()
File "/home/buildbot/buildarea/3.x.cstratak-RHEL8-x86_64.refleak/build/Lib/multiprocessing/util.py", line 224, in __call__
res = self._callback(*self._args, **self._kwargs)
File "/home/buildbot/buildarea/3.x.cstratak-RHEL8-x86_64.refleak/build/Lib/multiprocessing/synchronize.py", line 87, in _cleanup
sem_unlink(name)
FileNotFoundError: [Errno 2] No such file or directory
Traceback (most recent call last):
File "/home/buildbot/buildarea/3.x.cstratak-RHEL8-x86_64.refleak/build/Lib/multiprocessing/util.py", line 300, in _run_finalizers
finalizer()
File "/home/buildbot/buildarea/3.x.cstratak-RHEL8-x86_64.refleak/build/Lib/multiprocessing/util.py", line 224, in __call__
res = self._callback(*self._args, **self._kwargs)
File "/home/buildbot/buildarea/3.x.cstratak-RHEL8-x86_64.refleak/build/Lib/multiprocessing/synchronize.py", line 87, in _cleanup
sem_unlink(name)
FileNotFoundError: [Errno 2] No such file or directory
./home/buildbot/buildarea/3.x.cstratak-RHEL8-x86_64.refleak/build/Lib/multiprocessing/resource_tracker.py:216: UserWarning: resource_tracker: There appear to be 6 leaked semaphore objects to clean up at shutdown
warnings.warn('resource_tracker: There appear to be %d '
Traceback (most recent call last):
File "/home/buildbot/buildarea/3.x.cstratak-RHEL8-x86_64.refleak/build/Lib/multiprocessing/util.py", line 300, in _run_finalizers
finalizer()
File "/home/buildbot/buildarea/3.x.cstratak-RHEL8-x86_64.refleak/build/Lib/multiprocessing/util.py", line 224, in __call__
res = self._callback(*self._args, **self._kwargs)
File "/home/buildbot/buildarea/3.x.cstratak-RHEL8-x86_64.refleak/build/Lib/multiprocessing/synchronize.py", line 87, in _cleanup
sem_unlink(name)
FileNotFoundError: [Errno 2] No such file or directory
Traceback (most recent call last):
File "/home/buildbot/buildarea/3.x.cstratak-RHEL8-x86_64.refleak/build/Lib/multiprocessing/util.py", line 300, in _run_finalizers
finalizer()
File "/home/buildbot/buildarea/3.x.cstratak-RHEL8-x86_64.refleak/build/Lib/multiprocessing/util.py", line 224, in __call__
res = self._callback(*self._args, **self._kwargs)
File "/home/buildbot/buildarea/3.x.cstratak-RHEL8-x86_64.refleak/build/Lib/multiprocessing/synchronize.py", line 87, in _cleanup
sem_unlink(name)
FileNotFoundError: [Errno 2] No such file or directory
Traceback (most recent call last):
File "/home/buildbot/buildarea/3.x.cstratak-RHEL8-x86_64.refleak/build/Lib/multiprocessing/util.py", line 300, in _run_finalizers
finalizer()
File "/home/buildbot/buildarea/3.x.cstratak-RHEL8-x86_64.refleak/build/Lib/multiprocessing/util.py", line 224, in __call__
res = self._callback(*self._args, **self._kwargs)
File "/home/buildbot/buildarea/3.x.cstratak-RHEL8-x86_64.refleak/build/Lib/multiprocessing/synchronize.py", line 87, in _cleanup
sem_unlink(name)
FileNotFoundError: [Errno 2] No such file or directory
Traceback (most recent call last):
File "/home/buildbot/buildarea/3.x.cstratak-RHEL8-x86_64.refleak/build/Lib/multiprocessing/util.py", line 300, in _run_finalizers
finalizer()
File "/home/buildbot/buildarea/3.x.cstratak-RHEL8-x86_64.refleak/build/Lib/multiprocessing/util.py", line 224, in __call__
res = self._callback(*self._args, **self._kwargs)
File "/home/buildbot/buildarea/3.x.cstratak-RHEL8-x86_64.refleak/build/Lib/multiprocessing/synchronize.py", line 87, in _cleanup
sem_unlink(name)
FileNotFoundError: [Errno 2] No such file or directory
Traceback (most recent call last):
File "/home/buildbot/buildarea/3.x.cstratak-RHEL8-x86_64.refleak/build/Lib/multiprocessing/util.py", line 300, in _run_finalizers
finalizer()
File "/home/buildbot/buildarea/3.x.cstratak-RHEL8-x86_64.refleak/build/Lib/multiprocessing/util.py", line 224, in __call__
res = self._callback(*self._args, **self._kwargs)
File "/home/buildbot/buildarea/3.x.cstratak-RHEL8-x86_64.refleak/build/Lib/multiprocessing/synchronize.py", line 87, in _cleanup
sem_unlink(name)
FileNotFoundError: [Errno 2] No such file or directory
Traceback (most recent call last):
File "/home/buildbot/buildarea/3.x.cstratak-RHEL8-x86_64.refleak/build/Lib/multiprocessing/util.py", line 300, in _run_finalizers
finalizer()
File "/home/buildbot/buildarea/3.x.cstratak-RHEL8-x86_64.refleak/build/Lib/multiprocessing/util.py", line 224, in __call__
res = self._callback(*self._args, **self._kwargs)
File "/home/buildbot/buildarea/3.x.cstratak-RHEL8-x86_64.refleak/build/Lib/multiprocessing/synchronize.py", line 87, in _cleanup
sem_unlink(name)
FileNotFoundError: [Errno 2] No such file or directory
./home/buildbot/buildarea/3.x.cstratak-RHEL8-x86_64.refleak/build/Lib/multiprocessing/resource_tracker.py:216: UserWarning: resource_tracker: There appear to be 6 leaked semaphore objects to clean up at shutdown
warnings.warn('resource_tracker: There appear to be %d '
Traceback (most recent call last):
File "/home/buildbot/buildarea/3.x.cstratak-RHEL8-x86_64.refleak/build/Lib/multiprocessing/util.py", line 300, in _run_finalizers
finalizer()
File "/home/buildbot/buildarea/3.x.cstratak-RHEL8-x86_64.refleak/build/Lib/multiprocessing/util.py", line 224, in __call__
res = self._callback(*self._args, **self._kwargs)
File "/home/buildbot/buildarea/3.x.cstratak-RHEL8-x86_64.refleak/build/Lib/multiprocessing/synchronize.py", line 87, in _cleanup
sem_unlink(name)
FileNotFoundError: [Errno 2] No such file or directory
Traceback (most recent call last):
File "/home/buildbot/buildarea/3.x.cstratak-RHEL8-x86_64.refleak/build/Lib/multiprocessing/util.py", line 300, in _run_finalizers
finalizer()
File "/home/buildbot/buildarea/3.x.cstratak-RHEL8-x86_64.refleak/build/Lib/multiprocessing/util.py", line 224, in __call__
res = self._callback(*self._args, **self._kwargs)
File "/home/buildbot/buildarea/3.x.cstratak-RHEL8-x86_64.refleak/build/Lib/multiprocessing/synchronize.py", line 87, in _cleanup
sem_unlink(name)
FileNotFoundError: [Errno 2] No such file or directory
Traceback (most recent call last):
File "/home/buildbot/buildarea/3.x.cstratak-RHEL8-x86_64.refleak/build/Lib/multiprocessing/util.py", line 300, in _run_finalizers
finalizer()
File "/home/buildbot/buildarea/3.x.cstratak-RHEL8-x86_64.refleak/build/Lib/multiprocessing/util.py", line 224, in __call__
res = self._callback(*self._args, **self._kwargs)
File "/home/buildbot/buildarea/3.x.cstratak-RHEL8-x86_64.refleak/build/Lib/multiprocessing/synchronize.py", line 87, in _cleanup
sem_unlink(name)
FileNotFoundError: [Errno 2] No such file or directory
Traceback (most recent call last):
File "/home/buildbot/buildarea/3.x.cstratak-RHEL8-x86_64.refleak/build/Lib/multiprocessing/util.py", line 300, in _run_finalizers
finalizer()
File "/home/buildbot/buildarea/3.x.cstratak-RHEL8-x86_64.refleak/build/Lib/multiprocessing/util.py", line 224, in __call__
res = self._callback(*self._args, **self._kwargs)
File "/home/buildbot/buildarea/3.x.cstratak-RHEL8-x86_64.refleak/build/Lib/multiprocessing/synchronize.py", line 87, in _cleanup
sem_unlink(name)
FileNotFoundError: [Errno 2] No such file or directory
Traceback (most recent call last):
File "/home/buildbot/buildarea/3.x.cstratak-RHEL8-x86_64.refleak/build/Lib/multiprocessing/util.py", line 300, in _run_finalizers
finalizer()
File "/home/buildbot/buildarea/3.x.cstratak-RHEL8-x86_64.refleak/build/Lib/multiprocessing/util.py", line 224, in __call__
res = self._callback(*self._args, **self._kwargs)
File "/home/buildbot/buildarea/3.x.cstratak-RHEL8-x86_64.refleak/build/Lib/multiprocessing/synchronize.py", line 87, in _cleanup
sem_unlink(name)
FileNotFoundError: [Errno 2] No such file or directory
Traceback (most recent call last):
File "/home/buildbot/buildarea/3.x.cstratak-RHEL8-x86_64.refleak/build/Lib/multiprocessing/util.py", line 300, in _run_finalizers
finalizer()
File "/home/buildbot/buildarea/3.x.cstratak-RHEL8-x86_64.refleak/build/Lib/multiprocessing/util.py", line 224, in __call__
res = self._callback(*self._args, **self._kwargs)
File "/home/buildbot/buildarea/3.x.cstratak-RHEL8-x86_64.refleak/build/Lib/multiprocessing/synchronize.py", line 87, in _cleanup
sem_unlink(name)
FileNotFoundError: [Errno 2] No such file or directory
.
Test report
===========
Failed tests:
- test_socketserver
- test_logging
Test leaking resources:
- test_logging: references
- test_socketserver: references
- test_logging: memory blocks
- test_socketserver: memory blocks
Sincerely,
-The Buildbot
1
0
Nov. 2, 2020
The Buildbot has detected a new failure on builder s390x Fedora Rawhide Refleaks 3.x while building Python.
Full details are available at:
https://buildbot.python.org/all/#builders/16/builds/81
Buildbot URL: https://buildbot.python.org/all/
Worker for this Build: edelsohn-fedora-rawhide-z
Build Reason: <unknown>
Blamelist:
BUILD FAILED: failed test (failure)
Summary of the results of the build (if available):
===================================================
== Tests result: FAILURE then FAILURE ==
407 tests OK.
10 slowest tests:
- test_signal: 31 min
- test_pydoc: 29 min 32 sec
- test_asyncio: 18 min 21 sec
- test_concurrent_futures: 16 min 44 sec
- test_multiprocessing_spawn: 8 min 55 sec
- test_multiprocessing_forkserver: 7 min 7 sec
- test_peg_generator: 6 min 53 sec
- test_multiprocessing_fork: 5 min 28 sec
- test_io: 3 min 35 sec
- test_selectors: 3 min 18 sec
2 tests failed:
test_logging test_socketserver
15 tests skipped:
test_devpoll test_gdb test_ioctl test_kqueue test_msilib test_nis
test_ossaudiodev test_startfile test_tix test_tk test_ttk_guionly
test_winconsoleio test_winreg test_winsound test_zipfile64
2 re-run tests:
test_logging test_socketserver
Total duration: 50 min 39 sec
Captured traceback
==================
Traceback (most recent call last):
File "/home/dje/cpython-buildarea/3.x.edelsohn-fedora-rawhide-z.refleak/build/Lib/multiprocessing/util.py", line 300, in _run_finalizers
finalizer()
File "/home/dje/cpython-buildarea/3.x.edelsohn-fedora-rawhide-z.refleak/build/Lib/multiprocessing/util.py", line 224, in __call__
res = self._callback(*self._args, **self._kwargs)
File "/home/dje/cpython-buildarea/3.x.edelsohn-fedora-rawhide-z.refleak/build/Lib/multiprocessing/synchronize.py", line 87, in _cleanup
sem_unlink(name)
FileNotFoundError: [Errno 2] No such file or directory
Traceback (most recent call last):
File "/home/dje/cpython-buildarea/3.x.edelsohn-fedora-rawhide-z.refleak/build/Lib/multiprocessing/util.py", line 300, in _run_finalizers
finalizer()
File "/home/dje/cpython-buildarea/3.x.edelsohn-fedora-rawhide-z.refleak/build/Lib/multiprocessing/util.py", line 224, in __call__
res = self._callback(*self._args, **self._kwargs)
File "/home/dje/cpython-buildarea/3.x.edelsohn-fedora-rawhide-z.refleak/build/Lib/multiprocessing/synchronize.py", line 87, in _cleanup
sem_unlink(name)
FileNotFoundError: [Errno 2] No such file or directory
Traceback (most recent call last):
File "/home/dje/cpython-buildarea/3.x.edelsohn-fedora-rawhide-z.refleak/build/Lib/multiprocessing/util.py", line 300, in _run_finalizers
finalizer()
File "/home/dje/cpython-buildarea/3.x.edelsohn-fedora-rawhide-z.refleak/build/Lib/multiprocessing/util.py", line 224, in __call__
res = self._callback(*self._args, **self._kwargs)
File "/home/dje/cpython-buildarea/3.x.edelsohn-fedora-rawhide-z.refleak/build/Lib/multiprocessing/synchronize.py", line 87, in _cleanup
sem_unlink(name)
FileNotFoundError: [Errno 2] No such file or directory
Traceback (most recent call last):
File "/home/dje/cpython-buildarea/3.x.edelsohn-fedora-rawhide-z.refleak/build/Lib/multiprocessing/util.py", line 300, in _run_finalizers
finalizer()
File "/home/dje/cpython-buildarea/3.x.edelsohn-fedora-rawhide-z.refleak/build/Lib/multiprocessing/util.py", line 224, in __call__
res = self._callback(*self._args, **self._kwargs)
File "/home/dje/cpython-buildarea/3.x.edelsohn-fedora-rawhide-z.refleak/build/Lib/multiprocessing/synchronize.py", line 87, in _cleanup
sem_unlink(name)
FileNotFoundError: [Errno 2] No such file or directory
Traceback (most recent call last):
File "/home/dje/cpython-buildarea/3.x.edelsohn-fedora-rawhide-z.refleak/build/Lib/multiprocessing/util.py", line 300, in _run_finalizers
finalizer()
File "/home/dje/cpython-buildarea/3.x.edelsohn-fedora-rawhide-z.refleak/build/Lib/multiprocessing/util.py", line 224, in __call__
res = self._callback(*self._args, **self._kwargs)
File "/home/dje/cpython-buildarea/3.x.edelsohn-fedora-rawhide-z.refleak/build/Lib/multiprocessing/synchronize.py", line 87, in _cleanup
sem_unlink(name)
FileNotFoundError: [Errno 2] No such file or directory
Traceback (most recent call last):
File "/home/dje/cpython-buildarea/3.x.edelsohn-fedora-rawhide-z.refleak/build/Lib/multiprocessing/util.py", line 300, in _run_finalizers
finalizer()
File "/home/dje/cpython-buildarea/3.x.edelsohn-fedora-rawhide-z.refleak/build/Lib/multiprocessing/util.py", line 224, in __call__
res = self._callback(*self._args, **self._kwargs)
File "/home/dje/cpython-buildarea/3.x.edelsohn-fedora-rawhide-z.refleak/build/Lib/multiprocessing/synchronize.py", line 87, in _cleanup
sem_unlink(name)
FileNotFoundError: [Errno 2] No such file or directory
./home/dje/cpython-buildarea/3.x.edelsohn-fedora-rawhide-z.refleak/build/Lib/multiprocessing/resource_tracker.py:216: UserWarning: resource_tracker: There appear to be 6 leaked semaphore objects to clean up at shutdown
warnings.warn('resource_tracker: There appear to be %d '
Traceback (most recent call last):
File "/home/dje/cpython-buildarea/3.x.edelsohn-fedora-rawhide-z.refleak/build/Lib/multiprocessing/util.py", line 300, in _run_finalizers
finalizer()
File "/home/dje/cpython-buildarea/3.x.edelsohn-fedora-rawhide-z.refleak/build/Lib/multiprocessing/util.py", line 224, in __call__
res = self._callback(*self._args, **self._kwargs)
File "/home/dje/cpython-buildarea/3.x.edelsohn-fedora-rawhide-z.refleak/build/Lib/multiprocessing/synchronize.py", line 87, in _cleanup
sem_unlink(name)
FileNotFoundError: [Errno 2] No such file or directory
Traceback (most recent call last):
File "/home/dje/cpython-buildarea/3.x.edelsohn-fedora-rawhide-z.refleak/build/Lib/multiprocessing/util.py", line 300, in _run_finalizers
finalizer()
File "/home/dje/cpython-buildarea/3.x.edelsohn-fedora-rawhide-z.refleak/build/Lib/multiprocessing/util.py", line 224, in __call__
res = self._callback(*self._args, **self._kwargs)
File "/home/dje/cpython-buildarea/3.x.edelsohn-fedora-rawhide-z.refleak/build/Lib/multiprocessing/synchronize.py", line 87, in _cleanup
sem_unlink(name)
FileNotFoundError: [Errno 2] No such file or directory
Traceback (most recent call last):
File "/home/dje/cpython-buildarea/3.x.edelsohn-fedora-rawhide-z.refleak/build/Lib/multiprocessing/util.py", line 300, in _run_finalizers
finalizer()
File "/home/dje/cpython-buildarea/3.x.edelsohn-fedora-rawhide-z.refleak/build/Lib/multiprocessing/util.py", line 224, in __call__
res = self._callback(*self._args, **self._kwargs)
File "/home/dje/cpython-buildarea/3.x.edelsohn-fedora-rawhide-z.refleak/build/Lib/multiprocessing/synchronize.py", line 87, in _cleanup
sem_unlink(name)
FileNotFoundError: [Errno 2] No such file or directory
Traceback (most recent call last):
File "/home/dje/cpython-buildarea/3.x.edelsohn-fedora-rawhide-z.refleak/build/Lib/multiprocessing/util.py", line 300, in _run_finalizers
finalizer()
File "/home/dje/cpython-buildarea/3.x.edelsohn-fedora-rawhide-z.refleak/build/Lib/multiprocessing/util.py", line 224, in __call__
res = self._callback(*self._args, **self._kwargs)
File "/home/dje/cpython-buildarea/3.x.edelsohn-fedora-rawhide-z.refleak/build/Lib/multiprocessing/synchronize.py", line 87, in _cleanup
sem_unlink(name)
FileNotFoundError: [Errno 2] No such file or directory
Traceback (most recent call last):
File "/home/dje/cpython-buildarea/3.x.edelsohn-fedora-rawhide-z.refleak/build/Lib/multiprocessing/util.py", line 300, in _run_finalizers
finalizer()
File "/home/dje/cpython-buildarea/3.x.edelsohn-fedora-rawhide-z.refleak/build/Lib/multiprocessing/util.py", line 224, in __call__
res = self._callback(*self._args, **self._kwargs)
File "/home/dje/cpython-buildarea/3.x.edelsohn-fedora-rawhide-z.refleak/build/Lib/multiprocessing/synchronize.py", line 87, in _cleanup
sem_unlink(name)
FileNotFoundError: [Errno 2] No such file or directory
Traceback (most recent call last):
File "/home/dje/cpython-buildarea/3.x.edelsohn-fedora-rawhide-z.refleak/build/Lib/multiprocessing/util.py", line 300, in _run_finalizers
finalizer()
File "/home/dje/cpython-buildarea/3.x.edelsohn-fedora-rawhide-z.refleak/build/Lib/multiprocessing/util.py", line 224, in __call__
res = self._callback(*self._args, **self._kwargs)
File "/home/dje/cpython-buildarea/3.x.edelsohn-fedora-rawhide-z.refleak/build/Lib/multiprocessing/synchronize.py", line 87, in _cleanup
sem_unlink(name)
FileNotFoundError: [Errno 2] No such file or directory
./home/dje/cpython-buildarea/3.x.edelsohn-fedora-rawhide-z.refleak/build/Lib/multiprocessing/resource_tracker.py:216: UserWarning: resource_tracker: There appear to be 6 leaked semaphore objects to clean up at shutdown
warnings.warn('resource_tracker: There appear to be %d '
Traceback (most recent call last):
File "/home/dje/cpython-buildarea/3.x.edelsohn-fedora-rawhide-z.refleak/build/Lib/multiprocessing/util.py", line 300, in _run_finalizers
finalizer()
File "/home/dje/cpython-buildarea/3.x.edelsohn-fedora-rawhide-z.refleak/build/Lib/multiprocessing/util.py", line 224, in __call__
res = self._callback(*self._args, **self._kwargs)
File "/home/dje/cpython-buildarea/3.x.edelsohn-fedora-rawhide-z.refleak/build/Lib/multiprocessing/synchronize.py", line 87, in _cleanup
sem_unlink(name)
FileNotFoundError: [Errno 2] No such file or directory
Traceback (most recent call last):
File "/home/dje/cpython-buildarea/3.x.edelsohn-fedora-rawhide-z.refleak/build/Lib/multiprocessing/util.py", line 300, in _run_finalizers
finalizer()
File "/home/dje/cpython-buildarea/3.x.edelsohn-fedora-rawhide-z.refleak/build/Lib/multiprocessing/util.py", line 224, in __call__
res = self._callback(*self._args, **self._kwargs)
File "/home/dje/cpython-buildarea/3.x.edelsohn-fedora-rawhide-z.refleak/build/Lib/multiprocessing/synchronize.py", line 87, in _cleanup
sem_unlink(name)
FileNotFoundError: [Errno 2] No such file or directory
Traceback (most recent call last):
File "/home/dje/cpython-buildarea/3.x.edelsohn-fedora-rawhide-z.refleak/build/Lib/multiprocessing/util.py", line 300, in _run_finalizers
finalizer()
File "/home/dje/cpython-buildarea/3.x.edelsohn-fedora-rawhide-z.refleak/build/Lib/multiprocessing/util.py", line 224, in __call__
res = self._callback(*self._args, **self._kwargs)
File "/home/dje/cpython-buildarea/3.x.edelsohn-fedora-rawhide-z.refleak/build/Lib/multiprocessing/synchronize.py", line 87, in _cleanup
sem_unlink(name)
FileNotFoundError: [Errno 2] No such file or directory
Traceback (most recent call last):
File "/home/dje/cpython-buildarea/3.x.edelsohn-fedora-rawhide-z.refleak/build/Lib/multiprocessing/util.py", line 300, in _run_finalizers
finalizer()
File "/home/dje/cpython-buildarea/3.x.edelsohn-fedora-rawhide-z.refleak/build/Lib/multiprocessing/util.py", line 224, in __call__
res = self._callback(*self._args, **self._kwargs)
File "/home/dje/cpython-buildarea/3.x.edelsohn-fedora-rawhide-z.refleak/build/Lib/multiprocessing/synchronize.py", line 87, in _cleanup
sem_unlink(name)
FileNotFoundError: [Errno 2] No such file or directory
Traceback (most recent call last):
File "/home/dje/cpython-buildarea/3.x.edelsohn-fedora-rawhide-z.refleak/build/Lib/multiprocessing/util.py", line 300, in _run_finalizers
finalizer()
File "/home/dje/cpython-buildarea/3.x.edelsohn-fedora-rawhide-z.refleak/build/Lib/multiprocessing/util.py", line 224, in __call__
res = self._callback(*self._args, **self._kwargs)
File "/home/dje/cpython-buildarea/3.x.edelsohn-fedora-rawhide-z.refleak/build/Lib/multiprocessing/synchronize.py", line 87, in _cleanup
sem_unlink(name)
FileNotFoundError: [Errno 2] No such file or directory
Traceback (most recent call last):
File "/home/dje/cpython-buildarea/3.x.edelsohn-fedora-rawhide-z.refleak/build/Lib/multiprocessing/util.py", line 300, in _run_finalizers
finalizer()
File "/home/dje/cpython-buildarea/3.x.edelsohn-fedora-rawhide-z.refleak/build/Lib/multiprocessing/util.py", line 224, in __call__
res = self._callback(*self._args, **self._kwargs)
File "/home/dje/cpython-buildarea/3.x.edelsohn-fedora-rawhide-z.refleak/build/Lib/multiprocessing/synchronize.py", line 87, in _cleanup
sem_unlink(name)
FileNotFoundError: [Errno 2] No such file or directory
./home/dje/cpython-buildarea/3.x.edelsohn-fedora-rawhide-z.refleak/build/Lib/multiprocessing/resource_tracker.py:216: UserWarning: resource_tracker: There appear to be 6 leaked semaphore objects to clean up at shutdown
warnings.warn('resource_tracker: There appear to be %d '
Traceback (most recent call last):
File "/home/dje/cpython-buildarea/3.x.edelsohn-fedora-rawhide-z.refleak/build/Lib/multiprocessing/util.py", line 300, in _run_finalizers
finalizer()
File "/home/dje/cpython-buildarea/3.x.edelsohn-fedora-rawhide-z.refleak/build/Lib/multiprocessing/util.py", line 224, in __call__
res = self._callback(*self._args, **self._kwargs)
File "/home/dje/cpython-buildarea/3.x.edelsohn-fedora-rawhide-z.refleak/build/Lib/multiprocessing/synchronize.py", line 87, in _cleanup
sem_unlink(name)
FileNotFoundError: [Errno 2] No such file or directory
Traceback (most recent call last):
File "/home/dje/cpython-buildarea/3.x.edelsohn-fedora-rawhide-z.refleak/build/Lib/multiprocessing/util.py", line 300, in _run_finalizers
finalizer()
File "/home/dje/cpython-buildarea/3.x.edelsohn-fedora-rawhide-z.refleak/build/Lib/multiprocessing/util.py", line 224, in __call__
res = self._callback(*self._args, **self._kwargs)
File "/home/dje/cpython-buildarea/3.x.edelsohn-fedora-rawhide-z.refleak/build/Lib/multiprocessing/synchronize.py", line 87, in _cleanup
sem_unlink(name)
FileNotFoundError: [Errno 2] No such file or directory
Traceback (most recent call last):
File "/home/dje/cpython-buildarea/3.x.edelsohn-fedora-rawhide-z.refleak/build/Lib/multiprocessing/util.py", line 300, in _run_finalizers
finalizer()
File "/home/dje/cpython-buildarea/3.x.edelsohn-fedora-rawhide-z.refleak/build/Lib/multiprocessing/util.py", line 224, in __call__
res = self._callback(*self._args, **self._kwargs)
File "/home/dje/cpython-buildarea/3.x.edelsohn-fedora-rawhide-z.refleak/build/Lib/multiprocessing/synchronize.py", line 87, in _cleanup
sem_unlink(name)
FileNotFoundError: [Errno 2] No such file or directory
Traceback (most recent call last):
File "/home/dje/cpython-buildarea/3.x.edelsohn-fedora-rawhide-z.refleak/build/Lib/multiprocessing/util.py", line 300, in _run_finalizers
finalizer()
File "/home/dje/cpython-buildarea/3.x.edelsohn-fedora-rawhide-z.refleak/build/Lib/multiprocessing/util.py", line 224, in __call__
res = self._callback(*self._args, **self._kwargs)
File "/home/dje/cpython-buildarea/3.x.edelsohn-fedora-rawhide-z.refleak/build/Lib/multiprocessing/synchronize.py", line 87, in _cleanup
sem_unlink(name)
FileNotFoundError: [Errno 2] No such file or directory
Traceback (most recent call last):
File "/home/dje/cpython-buildarea/3.x.edelsohn-fedora-rawhide-z.refleak/build/Lib/multiprocessing/util.py", line 300, in _run_finalizers
finalizer()
File "/home/dje/cpython-buildarea/3.x.edelsohn-fedora-rawhide-z.refleak/build/Lib/multiprocessing/util.py", line 224, in __call__
res = self._callback(*self._args, **self._kwargs)
File "/home/dje/cpython-buildarea/3.x.edelsohn-fedora-rawhide-z.refleak/build/Lib/multiprocessing/synchronize.py", line 87, in _cleanup
sem_unlink(name)
FileNotFoundError: [Errno 2] No such file or directory
Traceback (most recent call last):
File "/home/dje/cpython-buildarea/3.x.edelsohn-fedora-rawhide-z.refleak/build/Lib/multiprocessing/util.py", line 300, in _run_finalizers
finalizer()
File "/home/dje/cpython-buildarea/3.x.edelsohn-fedora-rawhide-z.refleak/build/Lib/multiprocessing/util.py", line 224, in __call__
res = self._callback(*self._args, **self._kwargs)
File "/home/dje/cpython-buildarea/3.x.edelsohn-fedora-rawhide-z.refleak/build/Lib/multiprocessing/synchronize.py", line 87, in _cleanup
sem_unlink(name)
FileNotFoundError: [Errno 2] No such file or directory
./home/dje/cpython-buildarea/3.x.edelsohn-fedora-rawhide-z.refleak/build/Lib/multiprocessing/resource_tracker.py:216: UserWarning: resource_tracker: There appear to be 6 leaked semaphore objects to clean up at shutdown
warnings.warn('resource_tracker: There appear to be %d '
Traceback (most recent call last):
File "/home/dje/cpython-buildarea/3.x.edelsohn-fedora-rawhide-z.refleak/build/Lib/multiprocessing/util.py", line 300, in _run_finalizers
finalizer()
File "/home/dje/cpython-buildarea/3.x.edelsohn-fedora-rawhide-z.refleak/build/Lib/multiprocessing/util.py", line 224, in __call__
res = self._callback(*self._args, **self._kwargs)
File "/home/dje/cpython-buildarea/3.x.edelsohn-fedora-rawhide-z.refleak/build/Lib/multiprocessing/synchronize.py", line 87, in _cleanup
sem_unlink(name)
FileNotFoundError: [Errno 2] No such file or directory
Traceback (most recent call last):
File "/home/dje/cpython-buildarea/3.x.edelsohn-fedora-rawhide-z.refleak/build/Lib/multiprocessing/util.py", line 300, in _run_finalizers
finalizer()
File "/home/dje/cpython-buildarea/3.x.edelsohn-fedora-rawhide-z.refleak/build/Lib/multiprocessing/util.py", line 224, in __call__
res = self._callback(*self._args, **self._kwargs)
File "/home/dje/cpython-buildarea/3.x.edelsohn-fedora-rawhide-z.refleak/build/Lib/multiprocessing/synchronize.py", line 87, in _cleanup
sem_unlink(name)
FileNotFoundError: [Errno 2] No such file or directory
Traceback (most recent call last):
File "/home/dje/cpython-buildarea/3.x.edelsohn-fedora-rawhide-z.refleak/build/Lib/multiprocessing/util.py", line 300, in _run_finalizers
finalizer()
File "/home/dje/cpython-buildarea/3.x.edelsohn-fedora-rawhide-z.refleak/build/Lib/multiprocessing/util.py", line 224, in __call__
res = self._callback(*self._args, **self._kwargs)
File "/home/dje/cpython-buildarea/3.x.edelsohn-fedora-rawhide-z.refleak/build/Lib/multiprocessing/synchronize.py", line 87, in _cleanup
sem_unlink(name)
FileNotFoundError: [Errno 2] No such file or directory
Traceback (most recent call last):
File "/home/dje/cpython-buildarea/3.x.edelsohn-fedora-rawhide-z.refleak/build/Lib/multiprocessing/util.py", line 300, in _run_finalizers
finalizer()
File "/home/dje/cpython-buildarea/3.x.edelsohn-fedora-rawhide-z.refleak/build/Lib/multiprocessing/util.py", line 224, in __call__
res = self._callback(*self._args, **self._kwargs)
File "/home/dje/cpython-buildarea/3.x.edelsohn-fedora-rawhide-z.refleak/build/Lib/multiprocessing/synchronize.py", line 87, in _cleanup
sem_unlink(name)
FileNotFoundError: [Errno 2] No such file or directory
Traceback (most recent call last):
File "/home/dje/cpython-buildarea/3.x.edelsohn-fedora-rawhide-z.refleak/build/Lib/multiprocessing/util.py", line 300, in _run_finalizers
finalizer()
File "/home/dje/cpython-buildarea/3.x.edelsohn-fedora-rawhide-z.refleak/build/Lib/multiprocessing/util.py", line 224, in __call__
res = self._callback(*self._args, **self._kwargs)
File "/home/dje/cpython-buildarea/3.x.edelsohn-fedora-rawhide-z.refleak/build/Lib/multiprocessing/synchronize.py", line 87, in _cleanup
sem_unlink(name)
FileNotFoundError: [Errno 2] No such file or directory
Traceback (most recent call last):
File "/home/dje/cpython-buildarea/3.x.edelsohn-fedora-rawhide-z.refleak/build/Lib/multiprocessing/util.py", line 300, in _run_finalizers
finalizer()
File "/home/dje/cpython-buildarea/3.x.edelsohn-fedora-rawhide-z.refleak/build/Lib/multiprocessing/util.py", line 224, in __call__
res = self._callback(*self._args, **self._kwargs)
File "/home/dje/cpython-buildarea/3.x.edelsohn-fedora-rawhide-z.refleak/build/Lib/multiprocessing/synchronize.py", line 87, in _cleanup
sem_unlink(name)
FileNotFoundError: [Errno 2] No such file or directory
./home/dje/cpython-buildarea/3.x.edelsohn-fedora-rawhide-z.refleak/build/Lib/multiprocessing/resource_tracker.py:216: UserWarning: resource_tracker: There appear to be 6 leaked semaphore objects to clean up at shutdown
warnings.warn('resource_tracker: There appear to be %d '
Traceback (most recent call last):
File "/home/dje/cpython-buildarea/3.x.edelsohn-fedora-rawhide-z.refleak/build/Lib/multiprocessing/util.py", line 300, in _run_finalizers
finalizer()
File "/home/dje/cpython-buildarea/3.x.edelsohn-fedora-rawhide-z.refleak/build/Lib/multiprocessing/util.py", line 224, in __call__
res = self._callback(*self._args, **self._kwargs)
File "/home/dje/cpython-buildarea/3.x.edelsohn-fedora-rawhide-z.refleak/build/Lib/multiprocessing/synchronize.py", line 87, in _cleanup
sem_unlink(name)
FileNotFoundError: [Errno 2] No such file or directory
Traceback (most recent call last):
File "/home/dje/cpython-buildarea/3.x.edelsohn-fedora-rawhide-z.refleak/build/Lib/multiprocessing/util.py", line 300, in _run_finalizers
finalizer()
File "/home/dje/cpython-buildarea/3.x.edelsohn-fedora-rawhide-z.refleak/build/Lib/multiprocessing/util.py", line 224, in __call__
res = self._callback(*self._args, **self._kwargs)
File "/home/dje/cpython-buildarea/3.x.edelsohn-fedora-rawhide-z.refleak/build/Lib/multiprocessing/synchronize.py", line 87, in _cleanup
sem_unlink(name)
FileNotFoundError: [Errno 2] No such file or directory
Traceback (most recent call last):
File "/home/dje/cpython-buildarea/3.x.edelsohn-fedora-rawhide-z.refleak/build/Lib/multiprocessing/util.py", line 300, in _run_finalizers
finalizer()
File "/home/dje/cpython-buildarea/3.x.edelsohn-fedora-rawhide-z.refleak/build/Lib/multiprocessing/util.py", line 224, in __call__
res = self._callback(*self._args, **self._kwargs)
File "/home/dje/cpython-buildarea/3.x.edelsohn-fedora-rawhide-z.refleak/build/Lib/multiprocessing/synchronize.py", line 87, in _cleanup
sem_unlink(name)
FileNotFoundError: [Errno 2] No such file or directory
Traceback (most recent call last):
File "/home/dje/cpython-buildarea/3.x.edelsohn-fedora-rawhide-z.refleak/build/Lib/multiprocessing/util.py", line 300, in _run_finalizers
finalizer()
File "/home/dje/cpython-buildarea/3.x.edelsohn-fedora-rawhide-z.refleak/build/Lib/multiprocessing/util.py", line 224, in __call__
res = self._callback(*self._args, **self._kwargs)
File "/home/dje/cpython-buildarea/3.x.edelsohn-fedora-rawhide-z.refleak/build/Lib/multiprocessing/synchronize.py", line 87, in _cleanup
sem_unlink(name)
FileNotFoundError: [Errno 2] No such file or directory
Traceback (most recent call last):
File "/home/dje/cpython-buildarea/3.x.edelsohn-fedora-rawhide-z.refleak/build/Lib/multiprocessing/util.py", line 300, in _run_finalizers
finalizer()
File "/home/dje/cpython-buildarea/3.x.edelsohn-fedora-rawhide-z.refleak/build/Lib/multiprocessing/util.py", line 224, in __call__
res = self._callback(*self._args, **self._kwargs)
File "/home/dje/cpython-buildarea/3.x.edelsohn-fedora-rawhide-z.refleak/build/Lib/multiprocessing/synchronize.py", line 87, in _cleanup
sem_unlink(name)
FileNotFoundError: [Errno 2] No such file or directory
Traceback (most recent call last):
File "/home/dje/cpython-buildarea/3.x.edelsohn-fedora-rawhide-z.refleak/build/Lib/multiprocessing/util.py", line 300, in _run_finalizers
finalizer()
File "/home/dje/cpython-buildarea/3.x.edelsohn-fedora-rawhide-z.refleak/build/Lib/multiprocessing/util.py", line 224, in __call__
res = self._callback(*self._args, **self._kwargs)
File "/home/dje/cpython-buildarea/3.x.edelsohn-fedora-rawhide-z.refleak/build/Lib/multiprocessing/synchronize.py", line 87, in _cleanup
sem_unlink(name)
FileNotFoundError: [Errno 2] No such file or directory
.
Test report
===========
Failed tests:
- test_socketserver
- test_logging
Test leaking resources:
- test_logging: references
- test_socketserver: references
- test_logging: memory blocks
- test_socketserver: memory blocks
Sincerely,
-The Buildbot
1
0
Nov. 2, 2020
The Buildbot has detected a new failure on builder s390x RHEL8 Refleaks 3.x while building Python.
Full details are available at:
https://buildbot.python.org/all/#builders/75/builds/76
Buildbot URL: https://buildbot.python.org/all/
Worker for this Build: edelsohn-rhel8-z
Build Reason: <unknown>
Blamelist:
BUILD FAILED: failed test (failure)
Summary of the results of the build (if available):
===================================================
== Tests result: FAILURE then FAILURE ==
408 tests OK.
10 slowest tests:
- test_signal: 31 min 8 sec
- test_pydoc: 29 min 34 sec
- test_concurrent_futures: 18 min 30 sec
- test_asyncio: 15 min 19 sec
- test_multiprocessing_spawn: 8 min 35 sec
- test_gdb: 7 min 7 sec
- test_peg_generator: 6 min 52 sec
- test_multiprocessing_forkserver: 6 min 45 sec
- test_multiprocessing_fork: 5 min 30 sec
- test_io: 3 min 43 sec
2 tests failed:
test_logging test_socketserver
14 tests skipped:
test_devpoll test_ioctl test_kqueue test_msilib test_nis
test_ossaudiodev test_startfile test_tix test_tk test_ttk_guionly
test_winconsoleio test_winreg test_winsound test_zipfile64
2 re-run tests:
test_logging test_socketserver
Total duration: 47 min 3 sec
Captured traceback
==================
Traceback (most recent call last):
File "/home/dje/cpython-buildarea/3.x.edelsohn-rhel8-z.refleak/build/Lib/multiprocessing/util.py", line 300, in _run_finalizers
finalizer()
File "/home/dje/cpython-buildarea/3.x.edelsohn-rhel8-z.refleak/build/Lib/multiprocessing/util.py", line 224, in __call__
res = self._callback(*self._args, **self._kwargs)
File "/home/dje/cpython-buildarea/3.x.edelsohn-rhel8-z.refleak/build/Lib/multiprocessing/synchronize.py", line 87, in _cleanup
sem_unlink(name)
FileNotFoundError: [Errno 2] No such file or directory
Traceback (most recent call last):
File "/home/dje/cpython-buildarea/3.x.edelsohn-rhel8-z.refleak/build/Lib/multiprocessing/util.py", line 300, in _run_finalizers
finalizer()
File "/home/dje/cpython-buildarea/3.x.edelsohn-rhel8-z.refleak/build/Lib/multiprocessing/util.py", line 224, in __call__
res = self._callback(*self._args, **self._kwargs)
File "/home/dje/cpython-buildarea/3.x.edelsohn-rhel8-z.refleak/build/Lib/multiprocessing/synchronize.py", line 87, in _cleanup
sem_unlink(name)
FileNotFoundError: [Errno 2] No such file or directory
Traceback (most recent call last):
File "/home/dje/cpython-buildarea/3.x.edelsohn-rhel8-z.refleak/build/Lib/multiprocessing/util.py", line 300, in _run_finalizers
finalizer()
File "/home/dje/cpython-buildarea/3.x.edelsohn-rhel8-z.refleak/build/Lib/multiprocessing/util.py", line 224, in __call__
res = self._callback(*self._args, **self._kwargs)
File "/home/dje/cpython-buildarea/3.x.edelsohn-rhel8-z.refleak/build/Lib/multiprocessing/synchronize.py", line 87, in _cleanup
sem_unlink(name)
FileNotFoundError: [Errno 2] No such file or directory
Traceback (most recent call last):
File "/home/dje/cpython-buildarea/3.x.edelsohn-rhel8-z.refleak/build/Lib/multiprocessing/util.py", line 300, in _run_finalizers
finalizer()
File "/home/dje/cpython-buildarea/3.x.edelsohn-rhel8-z.refleak/build/Lib/multiprocessing/util.py", line 224, in __call__
res = self._callback(*self._args, **self._kwargs)
File "/home/dje/cpython-buildarea/3.x.edelsohn-rhel8-z.refleak/build/Lib/multiprocessing/synchronize.py", line 87, in _cleanup
sem_unlink(name)
FileNotFoundError: [Errno 2] No such file or directory
Traceback (most recent call last):
File "/home/dje/cpython-buildarea/3.x.edelsohn-rhel8-z.refleak/build/Lib/multiprocessing/util.py", line 300, in _run_finalizers
finalizer()
File "/home/dje/cpython-buildarea/3.x.edelsohn-rhel8-z.refleak/build/Lib/multiprocessing/util.py", line 224, in __call__
res = self._callback(*self._args, **self._kwargs)
File "/home/dje/cpython-buildarea/3.x.edelsohn-rhel8-z.refleak/build/Lib/multiprocessing/synchronize.py", line 87, in _cleanup
sem_unlink(name)
FileNotFoundError: [Errno 2] No such file or directory
Traceback (most recent call last):
File "/home/dje/cpython-buildarea/3.x.edelsohn-rhel8-z.refleak/build/Lib/multiprocessing/util.py", line 300, in _run_finalizers
finalizer()
File "/home/dje/cpython-buildarea/3.x.edelsohn-rhel8-z.refleak/build/Lib/multiprocessing/util.py", line 224, in __call__
res = self._callback(*self._args, **self._kwargs)
File "/home/dje/cpython-buildarea/3.x.edelsohn-rhel8-z.refleak/build/Lib/multiprocessing/synchronize.py", line 87, in _cleanup
sem_unlink(name)
FileNotFoundError: [Errno 2] No such file or directory
./home/dje/cpython-buildarea/3.x.edelsohn-rhel8-z.refleak/build/Lib/multiprocessing/resource_tracker.py:216: UserWarning: resource_tracker: There appear to be 6 leaked semaphore objects to clean up at shutdown
warnings.warn('resource_tracker: There appear to be %d '
Traceback (most recent call last):
File "/home/dje/cpython-buildarea/3.x.edelsohn-rhel8-z.refleak/build/Lib/multiprocessing/util.py", line 300, in _run_finalizers
finalizer()
File "/home/dje/cpython-buildarea/3.x.edelsohn-rhel8-z.refleak/build/Lib/multiprocessing/util.py", line 224, in __call__
res = self._callback(*self._args, **self._kwargs)
File "/home/dje/cpython-buildarea/3.x.edelsohn-rhel8-z.refleak/build/Lib/multiprocessing/synchronize.py", line 87, in _cleanup
sem_unlink(name)
FileNotFoundError: [Errno 2] No such file or directory
Traceback (most recent call last):
File "/home/dje/cpython-buildarea/3.x.edelsohn-rhel8-z.refleak/build/Lib/multiprocessing/util.py", line 300, in _run_finalizers
finalizer()
File "/home/dje/cpython-buildarea/3.x.edelsohn-rhel8-z.refleak/build/Lib/multiprocessing/util.py", line 224, in __call__
res = self._callback(*self._args, **self._kwargs)
File "/home/dje/cpython-buildarea/3.x.edelsohn-rhel8-z.refleak/build/Lib/multiprocessing/synchronize.py", line 87, in _cleanup
sem_unlink(name)
FileNotFoundError: [Errno 2] No such file or directory
Traceback (most recent call last):
File "/home/dje/cpython-buildarea/3.x.edelsohn-rhel8-z.refleak/build/Lib/multiprocessing/util.py", line 300, in _run_finalizers
finalizer()
File "/home/dje/cpython-buildarea/3.x.edelsohn-rhel8-z.refleak/build/Lib/multiprocessing/util.py", line 224, in __call__
res = self._callback(*self._args, **self._kwargs)
File "/home/dje/cpython-buildarea/3.x.edelsohn-rhel8-z.refleak/build/Lib/multiprocessing/synchronize.py", line 87, in _cleanup
sem_unlink(name)
FileNotFoundError: [Errno 2] No such file or directory
Traceback (most recent call last):
File "/home/dje/cpython-buildarea/3.x.edelsohn-rhel8-z.refleak/build/Lib/multiprocessing/util.py", line 300, in _run_finalizers
finalizer()
File "/home/dje/cpython-buildarea/3.x.edelsohn-rhel8-z.refleak/build/Lib/multiprocessing/util.py", line 224, in __call__
res = self._callback(*self._args, **self._kwargs)
File "/home/dje/cpython-buildarea/3.x.edelsohn-rhel8-z.refleak/build/Lib/multiprocessing/synchronize.py", line 87, in _cleanup
sem_unlink(name)
FileNotFoundError: [Errno 2] No such file or directory
Traceback (most recent call last):
File "/home/dje/cpython-buildarea/3.x.edelsohn-rhel8-z.refleak/build/Lib/multiprocessing/util.py", line 300, in _run_finalizers
finalizer()
File "/home/dje/cpython-buildarea/3.x.edelsohn-rhel8-z.refleak/build/Lib/multiprocessing/util.py", line 224, in __call__
res = self._callback(*self._args, **self._kwargs)
File "/home/dje/cpython-buildarea/3.x.edelsohn-rhel8-z.refleak/build/Lib/multiprocessing/synchronize.py", line 87, in _cleanup
sem_unlink(name)
FileNotFoundError: [Errno 2] No such file or directory
Traceback (most recent call last):
File "/home/dje/cpython-buildarea/3.x.edelsohn-rhel8-z.refleak/build/Lib/multiprocessing/util.py", line 300, in _run_finalizers
finalizer()
File "/home/dje/cpython-buildarea/3.x.edelsohn-rhel8-z.refleak/build/Lib/multiprocessing/util.py", line 224, in __call__
res = self._callback(*self._args, **self._kwargs)
File "/home/dje/cpython-buildarea/3.x.edelsohn-rhel8-z.refleak/build/Lib/multiprocessing/synchronize.py", line 87, in _cleanup
sem_unlink(name)
FileNotFoundError: [Errno 2] No such file or directory
./home/dje/cpython-buildarea/3.x.edelsohn-rhel8-z.refleak/build/Lib/multiprocessing/resource_tracker.py:216: UserWarning: resource_tracker: There appear to be 6 leaked semaphore objects to clean up at shutdown
warnings.warn('resource_tracker: There appear to be %d '
Traceback (most recent call last):
File "/home/dje/cpython-buildarea/3.x.edelsohn-rhel8-z.refleak/build/Lib/multiprocessing/util.py", line 300, in _run_finalizers
finalizer()
File "/home/dje/cpython-buildarea/3.x.edelsohn-rhel8-z.refleak/build/Lib/multiprocessing/util.py", line 224, in __call__
res = self._callback(*self._args, **self._kwargs)
File "/home/dje/cpython-buildarea/3.x.edelsohn-rhel8-z.refleak/build/Lib/multiprocessing/synchronize.py", line 87, in _cleanup
sem_unlink(name)
FileNotFoundError: [Errno 2] No such file or directory
Traceback (most recent call last):
File "/home/dje/cpython-buildarea/3.x.edelsohn-rhel8-z.refleak/build/Lib/multiprocessing/util.py", line 300, in _run_finalizers
finalizer()
File "/home/dje/cpython-buildarea/3.x.edelsohn-rhel8-z.refleak/build/Lib/multiprocessing/util.py", line 224, in __call__
res = self._callback(*self._args, **self._kwargs)
File "/home/dje/cpython-buildarea/3.x.edelsohn-rhel8-z.refleak/build/Lib/multiprocessing/synchronize.py", line 87, in _cleanup
sem_unlink(name)
FileNotFoundError: [Errno 2] No such file or directory
Traceback (most recent call last):
File "/home/dje/cpython-buildarea/3.x.edelsohn-rhel8-z.refleak/build/Lib/multiprocessing/util.py", line 300, in _run_finalizers
finalizer()
File "/home/dje/cpython-buildarea/3.x.edelsohn-rhel8-z.refleak/build/Lib/multiprocessing/util.py", line 224, in __call__
res = self._callback(*self._args, **self._kwargs)
File "/home/dje/cpython-buildarea/3.x.edelsohn-rhel8-z.refleak/build/Lib/multiprocessing/synchronize.py", line 87, in _cleanup
sem_unlink(name)
FileNotFoundError: [Errno 2] No such file or directory
Traceback (most recent call last):
File "/home/dje/cpython-buildarea/3.x.edelsohn-rhel8-z.refleak/build/Lib/multiprocessing/util.py", line 300, in _run_finalizers
finalizer()
File "/home/dje/cpython-buildarea/3.x.edelsohn-rhel8-z.refleak/build/Lib/multiprocessing/util.py", line 224, in __call__
res = self._callback(*self._args, **self._kwargs)
File "/home/dje/cpython-buildarea/3.x.edelsohn-rhel8-z.refleak/build/Lib/multiprocessing/synchronize.py", line 87, in _cleanup
sem_unlink(name)
FileNotFoundError: [Errno 2] No such file or directory
Traceback (most recent call last):
File "/home/dje/cpython-buildarea/3.x.edelsohn-rhel8-z.refleak/build/Lib/multiprocessing/util.py", line 300, in _run_finalizers
finalizer()
File "/home/dje/cpython-buildarea/3.x.edelsohn-rhel8-z.refleak/build/Lib/multiprocessing/util.py", line 224, in __call__
res = self._callback(*self._args, **self._kwargs)
File "/home/dje/cpython-buildarea/3.x.edelsohn-rhel8-z.refleak/build/Lib/multiprocessing/synchronize.py", line 87, in _cleanup
sem_unlink(name)
FileNotFoundError: [Errno 2] No such file or directory
Traceback (most recent call last):
File "/home/dje/cpython-buildarea/3.x.edelsohn-rhel8-z.refleak/build/Lib/multiprocessing/util.py", line 300, in _run_finalizers
finalizer()
File "/home/dje/cpython-buildarea/3.x.edelsohn-rhel8-z.refleak/build/Lib/multiprocessing/util.py", line 224, in __call__
res = self._callback(*self._args, **self._kwargs)
File "/home/dje/cpython-buildarea/3.x.edelsohn-rhel8-z.refleak/build/Lib/multiprocessing/synchronize.py", line 87, in _cleanup
sem_unlink(name)
FileNotFoundError: [Errno 2] No such file or directory
./home/dje/cpython-buildarea/3.x.edelsohn-rhel8-z.refleak/build/Lib/multiprocessing/resource_tracker.py:216: UserWarning: resource_tracker: There appear to be 6 leaked semaphore objects to clean up at shutdown
warnings.warn('resource_tracker: There appear to be %d '
Traceback (most recent call last):
File "/home/dje/cpython-buildarea/3.x.edelsohn-rhel8-z.refleak/build/Lib/multiprocessing/util.py", line 300, in _run_finalizers
finalizer()
File "/home/dje/cpython-buildarea/3.x.edelsohn-rhel8-z.refleak/build/Lib/multiprocessing/util.py", line 224, in __call__
res = self._callback(*self._args, **self._kwargs)
File "/home/dje/cpython-buildarea/3.x.edelsohn-rhel8-z.refleak/build/Lib/multiprocessing/synchronize.py", line 87, in _cleanup
sem_unlink(name)
FileNotFoundError: [Errno 2] No such file or directory
Traceback (most recent call last):
File "/home/dje/cpython-buildarea/3.x.edelsohn-rhel8-z.refleak/build/Lib/multiprocessing/util.py", line 300, in _run_finalizers
finalizer()
File "/home/dje/cpython-buildarea/3.x.edelsohn-rhel8-z.refleak/build/Lib/multiprocessing/util.py", line 224, in __call__
res = self._callback(*self._args, **self._kwargs)
File "/home/dje/cpython-buildarea/3.x.edelsohn-rhel8-z.refleak/build/Lib/multiprocessing/synchronize.py", line 87, in _cleanup
sem_unlink(name)
FileNotFoundError: [Errno 2] No such file or directory
Traceback (most recent call last):
File "/home/dje/cpython-buildarea/3.x.edelsohn-rhel8-z.refleak/build/Lib/multiprocessing/util.py", line 300, in _run_finalizers
finalizer()
File "/home/dje/cpython-buildarea/3.x.edelsohn-rhel8-z.refleak/build/Lib/multiprocessing/util.py", line 224, in __call__
res = self._callback(*self._args, **self._kwargs)
File "/home/dje/cpython-buildarea/3.x.edelsohn-rhel8-z.refleak/build/Lib/multiprocessing/synchronize.py", line 87, in _cleanup
sem_unlink(name)
FileNotFoundError: [Errno 2] No such file or directory
Traceback (most recent call last):
File "/home/dje/cpython-buildarea/3.x.edelsohn-rhel8-z.refleak/build/Lib/multiprocessing/util.py", line 300, in _run_finalizers
finalizer()
File "/home/dje/cpython-buildarea/3.x.edelsohn-rhel8-z.refleak/build/Lib/multiprocessing/util.py", line 224, in __call__
res = self._callback(*self._args, **self._kwargs)
File "/home/dje/cpython-buildarea/3.x.edelsohn-rhel8-z.refleak/build/Lib/multiprocessing/synchronize.py", line 87, in _cleanup
sem_unlink(name)
FileNotFoundError: [Errno 2] No such file or directory
Traceback (most recent call last):
File "/home/dje/cpython-buildarea/3.x.edelsohn-rhel8-z.refleak/build/Lib/multiprocessing/util.py", line 300, in _run_finalizers
finalizer()
File "/home/dje/cpython-buildarea/3.x.edelsohn-rhel8-z.refleak/build/Lib/multiprocessing/util.py", line 224, in __call__
res = self._callback(*self._args, **self._kwargs)
File "/home/dje/cpython-buildarea/3.x.edelsohn-rhel8-z.refleak/build/Lib/multiprocessing/synchronize.py", line 87, in _cleanup
sem_unlink(name)
FileNotFoundError: [Errno 2] No such file or directory
Traceback (most recent call last):
File "/home/dje/cpython-buildarea/3.x.edelsohn-rhel8-z.refleak/build/Lib/multiprocessing/util.py", line 300, in _run_finalizers
finalizer()
File "/home/dje/cpython-buildarea/3.x.edelsohn-rhel8-z.refleak/build/Lib/multiprocessing/util.py", line 224, in __call__
res = self._callback(*self._args, **self._kwargs)
File "/home/dje/cpython-buildarea/3.x.edelsohn-rhel8-z.refleak/build/Lib/multiprocessing/synchronize.py", line 87, in _cleanup
sem_unlink(name)
FileNotFoundError: [Errno 2] No such file or directory
./home/dje/cpython-buildarea/3.x.edelsohn-rhel8-z.refleak/build/Lib/multiprocessing/resource_tracker.py:216: UserWarning: resource_tracker: There appear to be 6 leaked semaphore objects to clean up at shutdown
warnings.warn('resource_tracker: There appear to be %d '
Traceback (most recent call last):
File "/home/dje/cpython-buildarea/3.x.edelsohn-rhel8-z.refleak/build/Lib/multiprocessing/util.py", line 300, in _run_finalizers
finalizer()
File "/home/dje/cpython-buildarea/3.x.edelsohn-rhel8-z.refleak/build/Lib/multiprocessing/util.py", line 224, in __call__
res = self._callback(*self._args, **self._kwargs)
File "/home/dje/cpython-buildarea/3.x.edelsohn-rhel8-z.refleak/build/Lib/multiprocessing/synchronize.py", line 87, in _cleanup
sem_unlink(name)
FileNotFoundError: [Errno 2] No such file or directory
Traceback (most recent call last):
File "/home/dje/cpython-buildarea/3.x.edelsohn-rhel8-z.refleak/build/Lib/multiprocessing/util.py", line 300, in _run_finalizers
finalizer()
File "/home/dje/cpython-buildarea/3.x.edelsohn-rhel8-z.refleak/build/Lib/multiprocessing/util.py", line 224, in __call__
res = self._callback(*self._args, **self._kwargs)
File "/home/dje/cpython-buildarea/3.x.edelsohn-rhel8-z.refleak/build/Lib/multiprocessing/synchronize.py", line 87, in _cleanup
sem_unlink(name)
FileNotFoundError: [Errno 2] No such file or directory
Traceback (most recent call last):
File "/home/dje/cpython-buildarea/3.x.edelsohn-rhel8-z.refleak/build/Lib/multiprocessing/util.py", line 300, in _run_finalizers
finalizer()
File "/home/dje/cpython-buildarea/3.x.edelsohn-rhel8-z.refleak/build/Lib/multiprocessing/util.py", line 224, in __call__
res = self._callback(*self._args, **self._kwargs)
File "/home/dje/cpython-buildarea/3.x.edelsohn-rhel8-z.refleak/build/Lib/multiprocessing/synchronize.py", line 87, in _cleanup
sem_unlink(name)
FileNotFoundError: [Errno 2] No such file or directory
Traceback (most recent call last):
File "/home/dje/cpython-buildarea/3.x.edelsohn-rhel8-z.refleak/build/Lib/multiprocessing/util.py", line 300, in _run_finalizers
finalizer()
File "/home/dje/cpython-buildarea/3.x.edelsohn-rhel8-z.refleak/build/Lib/multiprocessing/util.py", line 224, in __call__
res = self._callback(*self._args, **self._kwargs)
File "/home/dje/cpython-buildarea/3.x.edelsohn-rhel8-z.refleak/build/Lib/multiprocessing/synchronize.py", line 87, in _cleanup
sem_unlink(name)
FileNotFoundError: [Errno 2] No such file or directory
Traceback (most recent call last):
File "/home/dje/cpython-buildarea/3.x.edelsohn-rhel8-z.refleak/build/Lib/multiprocessing/util.py", line 300, in _run_finalizers
finalizer()
File "/home/dje/cpython-buildarea/3.x.edelsohn-rhel8-z.refleak/build/Lib/multiprocessing/util.py", line 224, in __call__
res = self._callback(*self._args, **self._kwargs)
File "/home/dje/cpython-buildarea/3.x.edelsohn-rhel8-z.refleak/build/Lib/multiprocessing/synchronize.py", line 87, in _cleanup
sem_unlink(name)
FileNotFoundError: [Errno 2] No such file or directory
Traceback (most recent call last):
File "/home/dje/cpython-buildarea/3.x.edelsohn-rhel8-z.refleak/build/Lib/multiprocessing/util.py", line 300, in _run_finalizers
finalizer()
File "/home/dje/cpython-buildarea/3.x.edelsohn-rhel8-z.refleak/build/Lib/multiprocessing/util.py", line 224, in __call__
res = self._callback(*self._args, **self._kwargs)
File "/home/dje/cpython-buildarea/3.x.edelsohn-rhel8-z.refleak/build/Lib/multiprocessing/synchronize.py", line 87, in _cleanup
sem_unlink(name)
FileNotFoundError: [Errno 2] No such file or directory
./home/dje/cpython-buildarea/3.x.edelsohn-rhel8-z.refleak/build/Lib/multiprocessing/resource_tracker.py:216: UserWarning: resource_tracker: There appear to be 6 leaked semaphore objects to clean up at shutdown
warnings.warn('resource_tracker: There appear to be %d '
Traceback (most recent call last):
File "/home/dje/cpython-buildarea/3.x.edelsohn-rhel8-z.refleak/build/Lib/multiprocessing/util.py", line 300, in _run_finalizers
finalizer()
File "/home/dje/cpython-buildarea/3.x.edelsohn-rhel8-z.refleak/build/Lib/multiprocessing/util.py", line 224, in __call__
res = self._callback(*self._args, **self._kwargs)
File "/home/dje/cpython-buildarea/3.x.edelsohn-rhel8-z.refleak/build/Lib/multiprocessing/synchronize.py", line 87, in _cleanup
sem_unlink(name)
FileNotFoundError: [Errno 2] No such file or directory
Traceback (most recent call last):
File "/home/dje/cpython-buildarea/3.x.edelsohn-rhel8-z.refleak/build/Lib/multiprocessing/util.py", line 300, in _run_finalizers
finalizer()
File "/home/dje/cpython-buildarea/3.x.edelsohn-rhel8-z.refleak/build/Lib/multiprocessing/util.py", line 224, in __call__
res = self._callback(*self._args, **self._kwargs)
File "/home/dje/cpython-buildarea/3.x.edelsohn-rhel8-z.refleak/build/Lib/multiprocessing/synchronize.py", line 87, in _cleanup
sem_unlink(name)
FileNotFoundError: [Errno 2] No such file or directory
Traceback (most recent call last):
File "/home/dje/cpython-buildarea/3.x.edelsohn-rhel8-z.refleak/build/Lib/multiprocessing/util.py", line 300, in _run_finalizers
finalizer()
File "/home/dje/cpython-buildarea/3.x.edelsohn-rhel8-z.refleak/build/Lib/multiprocessing/util.py", line 224, in __call__
res = self._callback(*self._args, **self._kwargs)
File "/home/dje/cpython-buildarea/3.x.edelsohn-rhel8-z.refleak/build/Lib/multiprocessing/synchronize.py", line 87, in _cleanup
sem_unlink(name)
FileNotFoundError: [Errno 2] No such file or directory
Traceback (most recent call last):
File "/home/dje/cpython-buildarea/3.x.edelsohn-rhel8-z.refleak/build/Lib/multiprocessing/util.py", line 300, in _run_finalizers
finalizer()
File "/home/dje/cpython-buildarea/3.x.edelsohn-rhel8-z.refleak/build/Lib/multiprocessing/util.py", line 224, in __call__
res = self._callback(*self._args, **self._kwargs)
File "/home/dje/cpython-buildarea/3.x.edelsohn-rhel8-z.refleak/build/Lib/multiprocessing/synchronize.py", line 87, in _cleanup
sem_unlink(name)
FileNotFoundError: [Errno 2] No such file or directory
Traceback (most recent call last):
File "/home/dje/cpython-buildarea/3.x.edelsohn-rhel8-z.refleak/build/Lib/multiprocessing/util.py", line 300, in _run_finalizers
finalizer()
File "/home/dje/cpython-buildarea/3.x.edelsohn-rhel8-z.refleak/build/Lib/multiprocessing/util.py", line 224, in __call__
res = self._callback(*self._args, **self._kwargs)
File "/home/dje/cpython-buildarea/3.x.edelsohn-rhel8-z.refleak/build/Lib/multiprocessing/synchronize.py", line 87, in _cleanup
sem_unlink(name)
FileNotFoundError: [Errno 2] No such file or directory
Traceback (most recent call last):
File "/home/dje/cpython-buildarea/3.x.edelsohn-rhel8-z.refleak/build/Lib/multiprocessing/util.py", line 300, in _run_finalizers
finalizer()
File "/home/dje/cpython-buildarea/3.x.edelsohn-rhel8-z.refleak/build/Lib/multiprocessing/util.py", line 224, in __call__
res = self._callback(*self._args, **self._kwargs)
File "/home/dje/cpython-buildarea/3.x.edelsohn-rhel8-z.refleak/build/Lib/multiprocessing/synchronize.py", line 87, in _cleanup
sem_unlink(name)
FileNotFoundError: [Errno 2] No such file or directory
.
Test report
===========
Failed tests:
- test_socketserver
- test_logging
Test leaking resources:
- test_logging: references
- test_socketserver: references
- test_logging: memory blocks
- test_socketserver: memory blocks
Sincerely,
-The Buildbot
1
0
Nov. 2, 2020
The Buildbot has detected a new failure on builder AMD64 RHEL7 Refleaks 3.x while building Python.
Full details are available at:
https://buildbot.python.org/all/#builders/562/builds/79
Buildbot URL: https://buildbot.python.org/all/
Worker for this Build: cstratak-RHEL7-x86_64
Build Reason: <unknown>
Blamelist:
BUILD FAILED: failed test (failure)
Summary of the results of the build (if available):
===================================================
== Tests result: FAILURE then FAILURE ==
408 tests OK.
10 slowest tests:
- test_asyncio: 32 min 46 sec
- test_signal: 31 min 2 sec
- test_pydoc: 29 min 46 sec
- test_concurrent_futures: 18 min 53 sec
- test_peg_generator: 11 min 9 sec
- test_multiprocessing_spawn: 10 min
- test_mailbox: 8 min 8 sec
- test_shelve: 7 min 44 sec
- test_multiprocessing_forkserver: 7 min 9 sec
- test_multiprocessing_fork: 5 min 56 sec
2 tests failed:
test_logging test_socketserver
14 tests skipped:
test_devpoll test_gdb test_ioctl test_kqueue test_msilib
test_ossaudiodev test_startfile test_tix test_tk test_ttk_guionly
test_winconsoleio test_winreg test_winsound test_zipfile64
2 re-run tests:
test_logging test_socketserver
Total duration: 47 min 44 sec
Captured traceback
==================
Traceback (most recent call last):
File "/home/buildbot/buildarea/3.x.cstratak-RHEL7-x86_64.refleak/build/Lib/multiprocessing/util.py", line 300, in _run_finalizers
finalizer()
File "/home/buildbot/buildarea/3.x.cstratak-RHEL7-x86_64.refleak/build/Lib/multiprocessing/util.py", line 224, in __call__
res = self._callback(*self._args, **self._kwargs)
File "/home/buildbot/buildarea/3.x.cstratak-RHEL7-x86_64.refleak/build/Lib/multiprocessing/synchronize.py", line 87, in _cleanup
sem_unlink(name)
FileNotFoundError: [Errno 2] No such file or directory
Traceback (most recent call last):
File "/home/buildbot/buildarea/3.x.cstratak-RHEL7-x86_64.refleak/build/Lib/multiprocessing/util.py", line 300, in _run_finalizers
finalizer()
File "/home/buildbot/buildarea/3.x.cstratak-RHEL7-x86_64.refleak/build/Lib/multiprocessing/util.py", line 224, in __call__
res = self._callback(*self._args, **self._kwargs)
File "/home/buildbot/buildarea/3.x.cstratak-RHEL7-x86_64.refleak/build/Lib/multiprocessing/synchronize.py", line 87, in _cleanup
sem_unlink(name)
FileNotFoundError: [Errno 2] No such file or directory
Traceback (most recent call last):
File "/home/buildbot/buildarea/3.x.cstratak-RHEL7-x86_64.refleak/build/Lib/multiprocessing/util.py", line 300, in _run_finalizers
finalizer()
File "/home/buildbot/buildarea/3.x.cstratak-RHEL7-x86_64.refleak/build/Lib/multiprocessing/util.py", line 224, in __call__
res = self._callback(*self._args, **self._kwargs)
File "/home/buildbot/buildarea/3.x.cstratak-RHEL7-x86_64.refleak/build/Lib/multiprocessing/synchronize.py", line 87, in _cleanup
sem_unlink(name)
FileNotFoundError: [Errno 2] No such file or directory
Traceback (most recent call last):
File "/home/buildbot/buildarea/3.x.cstratak-RHEL7-x86_64.refleak/build/Lib/multiprocessing/util.py", line 300, in _run_finalizers
finalizer()
File "/home/buildbot/buildarea/3.x.cstratak-RHEL7-x86_64.refleak/build/Lib/multiprocessing/util.py", line 224, in __call__
res = self._callback(*self._args, **self._kwargs)
File "/home/buildbot/buildarea/3.x.cstratak-RHEL7-x86_64.refleak/build/Lib/multiprocessing/synchronize.py", line 87, in _cleanup
sem_unlink(name)
FileNotFoundError: [Errno 2] No such file or directory
Traceback (most recent call last):
File "/home/buildbot/buildarea/3.x.cstratak-RHEL7-x86_64.refleak/build/Lib/multiprocessing/util.py", line 300, in _run_finalizers
finalizer()
File "/home/buildbot/buildarea/3.x.cstratak-RHEL7-x86_64.refleak/build/Lib/multiprocessing/util.py", line 224, in __call__
res = self._callback(*self._args, **self._kwargs)
File "/home/buildbot/buildarea/3.x.cstratak-RHEL7-x86_64.refleak/build/Lib/multiprocessing/synchronize.py", line 87, in _cleanup
sem_unlink(name)
FileNotFoundError: [Errno 2] No such file or directory
Traceback (most recent call last):
File "/home/buildbot/buildarea/3.x.cstratak-RHEL7-x86_64.refleak/build/Lib/multiprocessing/util.py", line 300, in _run_finalizers
finalizer()
File "/home/buildbot/buildarea/3.x.cstratak-RHEL7-x86_64.refleak/build/Lib/multiprocessing/util.py", line 224, in __call__
res = self._callback(*self._args, **self._kwargs)
File "/home/buildbot/buildarea/3.x.cstratak-RHEL7-x86_64.refleak/build/Lib/multiprocessing/synchronize.py", line 87, in _cleanup
sem_unlink(name)
FileNotFoundError: [Errno 2] No such file or directory
./home/buildbot/buildarea/3.x.cstratak-RHEL7-x86_64.refleak/build/Lib/multiprocessing/resource_tracker.py:216: UserWarning: resource_tracker: There appear to be 6 leaked semaphore objects to clean up at shutdown
warnings.warn('resource_tracker: There appear to be %d '
Traceback (most recent call last):
File "/home/buildbot/buildarea/3.x.cstratak-RHEL7-x86_64.refleak/build/Lib/multiprocessing/util.py", line 300, in _run_finalizers
finalizer()
File "/home/buildbot/buildarea/3.x.cstratak-RHEL7-x86_64.refleak/build/Lib/multiprocessing/util.py", line 224, in __call__
res = self._callback(*self._args, **self._kwargs)
File "/home/buildbot/buildarea/3.x.cstratak-RHEL7-x86_64.refleak/build/Lib/multiprocessing/synchronize.py", line 87, in _cleanup
sem_unlink(name)
FileNotFoundError: [Errno 2] No such file or directory
Traceback (most recent call last):
File "/home/buildbot/buildarea/3.x.cstratak-RHEL7-x86_64.refleak/build/Lib/multiprocessing/util.py", line 300, in _run_finalizers
finalizer()
File "/home/buildbot/buildarea/3.x.cstratak-RHEL7-x86_64.refleak/build/Lib/multiprocessing/util.py", line 224, in __call__
res = self._callback(*self._args, **self._kwargs)
File "/home/buildbot/buildarea/3.x.cstratak-RHEL7-x86_64.refleak/build/Lib/multiprocessing/synchronize.py", line 87, in _cleanup
sem_unlink(name)
FileNotFoundError: [Errno 2] No such file or directory
Traceback (most recent call last):
File "/home/buildbot/buildarea/3.x.cstratak-RHEL7-x86_64.refleak/build/Lib/multiprocessing/util.py", line 300, in _run_finalizers
finalizer()
File "/home/buildbot/buildarea/3.x.cstratak-RHEL7-x86_64.refleak/build/Lib/multiprocessing/util.py", line 224, in __call__
res = self._callback(*self._args, **self._kwargs)
File "/home/buildbot/buildarea/3.x.cstratak-RHEL7-x86_64.refleak/build/Lib/multiprocessing/synchronize.py", line 87, in _cleanup
sem_unlink(name)
FileNotFoundError: [Errno 2] No such file or directory
Traceback (most recent call last):
File "/home/buildbot/buildarea/3.x.cstratak-RHEL7-x86_64.refleak/build/Lib/multiprocessing/util.py", line 300, in _run_finalizers
finalizer()
File "/home/buildbot/buildarea/3.x.cstratak-RHEL7-x86_64.refleak/build/Lib/multiprocessing/util.py", line 224, in __call__
res = self._callback(*self._args, **self._kwargs)
File "/home/buildbot/buildarea/3.x.cstratak-RHEL7-x86_64.refleak/build/Lib/multiprocessing/synchronize.py", line 87, in _cleanup
sem_unlink(name)
FileNotFoundError: [Errno 2] No such file or directory
Traceback (most recent call last):
File "/home/buildbot/buildarea/3.x.cstratak-RHEL7-x86_64.refleak/build/Lib/multiprocessing/util.py", line 300, in _run_finalizers
finalizer()
File "/home/buildbot/buildarea/3.x.cstratak-RHEL7-x86_64.refleak/build/Lib/multiprocessing/util.py", line 224, in __call__
res = self._callback(*self._args, **self._kwargs)
File "/home/buildbot/buildarea/3.x.cstratak-RHEL7-x86_64.refleak/build/Lib/multiprocessing/synchronize.py", line 87, in _cleanup
sem_unlink(name)
FileNotFoundError: [Errno 2] No such file or directory
Traceback (most recent call last):
File "/home/buildbot/buildarea/3.x.cstratak-RHEL7-x86_64.refleak/build/Lib/multiprocessing/util.py", line 300, in _run_finalizers
finalizer()
File "/home/buildbot/buildarea/3.x.cstratak-RHEL7-x86_64.refleak/build/Lib/multiprocessing/util.py", line 224, in __call__
res = self._callback(*self._args, **self._kwargs)
File "/home/buildbot/buildarea/3.x.cstratak-RHEL7-x86_64.refleak/build/Lib/multiprocessing/synchronize.py", line 87, in _cleanup
sem_unlink(name)
FileNotFoundError: [Errno 2] No such file or directory
./home/buildbot/buildarea/3.x.cstratak-RHEL7-x86_64.refleak/build/Lib/multiprocessing/resource_tracker.py:216: UserWarning: resource_tracker: There appear to be 6 leaked semaphore objects to clean up at shutdown
warnings.warn('resource_tracker: There appear to be %d '
Traceback (most recent call last):
File "/home/buildbot/buildarea/3.x.cstratak-RHEL7-x86_64.refleak/build/Lib/multiprocessing/util.py", line 300, in _run_finalizers
finalizer()
File "/home/buildbot/buildarea/3.x.cstratak-RHEL7-x86_64.refleak/build/Lib/multiprocessing/util.py", line 224, in __call__
res = self._callback(*self._args, **self._kwargs)
File "/home/buildbot/buildarea/3.x.cstratak-RHEL7-x86_64.refleak/build/Lib/multiprocessing/synchronize.py", line 87, in _cleanup
sem_unlink(name)
FileNotFoundError: [Errno 2] No such file or directory
Traceback (most recent call last):
File "/home/buildbot/buildarea/3.x.cstratak-RHEL7-x86_64.refleak/build/Lib/multiprocessing/util.py", line 300, in _run_finalizers
finalizer()
File "/home/buildbot/buildarea/3.x.cstratak-RHEL7-x86_64.refleak/build/Lib/multiprocessing/util.py", line 224, in __call__
res = self._callback(*self._args, **self._kwargs)
File "/home/buildbot/buildarea/3.x.cstratak-RHEL7-x86_64.refleak/build/Lib/multiprocessing/synchronize.py", line 87, in _cleanup
sem_unlink(name)
FileNotFoundError: [Errno 2] No such file or directory
Traceback (most recent call last):
File "/home/buildbot/buildarea/3.x.cstratak-RHEL7-x86_64.refleak/build/Lib/multiprocessing/util.py", line 300, in _run_finalizers
finalizer()
File "/home/buildbot/buildarea/3.x.cstratak-RHEL7-x86_64.refleak/build/Lib/multiprocessing/util.py", line 224, in __call__
res = self._callback(*self._args, **self._kwargs)
File "/home/buildbot/buildarea/3.x.cstratak-RHEL7-x86_64.refleak/build/Lib/multiprocessing/synchronize.py", line 87, in _cleanup
sem_unlink(name)
FileNotFoundError: [Errno 2] No such file or directory
Traceback (most recent call last):
File "/home/buildbot/buildarea/3.x.cstratak-RHEL7-x86_64.refleak/build/Lib/multiprocessing/util.py", line 300, in _run_finalizers
finalizer()
File "/home/buildbot/buildarea/3.x.cstratak-RHEL7-x86_64.refleak/build/Lib/multiprocessing/util.py", line 224, in __call__
res = self._callback(*self._args, **self._kwargs)
File "/home/buildbot/buildarea/3.x.cstratak-RHEL7-x86_64.refleak/build/Lib/multiprocessing/synchronize.py", line 87, in _cleanup
sem_unlink(name)
FileNotFoundError: [Errno 2] No such file or directory
Traceback (most recent call last):
File "/home/buildbot/buildarea/3.x.cstratak-RHEL7-x86_64.refleak/build/Lib/multiprocessing/util.py", line 300, in _run_finalizers
finalizer()
File "/home/buildbot/buildarea/3.x.cstratak-RHEL7-x86_64.refleak/build/Lib/multiprocessing/util.py", line 224, in __call__
res = self._callback(*self._args, **self._kwargs)
File "/home/buildbot/buildarea/3.x.cstratak-RHEL7-x86_64.refleak/build/Lib/multiprocessing/synchronize.py", line 87, in _cleanup
sem_unlink(name)
FileNotFoundError: [Errno 2] No such file or directory
Traceback (most recent call last):
File "/home/buildbot/buildarea/3.x.cstratak-RHEL7-x86_64.refleak/build/Lib/multiprocessing/util.py", line 300, in _run_finalizers
finalizer()
File "/home/buildbot/buildarea/3.x.cstratak-RHEL7-x86_64.refleak/build/Lib/multiprocessing/util.py", line 224, in __call__
res = self._callback(*self._args, **self._kwargs)
File "/home/buildbot/buildarea/3.x.cstratak-RHEL7-x86_64.refleak/build/Lib/multiprocessing/synchronize.py", line 87, in _cleanup
sem_unlink(name)
FileNotFoundError: [Errno 2] No such file or directory
./home/buildbot/buildarea/3.x.cstratak-RHEL7-x86_64.refleak/build/Lib/multiprocessing/resource_tracker.py:216: UserWarning: resource_tracker: There appear to be 6 leaked semaphore objects to clean up at shutdown
warnings.warn('resource_tracker: There appear to be %d '
Traceback (most recent call last):
File "/home/buildbot/buildarea/3.x.cstratak-RHEL7-x86_64.refleak/build/Lib/multiprocessing/util.py", line 300, in _run_finalizers
finalizer()
File "/home/buildbot/buildarea/3.x.cstratak-RHEL7-x86_64.refleak/build/Lib/multiprocessing/util.py", line 224, in __call__
res = self._callback(*self._args, **self._kwargs)
File "/home/buildbot/buildarea/3.x.cstratak-RHEL7-x86_64.refleak/build/Lib/multiprocessing/synchronize.py", line 87, in _cleanup
sem_unlink(name)
FileNotFoundError: [Errno 2] No such file or directory
Traceback (most recent call last):
File "/home/buildbot/buildarea/3.x.cstratak-RHEL7-x86_64.refleak/build/Lib/multiprocessing/util.py", line 300, in _run_finalizers
finalizer()
File "/home/buildbot/buildarea/3.x.cstratak-RHEL7-x86_64.refleak/build/Lib/multiprocessing/util.py", line 224, in __call__
res = self._callback(*self._args, **self._kwargs)
File "/home/buildbot/buildarea/3.x.cstratak-RHEL7-x86_64.refleak/build/Lib/multiprocessing/synchronize.py", line 87, in _cleanup
sem_unlink(name)
FileNotFoundError: [Errno 2] No such file or directory
Traceback (most recent call last):
File "/home/buildbot/buildarea/3.x.cstratak-RHEL7-x86_64.refleak/build/Lib/multiprocessing/util.py", line 300, in _run_finalizers
finalizer()
File "/home/buildbot/buildarea/3.x.cstratak-RHEL7-x86_64.refleak/build/Lib/multiprocessing/util.py", line 224, in __call__
res = self._callback(*self._args, **self._kwargs)
File "/home/buildbot/buildarea/3.x.cstratak-RHEL7-x86_64.refleak/build/Lib/multiprocessing/synchronize.py", line 87, in _cleanup
sem_unlink(name)
FileNotFoundError: [Errno 2] No such file or directory
Traceback (most recent call last):
File "/home/buildbot/buildarea/3.x.cstratak-RHEL7-x86_64.refleak/build/Lib/multiprocessing/util.py", line 300, in _run_finalizers
finalizer()
File "/home/buildbot/buildarea/3.x.cstratak-RHEL7-x86_64.refleak/build/Lib/multiprocessing/util.py", line 224, in __call__
res = self._callback(*self._args, **self._kwargs)
File "/home/buildbot/buildarea/3.x.cstratak-RHEL7-x86_64.refleak/build/Lib/multiprocessing/synchronize.py", line 87, in _cleanup
sem_unlink(name)
FileNotFoundError: [Errno 2] No such file or directory
Traceback (most recent call last):
File "/home/buildbot/buildarea/3.x.cstratak-RHEL7-x86_64.refleak/build/Lib/multiprocessing/util.py", line 300, in _run_finalizers
finalizer()
File "/home/buildbot/buildarea/3.x.cstratak-RHEL7-x86_64.refleak/build/Lib/multiprocessing/util.py", line 224, in __call__
res = self._callback(*self._args, **self._kwargs)
File "/home/buildbot/buildarea/3.x.cstratak-RHEL7-x86_64.refleak/build/Lib/multiprocessing/synchronize.py", line 87, in _cleanup
sem_unlink(name)
FileNotFoundError: [Errno 2] No such file or directory
Traceback (most recent call last):
File "/home/buildbot/buildarea/3.x.cstratak-RHEL7-x86_64.refleak/build/Lib/multiprocessing/util.py", line 300, in _run_finalizers
finalizer()
File "/home/buildbot/buildarea/3.x.cstratak-RHEL7-x86_64.refleak/build/Lib/multiprocessing/util.py", line 224, in __call__
res = self._callback(*self._args, **self._kwargs)
File "/home/buildbot/buildarea/3.x.cstratak-RHEL7-x86_64.refleak/build/Lib/multiprocessing/synchronize.py", line 87, in _cleanup
sem_unlink(name)
FileNotFoundError: [Errno 2] No such file or directory
./home/buildbot/buildarea/3.x.cstratak-RHEL7-x86_64.refleak/build/Lib/multiprocessing/resource_tracker.py:216: UserWarning: resource_tracker: There appear to be 6 leaked semaphore objects to clean up at shutdown
warnings.warn('resource_tracker: There appear to be %d '
Traceback (most recent call last):
File "/home/buildbot/buildarea/3.x.cstratak-RHEL7-x86_64.refleak/build/Lib/multiprocessing/util.py", line 300, in _run_finalizers
finalizer()
File "/home/buildbot/buildarea/3.x.cstratak-RHEL7-x86_64.refleak/build/Lib/multiprocessing/util.py", line 224, in __call__
res = self._callback(*self._args, **self._kwargs)
File "/home/buildbot/buildarea/3.x.cstratak-RHEL7-x86_64.refleak/build/Lib/multiprocessing/synchronize.py", line 87, in _cleanup
sem_unlink(name)
FileNotFoundError: [Errno 2] No such file or directory
Traceback (most recent call last):
File "/home/buildbot/buildarea/3.x.cstratak-RHEL7-x86_64.refleak/build/Lib/multiprocessing/util.py", line 300, in _run_finalizers
finalizer()
File "/home/buildbot/buildarea/3.x.cstratak-RHEL7-x86_64.refleak/build/Lib/multiprocessing/util.py", line 224, in __call__
res = self._callback(*self._args, **self._kwargs)
File "/home/buildbot/buildarea/3.x.cstratak-RHEL7-x86_64.refleak/build/Lib/multiprocessing/synchronize.py", line 87, in _cleanup
sem_unlink(name)
FileNotFoundError: [Errno 2] No such file or directory
Traceback (most recent call last):
File "/home/buildbot/buildarea/3.x.cstratak-RHEL7-x86_64.refleak/build/Lib/multiprocessing/util.py", line 300, in _run_finalizers
finalizer()
File "/home/buildbot/buildarea/3.x.cstratak-RHEL7-x86_64.refleak/build/Lib/multiprocessing/util.py", line 224, in __call__
res = self._callback(*self._args, **self._kwargs)
File "/home/buildbot/buildarea/3.x.cstratak-RHEL7-x86_64.refleak/build/Lib/multiprocessing/synchronize.py", line 87, in _cleanup
sem_unlink(name)
FileNotFoundError: [Errno 2] No such file or directory
Traceback (most recent call last):
File "/home/buildbot/buildarea/3.x.cstratak-RHEL7-x86_64.refleak/build/Lib/multiprocessing/util.py", line 300, in _run_finalizers
finalizer()
File "/home/buildbot/buildarea/3.x.cstratak-RHEL7-x86_64.refleak/build/Lib/multiprocessing/util.py", line 224, in __call__
res = self._callback(*self._args, **self._kwargs)
File "/home/buildbot/buildarea/3.x.cstratak-RHEL7-x86_64.refleak/build/Lib/multiprocessing/synchronize.py", line 87, in _cleanup
sem_unlink(name)
FileNotFoundError: [Errno 2] No such file or directory
Traceback (most recent call last):
File "/home/buildbot/buildarea/3.x.cstratak-RHEL7-x86_64.refleak/build/Lib/multiprocessing/util.py", line 300, in _run_finalizers
finalizer()
File "/home/buildbot/buildarea/3.x.cstratak-RHEL7-x86_64.refleak/build/Lib/multiprocessing/util.py", line 224, in __call__
res = self._callback(*self._args, **self._kwargs)
File "/home/buildbot/buildarea/3.x.cstratak-RHEL7-x86_64.refleak/build/Lib/multiprocessing/synchronize.py", line 87, in _cleanup
sem_unlink(name)
FileNotFoundError: [Errno 2] No such file or directory
Traceback (most recent call last):
File "/home/buildbot/buildarea/3.x.cstratak-RHEL7-x86_64.refleak/build/Lib/multiprocessing/util.py", line 300, in _run_finalizers
finalizer()
File "/home/buildbot/buildarea/3.x.cstratak-RHEL7-x86_64.refleak/build/Lib/multiprocessing/util.py", line 224, in __call__
res = self._callback(*self._args, **self._kwargs)
File "/home/buildbot/buildarea/3.x.cstratak-RHEL7-x86_64.refleak/build/Lib/multiprocessing/synchronize.py", line 87, in _cleanup
sem_unlink(name)
FileNotFoundError: [Errno 2] No such file or directory
./home/buildbot/buildarea/3.x.cstratak-RHEL7-x86_64.refleak/build/Lib/multiprocessing/resource_tracker.py:216: UserWarning: resource_tracker: There appear to be 6 leaked semaphore objects to clean up at shutdown
warnings.warn('resource_tracker: There appear to be %d '
Traceback (most recent call last):
File "/home/buildbot/buildarea/3.x.cstratak-RHEL7-x86_64.refleak/build/Lib/multiprocessing/util.py", line 300, in _run_finalizers
finalizer()
File "/home/buildbot/buildarea/3.x.cstratak-RHEL7-x86_64.refleak/build/Lib/multiprocessing/util.py", line 224, in __call__
res = self._callback(*self._args, **self._kwargs)
File "/home/buildbot/buildarea/3.x.cstratak-RHEL7-x86_64.refleak/build/Lib/multiprocessing/synchronize.py", line 87, in _cleanup
sem_unlink(name)
FileNotFoundError: [Errno 2] No such file or directory
Traceback (most recent call last):
File "/home/buildbot/buildarea/3.x.cstratak-RHEL7-x86_64.refleak/build/Lib/multiprocessing/util.py", line 300, in _run_finalizers
finalizer()
File "/home/buildbot/buildarea/3.x.cstratak-RHEL7-x86_64.refleak/build/Lib/multiprocessing/util.py", line 224, in __call__
res = self._callback(*self._args, **self._kwargs)
File "/home/buildbot/buildarea/3.x.cstratak-RHEL7-x86_64.refleak/build/Lib/multiprocessing/synchronize.py", line 87, in _cleanup
sem_unlink(name)
FileNotFoundError: [Errno 2] No such file or directory
Traceback (most recent call last):
File "/home/buildbot/buildarea/3.x.cstratak-RHEL7-x86_64.refleak/build/Lib/multiprocessing/util.py", line 300, in _run_finalizers
finalizer()
File "/home/buildbot/buildarea/3.x.cstratak-RHEL7-x86_64.refleak/build/Lib/multiprocessing/util.py", line 224, in __call__
res = self._callback(*self._args, **self._kwargs)
File "/home/buildbot/buildarea/3.x.cstratak-RHEL7-x86_64.refleak/build/Lib/multiprocessing/synchronize.py", line 87, in _cleanup
sem_unlink(name)
FileNotFoundError: [Errno 2] No such file or directory
Traceback (most recent call last):
File "/home/buildbot/buildarea/3.x.cstratak-RHEL7-x86_64.refleak/build/Lib/multiprocessing/util.py", line 300, in _run_finalizers
finalizer()
File "/home/buildbot/buildarea/3.x.cstratak-RHEL7-x86_64.refleak/build/Lib/multiprocessing/util.py", line 224, in __call__
res = self._callback(*self._args, **self._kwargs)
File "/home/buildbot/buildarea/3.x.cstratak-RHEL7-x86_64.refleak/build/Lib/multiprocessing/synchronize.py", line 87, in _cleanup
sem_unlink(name)
FileNotFoundError: [Errno 2] No such file or directory
Traceback (most recent call last):
File "/home/buildbot/buildarea/3.x.cstratak-RHEL7-x86_64.refleak/build/Lib/multiprocessing/util.py", line 300, in _run_finalizers
finalizer()
File "/home/buildbot/buildarea/3.x.cstratak-RHEL7-x86_64.refleak/build/Lib/multiprocessing/util.py", line 224, in __call__
res = self._callback(*self._args, **self._kwargs)
File "/home/buildbot/buildarea/3.x.cstratak-RHEL7-x86_64.refleak/build/Lib/multiprocessing/synchronize.py", line 87, in _cleanup
sem_unlink(name)
FileNotFoundError: [Errno 2] No such file or directory
Traceback (most recent call last):
File "/home/buildbot/buildarea/3.x.cstratak-RHEL7-x86_64.refleak/build/Lib/multiprocessing/util.py", line 300, in _run_finalizers
finalizer()
File "/home/buildbot/buildarea/3.x.cstratak-RHEL7-x86_64.refleak/build/Lib/multiprocessing/util.py", line 224, in __call__
res = self._callback(*self._args, **self._kwargs)
File "/home/buildbot/buildarea/3.x.cstratak-RHEL7-x86_64.refleak/build/Lib/multiprocessing/synchronize.py", line 87, in _cleanup
sem_unlink(name)
FileNotFoundError: [Errno 2] No such file or directory
.
Test report
===========
Failed tests:
- test_socketserver
- test_logging
Test leaking resources:
- test_logging: references
- test_socketserver: references
- test_logging: memory blocks
- test_socketserver: memory blocks
Sincerely,
-The Buildbot
1
0
Nov. 2, 2020
The Buildbot has detected a new failure on builder s390x RHEL7 Refleaks 3.x while building Python.
Full details are available at:
https://buildbot.python.org/all/#builders/129/builds/83
Buildbot URL: https://buildbot.python.org/all/
Worker for this Build: edelsohn-rhel-z
Build Reason: <unknown>
Blamelist:
BUILD FAILED: failed test (failure)
Summary of the results of the build (if available):
===================================================
== Tests result: FAILURE then FAILURE ==
409 tests OK.
10 slowest tests:
- test_signal: 31 min 2 sec
- test_pydoc: 29 min 38 sec
- test_concurrent_futures: 17 min 35 sec
- test_asyncio: 17 min 3 sec
- test_multiprocessing_spawn: 9 min 46 sec
- test_peg_generator: 7 min 38 sec
- test_multiprocessing_forkserver: 6 min 52 sec
- test_multiprocessing_fork: 6 min 9 sec
- test_gdb: 4 min 21 sec
- test_io: 3 min 37 sec
2 tests failed:
test_logging test_socketserver
13 tests skipped:
test_devpoll test_ioctl test_kqueue test_msilib test_ossaudiodev
test_startfile test_tix test_tk test_ttk_guionly test_winconsoleio
test_winreg test_winsound test_zipfile64
2 re-run tests:
test_logging test_socketserver
Total duration: 43 min 24 sec
Captured traceback
==================
Traceback (most recent call last):
File "/home/dje/cpython-buildarea/3.x.edelsohn-rhel-z.refleak/build/Lib/multiprocessing/util.py", line 300, in _run_finalizers
finalizer()
File "/home/dje/cpython-buildarea/3.x.edelsohn-rhel-z.refleak/build/Lib/multiprocessing/util.py", line 224, in __call__
res = self._callback(*self._args, **self._kwargs)
File "/home/dje/cpython-buildarea/3.x.edelsohn-rhel-z.refleak/build/Lib/multiprocessing/synchronize.py", line 87, in _cleanup
sem_unlink(name)
FileNotFoundError: [Errno 2] No such file or directory
Traceback (most recent call last):
File "/home/dje/cpython-buildarea/3.x.edelsohn-rhel-z.refleak/build/Lib/multiprocessing/util.py", line 300, in _run_finalizers
finalizer()
File "/home/dje/cpython-buildarea/3.x.edelsohn-rhel-z.refleak/build/Lib/multiprocessing/util.py", line 224, in __call__
res = self._callback(*self._args, **self._kwargs)
File "/home/dje/cpython-buildarea/3.x.edelsohn-rhel-z.refleak/build/Lib/multiprocessing/synchronize.py", line 87, in _cleanup
sem_unlink(name)
FileNotFoundError: [Errno 2] No such file or directory
Traceback (most recent call last):
File "/home/dje/cpython-buildarea/3.x.edelsohn-rhel-z.refleak/build/Lib/multiprocessing/util.py", line 300, in _run_finalizers
finalizer()
File "/home/dje/cpython-buildarea/3.x.edelsohn-rhel-z.refleak/build/Lib/multiprocessing/util.py", line 224, in __call__
res = self._callback(*self._args, **self._kwargs)
File "/home/dje/cpython-buildarea/3.x.edelsohn-rhel-z.refleak/build/Lib/multiprocessing/synchronize.py", line 87, in _cleanup
sem_unlink(name)
FileNotFoundError: [Errno 2] No such file or directory
Traceback (most recent call last):
File "/home/dje/cpython-buildarea/3.x.edelsohn-rhel-z.refleak/build/Lib/multiprocessing/util.py", line 300, in _run_finalizers
finalizer()
File "/home/dje/cpython-buildarea/3.x.edelsohn-rhel-z.refleak/build/Lib/multiprocessing/util.py", line 224, in __call__
res = self._callback(*self._args, **self._kwargs)
File "/home/dje/cpython-buildarea/3.x.edelsohn-rhel-z.refleak/build/Lib/multiprocessing/synchronize.py", line 87, in _cleanup
sem_unlink(name)
FileNotFoundError: [Errno 2] No such file or directory
Traceback (most recent call last):
File "/home/dje/cpython-buildarea/3.x.edelsohn-rhel-z.refleak/build/Lib/multiprocessing/util.py", line 300, in _run_finalizers
finalizer()
File "/home/dje/cpython-buildarea/3.x.edelsohn-rhel-z.refleak/build/Lib/multiprocessing/util.py", line 224, in __call__
res = self._callback(*self._args, **self._kwargs)
File "/home/dje/cpython-buildarea/3.x.edelsohn-rhel-z.refleak/build/Lib/multiprocessing/synchronize.py", line 87, in _cleanup
sem_unlink(name)
FileNotFoundError: [Errno 2] No such file or directory
Traceback (most recent call last):
File "/home/dje/cpython-buildarea/3.x.edelsohn-rhel-z.refleak/build/Lib/multiprocessing/util.py", line 300, in _run_finalizers
finalizer()
File "/home/dje/cpython-buildarea/3.x.edelsohn-rhel-z.refleak/build/Lib/multiprocessing/util.py", line 224, in __call__
res = self._callback(*self._args, **self._kwargs)
File "/home/dje/cpython-buildarea/3.x.edelsohn-rhel-z.refleak/build/Lib/multiprocessing/synchronize.py", line 87, in _cleanup
sem_unlink(name)
FileNotFoundError: [Errno 2] No such file or directory
./home/dje/cpython-buildarea/3.x.edelsohn-rhel-z.refleak/build/Lib/multiprocessing/resource_tracker.py:216: UserWarning: resource_tracker: There appear to be 6 leaked semaphore objects to clean up at shutdown
warnings.warn('resource_tracker: There appear to be %d '
Traceback (most recent call last):
File "/home/dje/cpython-buildarea/3.x.edelsohn-rhel-z.refleak/build/Lib/multiprocessing/util.py", line 300, in _run_finalizers
finalizer()
File "/home/dje/cpython-buildarea/3.x.edelsohn-rhel-z.refleak/build/Lib/multiprocessing/util.py", line 224, in __call__
res = self._callback(*self._args, **self._kwargs)
File "/home/dje/cpython-buildarea/3.x.edelsohn-rhel-z.refleak/build/Lib/multiprocessing/synchronize.py", line 87, in _cleanup
sem_unlink(name)
FileNotFoundError: [Errno 2] No such file or directory
Traceback (most recent call last):
File "/home/dje/cpython-buildarea/3.x.edelsohn-rhel-z.refleak/build/Lib/multiprocessing/util.py", line 300, in _run_finalizers
finalizer()
File "/home/dje/cpython-buildarea/3.x.edelsohn-rhel-z.refleak/build/Lib/multiprocessing/util.py", line 224, in __call__
res = self._callback(*self._args, **self._kwargs)
File "/home/dje/cpython-buildarea/3.x.edelsohn-rhel-z.refleak/build/Lib/multiprocessing/synchronize.py", line 87, in _cleanup
sem_unlink(name)
FileNotFoundError: [Errno 2] No such file or directory
Traceback (most recent call last):
File "/home/dje/cpython-buildarea/3.x.edelsohn-rhel-z.refleak/build/Lib/multiprocessing/util.py", line 300, in _run_finalizers
finalizer()
File "/home/dje/cpython-buildarea/3.x.edelsohn-rhel-z.refleak/build/Lib/multiprocessing/util.py", line 224, in __call__
res = self._callback(*self._args, **self._kwargs)
File "/home/dje/cpython-buildarea/3.x.edelsohn-rhel-z.refleak/build/Lib/multiprocessing/synchronize.py", line 87, in _cleanup
sem_unlink(name)
FileNotFoundError: [Errno 2] No such file or directory
Traceback (most recent call last):
File "/home/dje/cpython-buildarea/3.x.edelsohn-rhel-z.refleak/build/Lib/multiprocessing/util.py", line 300, in _run_finalizers
finalizer()
File "/home/dje/cpython-buildarea/3.x.edelsohn-rhel-z.refleak/build/Lib/multiprocessing/util.py", line 224, in __call__
res = self._callback(*self._args, **self._kwargs)
File "/home/dje/cpython-buildarea/3.x.edelsohn-rhel-z.refleak/build/Lib/multiprocessing/synchronize.py", line 87, in _cleanup
sem_unlink(name)
FileNotFoundError: [Errno 2] No such file or directory
Traceback (most recent call last):
File "/home/dje/cpython-buildarea/3.x.edelsohn-rhel-z.refleak/build/Lib/multiprocessing/util.py", line 300, in _run_finalizers
finalizer()
File "/home/dje/cpython-buildarea/3.x.edelsohn-rhel-z.refleak/build/Lib/multiprocessing/util.py", line 224, in __call__
res = self._callback(*self._args, **self._kwargs)
File "/home/dje/cpython-buildarea/3.x.edelsohn-rhel-z.refleak/build/Lib/multiprocessing/synchronize.py", line 87, in _cleanup
sem_unlink(name)
FileNotFoundError: [Errno 2] No such file or directory
Traceback (most recent call last):
File "/home/dje/cpython-buildarea/3.x.edelsohn-rhel-z.refleak/build/Lib/multiprocessing/util.py", line 300, in _run_finalizers
finalizer()
File "/home/dje/cpython-buildarea/3.x.edelsohn-rhel-z.refleak/build/Lib/multiprocessing/util.py", line 224, in __call__
res = self._callback(*self._args, **self._kwargs)
File "/home/dje/cpython-buildarea/3.x.edelsohn-rhel-z.refleak/build/Lib/multiprocessing/synchronize.py", line 87, in _cleanup
sem_unlink(name)
FileNotFoundError: [Errno 2] No such file or directory
./home/dje/cpython-buildarea/3.x.edelsohn-rhel-z.refleak/build/Lib/multiprocessing/resource_tracker.py:216: UserWarning: resource_tracker: There appear to be 6 leaked semaphore objects to clean up at shutdown
warnings.warn('resource_tracker: There appear to be %d '
Traceback (most recent call last):
File "/home/dje/cpython-buildarea/3.x.edelsohn-rhel-z.refleak/build/Lib/multiprocessing/util.py", line 300, in _run_finalizers
finalizer()
File "/home/dje/cpython-buildarea/3.x.edelsohn-rhel-z.refleak/build/Lib/multiprocessing/util.py", line 224, in __call__
res = self._callback(*self._args, **self._kwargs)
File "/home/dje/cpython-buildarea/3.x.edelsohn-rhel-z.refleak/build/Lib/multiprocessing/synchronize.py", line 87, in _cleanup
sem_unlink(name)
FileNotFoundError: [Errno 2] No such file or directory
Traceback (most recent call last):
File "/home/dje/cpython-buildarea/3.x.edelsohn-rhel-z.refleak/build/Lib/multiprocessing/util.py", line 300, in _run_finalizers
finalizer()
File "/home/dje/cpython-buildarea/3.x.edelsohn-rhel-z.refleak/build/Lib/multiprocessing/util.py", line 224, in __call__
res = self._callback(*self._args, **self._kwargs)
File "/home/dje/cpython-buildarea/3.x.edelsohn-rhel-z.refleak/build/Lib/multiprocessing/synchronize.py", line 87, in _cleanup
sem_unlink(name)
FileNotFoundError: [Errno 2] No such file or directory
Traceback (most recent call last):
File "/home/dje/cpython-buildarea/3.x.edelsohn-rhel-z.refleak/build/Lib/multiprocessing/util.py", line 300, in _run_finalizers
finalizer()
File "/home/dje/cpython-buildarea/3.x.edelsohn-rhel-z.refleak/build/Lib/multiprocessing/util.py", line 224, in __call__
res = self._callback(*self._args, **self._kwargs)
File "/home/dje/cpython-buildarea/3.x.edelsohn-rhel-z.refleak/build/Lib/multiprocessing/synchronize.py", line 87, in _cleanup
sem_unlink(name)
FileNotFoundError: [Errno 2] No such file or directory
Traceback (most recent call last):
File "/home/dje/cpython-buildarea/3.x.edelsohn-rhel-z.refleak/build/Lib/multiprocessing/util.py", line 300, in _run_finalizers
finalizer()
File "/home/dje/cpython-buildarea/3.x.edelsohn-rhel-z.refleak/build/Lib/multiprocessing/util.py", line 224, in __call__
res = self._callback(*self._args, **self._kwargs)
File "/home/dje/cpython-buildarea/3.x.edelsohn-rhel-z.refleak/build/Lib/multiprocessing/synchronize.py", line 87, in _cleanup
sem_unlink(name)
FileNotFoundError: [Errno 2] No such file or directory
Traceback (most recent call last):
File "/home/dje/cpython-buildarea/3.x.edelsohn-rhel-z.refleak/build/Lib/multiprocessing/util.py", line 300, in _run_finalizers
finalizer()
File "/home/dje/cpython-buildarea/3.x.edelsohn-rhel-z.refleak/build/Lib/multiprocessing/util.py", line 224, in __call__
res = self._callback(*self._args, **self._kwargs)
File "/home/dje/cpython-buildarea/3.x.edelsohn-rhel-z.refleak/build/Lib/multiprocessing/synchronize.py", line 87, in _cleanup
sem_unlink(name)
FileNotFoundError: [Errno 2] No such file or directory
Traceback (most recent call last):
File "/home/dje/cpython-buildarea/3.x.edelsohn-rhel-z.refleak/build/Lib/multiprocessing/util.py", line 300, in _run_finalizers
finalizer()
File "/home/dje/cpython-buildarea/3.x.edelsohn-rhel-z.refleak/build/Lib/multiprocessing/util.py", line 224, in __call__
res = self._callback(*self._args, **self._kwargs)
File "/home/dje/cpython-buildarea/3.x.edelsohn-rhel-z.refleak/build/Lib/multiprocessing/synchronize.py", line 87, in _cleanup
sem_unlink(name)
FileNotFoundError: [Errno 2] No such file or directory
./home/dje/cpython-buildarea/3.x.edelsohn-rhel-z.refleak/build/Lib/multiprocessing/resource_tracker.py:216: UserWarning: resource_tracker: There appear to be 6 leaked semaphore objects to clean up at shutdown
warnings.warn('resource_tracker: There appear to be %d '
Traceback (most recent call last):
File "/home/dje/cpython-buildarea/3.x.edelsohn-rhel-z.refleak/build/Lib/multiprocessing/util.py", line 300, in _run_finalizers
finalizer()
File "/home/dje/cpython-buildarea/3.x.edelsohn-rhel-z.refleak/build/Lib/multiprocessing/util.py", line 224, in __call__
res = self._callback(*self._args, **self._kwargs)
File "/home/dje/cpython-buildarea/3.x.edelsohn-rhel-z.refleak/build/Lib/multiprocessing/synchronize.py", line 87, in _cleanup
sem_unlink(name)
FileNotFoundError: [Errno 2] No such file or directory
Traceback (most recent call last):
File "/home/dje/cpython-buildarea/3.x.edelsohn-rhel-z.refleak/build/Lib/multiprocessing/util.py", line 300, in _run_finalizers
finalizer()
File "/home/dje/cpython-buildarea/3.x.edelsohn-rhel-z.refleak/build/Lib/multiprocessing/util.py", line 224, in __call__
res = self._callback(*self._args, **self._kwargs)
File "/home/dje/cpython-buildarea/3.x.edelsohn-rhel-z.refleak/build/Lib/multiprocessing/synchronize.py", line 87, in _cleanup
sem_unlink(name)
FileNotFoundError: [Errno 2] No such file or directory
Traceback (most recent call last):
File "/home/dje/cpython-buildarea/3.x.edelsohn-rhel-z.refleak/build/Lib/multiprocessing/util.py", line 300, in _run_finalizers
finalizer()
File "/home/dje/cpython-buildarea/3.x.edelsohn-rhel-z.refleak/build/Lib/multiprocessing/util.py", line 224, in __call__
res = self._callback(*self._args, **self._kwargs)
File "/home/dje/cpython-buildarea/3.x.edelsohn-rhel-z.refleak/build/Lib/multiprocessing/synchronize.py", line 87, in _cleanup
sem_unlink(name)
FileNotFoundError: [Errno 2] No such file or directory
Traceback (most recent call last):
File "/home/dje/cpython-buildarea/3.x.edelsohn-rhel-z.refleak/build/Lib/multiprocessing/util.py", line 300, in _run_finalizers
finalizer()
File "/home/dje/cpython-buildarea/3.x.edelsohn-rhel-z.refleak/build/Lib/multiprocessing/util.py", line 224, in __call__
res = self._callback(*self._args, **self._kwargs)
File "/home/dje/cpython-buildarea/3.x.edelsohn-rhel-z.refleak/build/Lib/multiprocessing/synchronize.py", line 87, in _cleanup
sem_unlink(name)
FileNotFoundError: [Errno 2] No such file or directory
Traceback (most recent call last):
File "/home/dje/cpython-buildarea/3.x.edelsohn-rhel-z.refleak/build/Lib/multiprocessing/util.py", line 300, in _run_finalizers
finalizer()
File "/home/dje/cpython-buildarea/3.x.edelsohn-rhel-z.refleak/build/Lib/multiprocessing/util.py", line 224, in __call__
res = self._callback(*self._args, **self._kwargs)
File "/home/dje/cpython-buildarea/3.x.edelsohn-rhel-z.refleak/build/Lib/multiprocessing/synchronize.py", line 87, in _cleanup
sem_unlink(name)
FileNotFoundError: [Errno 2] No such file or directory
Traceback (most recent call last):
File "/home/dje/cpython-buildarea/3.x.edelsohn-rhel-z.refleak/build/Lib/multiprocessing/util.py", line 300, in _run_finalizers
finalizer()
File "/home/dje/cpython-buildarea/3.x.edelsohn-rhel-z.refleak/build/Lib/multiprocessing/util.py", line 224, in __call__
res = self._callback(*self._args, **self._kwargs)
File "/home/dje/cpython-buildarea/3.x.edelsohn-rhel-z.refleak/build/Lib/multiprocessing/synchronize.py", line 87, in _cleanup
sem_unlink(name)
FileNotFoundError: [Errno 2] No such file or directory
./home/dje/cpython-buildarea/3.x.edelsohn-rhel-z.refleak/build/Lib/multiprocessing/resource_tracker.py:216: UserWarning: resource_tracker: There appear to be 6 leaked semaphore objects to clean up at shutdown
warnings.warn('resource_tracker: There appear to be %d '
Traceback (most recent call last):
File "/home/dje/cpython-buildarea/3.x.edelsohn-rhel-z.refleak/build/Lib/multiprocessing/util.py", line 300, in _run_finalizers
finalizer()
File "/home/dje/cpython-buildarea/3.x.edelsohn-rhel-z.refleak/build/Lib/multiprocessing/util.py", line 224, in __call__
res = self._callback(*self._args, **self._kwargs)
File "/home/dje/cpython-buildarea/3.x.edelsohn-rhel-z.refleak/build/Lib/multiprocessing/synchronize.py", line 87, in _cleanup
sem_unlink(name)
FileNotFoundError: [Errno 2] No such file or directory
Traceback (most recent call last):
File "/home/dje/cpython-buildarea/3.x.edelsohn-rhel-z.refleak/build/Lib/multiprocessing/util.py", line 300, in _run_finalizers
finalizer()
File "/home/dje/cpython-buildarea/3.x.edelsohn-rhel-z.refleak/build/Lib/multiprocessing/util.py", line 224, in __call__
res = self._callback(*self._args, **self._kwargs)
File "/home/dje/cpython-buildarea/3.x.edelsohn-rhel-z.refleak/build/Lib/multiprocessing/synchronize.py", line 87, in _cleanup
sem_unlink(name)
FileNotFoundError: [Errno 2] No such file or directory
Traceback (most recent call last):
File "/home/dje/cpython-buildarea/3.x.edelsohn-rhel-z.refleak/build/Lib/multiprocessing/util.py", line 300, in _run_finalizers
finalizer()
File "/home/dje/cpython-buildarea/3.x.edelsohn-rhel-z.refleak/build/Lib/multiprocessing/util.py", line 224, in __call__
res = self._callback(*self._args, **self._kwargs)
File "/home/dje/cpython-buildarea/3.x.edelsohn-rhel-z.refleak/build/Lib/multiprocessing/synchronize.py", line 87, in _cleanup
sem_unlink(name)
FileNotFoundError: [Errno 2] No such file or directory
Traceback (most recent call last):
File "/home/dje/cpython-buildarea/3.x.edelsohn-rhel-z.refleak/build/Lib/multiprocessing/util.py", line 300, in _run_finalizers
finalizer()
File "/home/dje/cpython-buildarea/3.x.edelsohn-rhel-z.refleak/build/Lib/multiprocessing/util.py", line 224, in __call__
res = self._callback(*self._args, **self._kwargs)
File "/home/dje/cpython-buildarea/3.x.edelsohn-rhel-z.refleak/build/Lib/multiprocessing/synchronize.py", line 87, in _cleanup
sem_unlink(name)
FileNotFoundError: [Errno 2] No such file or directory
Traceback (most recent call last):
File "/home/dje/cpython-buildarea/3.x.edelsohn-rhel-z.refleak/build/Lib/multiprocessing/util.py", line 300, in _run_finalizers
finalizer()
File "/home/dje/cpython-buildarea/3.x.edelsohn-rhel-z.refleak/build/Lib/multiprocessing/util.py", line 224, in __call__
res = self._callback(*self._args, **self._kwargs)
File "/home/dje/cpython-buildarea/3.x.edelsohn-rhel-z.refleak/build/Lib/multiprocessing/synchronize.py", line 87, in _cleanup
sem_unlink(name)
FileNotFoundError: [Errno 2] No such file or directory
Traceback (most recent call last):
File "/home/dje/cpython-buildarea/3.x.edelsohn-rhel-z.refleak/build/Lib/multiprocessing/util.py", line 300, in _run_finalizers
finalizer()
File "/home/dje/cpython-buildarea/3.x.edelsohn-rhel-z.refleak/build/Lib/multiprocessing/util.py", line 224, in __call__
res = self._callback(*self._args, **self._kwargs)
File "/home/dje/cpython-buildarea/3.x.edelsohn-rhel-z.refleak/build/Lib/multiprocessing/synchronize.py", line 87, in _cleanup
sem_unlink(name)
FileNotFoundError: [Errno 2] No such file or directory
./home/dje/cpython-buildarea/3.x.edelsohn-rhel-z.refleak/build/Lib/multiprocessing/resource_tracker.py:216: UserWarning: resource_tracker: There appear to be 6 leaked semaphore objects to clean up at shutdown
warnings.warn('resource_tracker: There appear to be %d '
Traceback (most recent call last):
File "/home/dje/cpython-buildarea/3.x.edelsohn-rhel-z.refleak/build/Lib/multiprocessing/util.py", line 300, in _run_finalizers
finalizer()
File "/home/dje/cpython-buildarea/3.x.edelsohn-rhel-z.refleak/build/Lib/multiprocessing/util.py", line 224, in __call__
res = self._callback(*self._args, **self._kwargs)
File "/home/dje/cpython-buildarea/3.x.edelsohn-rhel-z.refleak/build/Lib/multiprocessing/synchronize.py", line 87, in _cleanup
sem_unlink(name)
FileNotFoundError: [Errno 2] No such file or directory
Traceback (most recent call last):
File "/home/dje/cpython-buildarea/3.x.edelsohn-rhel-z.refleak/build/Lib/multiprocessing/util.py", line 300, in _run_finalizers
finalizer()
File "/home/dje/cpython-buildarea/3.x.edelsohn-rhel-z.refleak/build/Lib/multiprocessing/util.py", line 224, in __call__
res = self._callback(*self._args, **self._kwargs)
File "/home/dje/cpython-buildarea/3.x.edelsohn-rhel-z.refleak/build/Lib/multiprocessing/synchronize.py", line 87, in _cleanup
sem_unlink(name)
FileNotFoundError: [Errno 2] No such file or directory
Traceback (most recent call last):
File "/home/dje/cpython-buildarea/3.x.edelsohn-rhel-z.refleak/build/Lib/multiprocessing/util.py", line 300, in _run_finalizers
finalizer()
File "/home/dje/cpython-buildarea/3.x.edelsohn-rhel-z.refleak/build/Lib/multiprocessing/util.py", line 224, in __call__
res = self._callback(*self._args, **self._kwargs)
File "/home/dje/cpython-buildarea/3.x.edelsohn-rhel-z.refleak/build/Lib/multiprocessing/synchronize.py", line 87, in _cleanup
sem_unlink(name)
FileNotFoundError: [Errno 2] No such file or directory
Traceback (most recent call last):
File "/home/dje/cpython-buildarea/3.x.edelsohn-rhel-z.refleak/build/Lib/multiprocessing/util.py", line 300, in _run_finalizers
finalizer()
File "/home/dje/cpython-buildarea/3.x.edelsohn-rhel-z.refleak/build/Lib/multiprocessing/util.py", line 224, in __call__
res = self._callback(*self._args, **self._kwargs)
File "/home/dje/cpython-buildarea/3.x.edelsohn-rhel-z.refleak/build/Lib/multiprocessing/synchronize.py", line 87, in _cleanup
sem_unlink(name)
FileNotFoundError: [Errno 2] No such file or directory
Traceback (most recent call last):
File "/home/dje/cpython-buildarea/3.x.edelsohn-rhel-z.refleak/build/Lib/multiprocessing/util.py", line 300, in _run_finalizers
finalizer()
File "/home/dje/cpython-buildarea/3.x.edelsohn-rhel-z.refleak/build/Lib/multiprocessing/util.py", line 224, in __call__
res = self._callback(*self._args, **self._kwargs)
File "/home/dje/cpython-buildarea/3.x.edelsohn-rhel-z.refleak/build/Lib/multiprocessing/synchronize.py", line 87, in _cleanup
sem_unlink(name)
FileNotFoundError: [Errno 2] No such file or directory
Traceback (most recent call last):
File "/home/dje/cpython-buildarea/3.x.edelsohn-rhel-z.refleak/build/Lib/multiprocessing/util.py", line 300, in _run_finalizers
finalizer()
File "/home/dje/cpython-buildarea/3.x.edelsohn-rhel-z.refleak/build/Lib/multiprocessing/util.py", line 224, in __call__
res = self._callback(*self._args, **self._kwargs)
File "/home/dje/cpython-buildarea/3.x.edelsohn-rhel-z.refleak/build/Lib/multiprocessing/synchronize.py", line 87, in _cleanup
sem_unlink(name)
FileNotFoundError: [Errno 2] No such file or directory
.
Test report
===========
Failed tests:
- test_socketserver
- test_logging
Test leaking resources:
- test_logging: references
- test_socketserver: references
- test_logging: memory blocks
- test_socketserver: memory blocks
Sincerely,
-The Buildbot
1
0
The Buildbot has detected a failed build on builder aarch64 RHEL7 3.x while building python/cpython.
Full details are available at:
https://buildbot.python.org/all/#builders/539/builds/270
Buildbot URL: https://buildbot.python.org/all/
Worker for this Build: cstratak-RHEL7-aarch64
Build Reason: <unknown>
Blamelist: MARUYAMA Norihiro <norihiro.maruyama(a)gmail.com>
BUILD FAILED: failed test (failure)
Summary of the results of the build (if available):
===================================================
== Tests result: ENV CHANGED ==
409 tests OK.
10 slowest tests:
- test_concurrent_futures: 4 min 17 sec
- test_unparse: 4 min 13 sec
- test_capi: 3 min 23 sec
- test_tokenize: 3 min 6 sec
- test_peg_generator: 2 min 58 sec
- test_lib2to3: 2 min 35 sec
- test_asyncio: 2 min 28 sec
- test_multiprocessing_spawn: 2 min 17 sec
- test_unicodedata: 1 min 30 sec
- test_multiprocessing_forkserver: 1 min 29 sec
1 test altered the execution environment:
test_asyncio
14 tests skipped:
test_devpoll test_gdb test_ioctl test_kqueue test_msilib
test_ossaudiodev test_startfile test_tix test_tk test_ttk_guionly
test_winconsoleio test_winreg test_winsound test_zipfile64
Total duration: 7 min 51 sec
Captured traceback
==================
Traceback (most recent call last):
File "/home/buildbot/buildarea/3.x.cstratak-RHEL7-aarch64/build/Lib/asyncio/sslproto.py", line 321, in __del__
self.close()
File "/home/buildbot/buildarea/3.x.cstratak-RHEL7-aarch64/build/Lib/asyncio/sslproto.py", line 316, in close
self._ssl_protocol._start_shutdown()
File "/home/buildbot/buildarea/3.x.cstratak-RHEL7-aarch64/build/Lib/asyncio/sslproto.py", line 590, in _start_shutdown
self._abort()
File "/home/buildbot/buildarea/3.x.cstratak-RHEL7-aarch64/build/Lib/asyncio/sslproto.py", line 731, in _abort
self._transport.abort()
File "/home/buildbot/buildarea/3.x.cstratak-RHEL7-aarch64/build/Lib/asyncio/selector_events.py", line 680, in abort
self._force_close(None)
File "/home/buildbot/buildarea/3.x.cstratak-RHEL7-aarch64/build/Lib/asyncio/selector_events.py", line 731, in _force_close
self._loop.call_soon(self._call_connection_lost, exc)
File "/home/buildbot/buildarea/3.x.cstratak-RHEL7-aarch64/build/Lib/asyncio/base_events.py", line 746, in call_soon
self._check_closed()
File "/home/buildbot/buildarea/3.x.cstratak-RHEL7-aarch64/build/Lib/asyncio/base_events.py", line 510, in _check_closed
raise RuntimeError('Event loop is closed')
RuntimeError: Event loop is closed
Test report
===========
Sincerely,
-The Buildbot
1
0
Buildbot failure in Python on s390x Fedora Rawhide Clang Installed 3.x
by buildbot@python.org Nov. 1, 2020
by buildbot@python.org Nov. 1, 2020
Nov. 1, 2020
The Buildbot has detected a failed build on builder s390x Fedora Rawhide Clang Installed 3.x while building python/cpython.
Full details are available at:
https://buildbot.python.org/all/#builders/207/builds/268
Buildbot URL: https://buildbot.python.org/all/
Worker for this Build: edelsohn-fedora-rawhide-z
Build Reason: <unknown>
Blamelist: Alexey Izbyshev <izbyshev(a)ispras.ru>, kj <28750310+Fidget-Spinner(a)users.noreply.github.com>
BUILD FAILED: failed test (failure)
Summary of the results of the build (if available):
===================================================
== Tests result: FAILURE then FAILURE ==
405 tests OK.
1 test failed:
test_zipimport
18 tests skipped:
test_asdl_parser test_check_c_globals test_clinic test_devpoll
test_gdb test_ioctl test_kqueue test_msilib test_nis
test_ossaudiodev test_startfile test_tix test_tk test_ttk_guionly
test_winconsoleio test_winreg test_winsound test_zipfile64
1 re-run test:
test_zipimport
Total duration: 3 min 40 sec
Captured traceback
==================
Traceback (test.test_zipimport.CompressedZipImportTestCase) ... ok
Traceback (most recent call last):
File "/home/dje/cpython-buildarea/3.x.edelsohn-fedora-rawhide-z.clang-installed/build/target/lib/python3.10/test/test_zipimport.py", line 194, in testBoth
self.doTest(pyc_ext, files, TESTMOD)
File "/home/dje/cpython-buildarea/3.x.edelsohn-fedora-rawhide-z.clang-installed/build/target/lib/python3.10/test/test_zipimport.py", line 148, in doTest
self.assertEqual(file, os.path.join(TEMP_ZIP,
AssertionError: '/tmp[14 chars]204æ/test_python_worker_11588æ/junk95142.zip/ziptestmodule.py' != '/tmp[14 chars]204æ/test_python_worker_11588æ/junk95142.zip/ziptestmodule.pyc'
- /tmp/test_python_1204æ/test_python_worker_11588æ/junk95142.zip/ziptestmodule.py
+ /tmp/test_python_1204æ/test_python_worker_11588æ/junk95142.zip/ziptestmodule.pyc
? +
Traceback (most recent call last):
File "/home/dje/cpython-buildarea/3.x.edelsohn-fedora-rawhide-z.clang-installed/build/target/lib/python3.10/test/test_zipimport.py", line 594, in testGetCompiledSource
self.doTest(pyc_ext, files, TESTMOD, call=self.assertModuleSource)
File "/home/dje/cpython-buildarea/3.x.edelsohn-fedora-rawhide-z.clang-installed/build/target/lib/python3.10/test/test_zipimport.py", line 148, in doTest
self.assertEqual(file, os.path.join(TEMP_ZIP,
AssertionError: '/tmp[14 chars]204æ/test_python_worker_11588æ/junk95142.zip/ziptestmodule.py' != '/tmp[14 chars]204æ/test_python_worker_11588æ/junk95142.zip/ziptestmodule.pyc'
- /tmp/test_python_1204æ/test_python_worker_11588æ/junk95142.zip/ziptestmodule.py
+ /tmp/test_python_1204æ/test_python_worker_11588æ/junk95142.zip/ziptestmodule.pyc
? +
Traceback (most recent call last):
File "/home/dje/cpython-buildarea/3.x.edelsohn-fedora-rawhide-z.clang-installed/build/target/lib/python3.10/test/test_zipimport.py", line 194, in testBoth
self.doTest(pyc_ext, files, TESTMOD)
File "/home/dje/cpython-buildarea/3.x.edelsohn-fedora-rawhide-z.clang-installed/build/target/lib/python3.10/test/test_zipimport.py", line 148, in doTest
self.assertEqual(file, os.path.join(TEMP_ZIP,
AssertionError: '/tmp/test_python_1204æ/junk95142.zip/ziptestmodule.py' != '/tmp/test_python_1204æ/junk95142.zip/ziptestmodule.pyc'
- /tmp/test_python_1204æ/junk95142.zip/ziptestmodule.py
+ /tmp/test_python_1204æ/junk95142.zip/ziptestmodule.pyc
? +
Traceback (test.test_zipimport.UncompressedZipImportTestCase) ... ok
Traceback (most recent call last):
File "/home/dje/cpython-buildarea/3.x.edelsohn-fedora-rawhide-z.clang-installed/build/target/lib/python3.10/test/test_zipimport.py", line 594, in testGetCompiledSource
self.doTest(pyc_ext, files, TESTMOD, call=self.assertModuleSource)
File "/home/dje/cpython-buildarea/3.x.edelsohn-fedora-rawhide-z.clang-installed/build/target/lib/python3.10/test/test_zipimport.py", line 148, in doTest
self.assertEqual(file, os.path.join(TEMP_ZIP,
AssertionError: '/tmp/test_python_1204æ/junk95142.zip/ziptestmodule.py' != '/tmp/test_python_1204æ/junk95142.zip/ziptestmodule.pyc'
- /tmp/test_python_1204æ/junk95142.zip/ziptestmodule.py
+ /tmp/test_python_1204æ/junk95142.zip/ziptestmodule.pyc
? +
Test report
===========
Failed tests:
- test_zipimport
Failed subtests:
- testBoth - test.test_zipimport.UncompressedZipImportTestCase
- testGetCompiledSource - test.test_zipimport.UncompressedZipImportTestCase
- testBoth - test.test_zipimport.CompressedZipImportTestCase
- testGetCompiledSource - test.test_zipimport.CompressedZipImportTestCase
Sincerely,
-The Buildbot
2
1