Buildbot-status
Threads by month
- ----- 2026 -----
- October
- September
- August
- July
- June
- May
- April
- March
- February
- January
- ----- 2025 -----
- December
- November
- October
- September
- August
- July
- June
- May
- April
- March
- February
- January
- ----- 2024 -----
- December
- November
- October
- September
- August
- July
- June
- May
- April
- March
- February
- January
- ----- 2023 -----
- December
- November
- October
- September
- August
- July
- June
- May
- April
- March
- February
- January
- ----- 2022 -----
- December
- November
- October
- September
- August
- July
- June
- May
- April
- March
- February
- January
- ----- 2021 -----
- December
- November
- October
- September
- August
- July
- June
- May
- April
- March
- February
- January
- ----- 2020 -----
- December
- November
- October
- September
- August
- July
- June
- May
- April
- March
- February
- January
- ----- 2019 -----
- December
- November
- October
- September
- August
- July
- June
- May
- April
- March
- February
- January
- ----- 2018 -----
- December
- November
- October
- September
- August
- July
- June
- May
- April
- March
- February
- January
- ----- 2017 -----
- December
- November
- October
- September
- August
- July
- June
- May
November 2020
- 3 participants
- 208 discussions
The Buildbot has detected a failed build on builder PPC64 AIX 3.x while building python/cpython.
Full details are available at:
https://buildbot.python.org/all/#builders/438/builds/307
Buildbot URL: https://buildbot.python.org/all/
Worker for this Build: edelsohn-aix-ppc64
Build Reason: <unknown>
Blamelist: Julien Danjou <julien(a)danjou.info>
BUILD FAILED: failed test (failure)
Summary of the results of the build (if available):
===================================================
== Tests result: SUCCESS ==
406 tests OK.
10 slowest tests:
- test_concurrent_futures: 3 min 31 sec
- test_tokenize: 2 min 52 sec
- test_subprocess: 2 min 39 sec
- test_unparse: 2 min 36 sec
- test_multiprocessing_spawn: 2 min 21 sec
- test_multiprocessing_forkserver: 1 min 42 sec
- test_lib2to3: 1 min 42 sec
- test_venv: 1 min 41 sec
- test_capi: 1 min 34 sec
- test_asyncio: 1 min 27 sec
18 tests skipped:
test_devpoll test_epoll test_gdb test_ioctl test_kqueue
test_msilib test_ossaudiodev test_spwd test_startfile test_tix
test_tk test_ttk_guionly test_unicode_file
test_unicode_file_functions test_winconsoleio test_winreg
test_winsound test_zipfile64
Total duration: 7 min 7 sec
Captured traceback
==================
remote: Enumerating objects: 20, done.
remote: Counting objects: 5% (1/20)
remote: Counting objects: 10% (2/20)
remote: Counting objects: 15% (3/20)
remote: Counting objects: 20% (4/20)
remote: Counting objects: 25% (5/20)
remote: Counting objects: 30% (6/20)
remote: Counting objects: 35% (7/20)
remote: Counting objects: 40% (8/20)
remote: Counting objects: 45% (9/20)
remote: Counting objects: 50% (10/20)
remote: Counting objects: 55% (11/20)
remote: Counting objects: 60% (12/20)
remote: Counting objects: 65% (13/20)
remote: Counting objects: 70% (14/20)
remote: Counting objects: 75% (15/20)
remote: Counting objects: 80% (16/20)
remote: Counting objects: 85% (17/20)
remote: Counting objects: 90% (18/20)
remote: Counting objects: 95% (19/20)
remote: Counting objects: 100% (20/20)
remote: Counting objects: 100% (20/20), done.
remote: Compressing objects: 7% (1/14)
remote: Compressing objects: 14% (2/14)
remote: Compressing objects: 21% (3/14)
remote: Compressing objects: 28% (4/14)
remote: Compressing objects: 35% (5/14)
remote: Compressing objects: 42% (6/14)
remote: Compressing objects: 50% (7/14)
remote: Compressing objects: 57% (8/14)
remote: Compressing objects: 64% (9/14)
remote: Compressing objects: 71% (10/14)
remote: Compressing objects: 78% (11/14)
remote: Compressing objects: 85% (12/14)
remote: Compressing objects: 92% (13/14)
remote: Compressing objects: 100% (14/14)
remote: Compressing objects: 100% (14/14), done.
remote: Total 21 (delta 6), reused 6 (delta 6), pack-reused 1
From https://github.com/python/cpython
* branch master -> FETCH_HEAD
Reset branch 'master'
./configure[10]: 29884688 Killed
In file included from Python/thread.c:80:0:
Python/thread_pthread.h: In function 'PyThread_exit_thread':
Python/thread_pthread.h:362:1: warning: 'noreturn' function does return
}
^
ldd: /lib/libreadline.a: File is an archive.
/home/shager/cpython-buildarea/3.x.edelsohn-aix-ppc64/build/Modules/_posixsubprocess.c: In function 'child_exec':
/home/shager/cpython-buildarea/3.x.edelsohn-aix-ppc64/build/Modules/_posixsubprocess.c:601:43: warning: passing argument 2 of 'setgroups' discards 'const' qualifier from pointer target type [-Wdiscarded-qualifiers]
POSIX_CALL(setgroups(groups_size, groups));
^
/home/shager/cpython-buildarea/3.x.edelsohn-aix-ppc64/build/Modules/_posixsubprocess.c:70:38: note: in definition of macro 'POSIX_CALL'
#define POSIX_CALL(call) do { if ((call) == -1) goto error; } while (0)
^~~~
In file included from ./Include/Python.h:36:0,
from /home/shager/cpython-buildarea/3.x.edelsohn-aix-ppc64/build/Modules/_posixsubprocess.c:2:
/opt/freeware/lib/gcc/powerpc-ibm-aix7.2.0.0/7.2.0/include-fixed/unistd.h:1080:14: note: expected 'gid_t * {aka unsigned int *}' but argument is of type 'const gid_t * {aka const unsigned int *}'
extern int setgroups(int, gid_t []);
^~~~~~~~~
ld: 0711-224 WARNING: Duplicate symbol: .strcmp
ld: 0711-224 WARNING: Duplicate symbol: strcmp
ld: 0711-224 WARNING: Duplicate symbol: .strcpy
ld: 0711-224 WARNING: Duplicate symbol: strcpy
ld: 0711-224 WARNING: Duplicate symbol: .strcat
ld: 0711-224 WARNING: Duplicate symbol: strcat
ld: 0711-345 Use the -bloadmap or -bnoquiet option to obtain more information.
ld: 0711-224 WARNING: Duplicate symbol: .strcmp
ld: 0711-224 WARNING: Duplicate symbol: strcmp
ld: 0711-224 WARNING: Duplicate symbol: .strcpy
ld: 0711-224 WARNING: Duplicate symbol: strcpy
ld: 0711-224 WARNING: Duplicate symbol: .strcat
ld: 0711-224 WARNING: Duplicate symbol: strcat
ld: 0711-345 Use the -bloadmap or -bnoquiet option to obtain more information.
ldd: /lib/libreadline.a: File is an archive.
ldd: /lib/libreadline.a: File is an archive.
test_spwd skipped -- No module named 'spwd'
test_tk skipped -- Tk unavailable due to TclError: no display name and no $DISPLAY environment variab [...]
test_kqueue skipped -- test works only on BSD
test_msilib skipped -- No module named '_msi'
test_ossaudiodev skipped -- No module named 'ossaudiodev'
setgroups: Not owner
test_ttk_guionly skipped -- Tk unavailable due to TclError: no display name and no $DISPLAY environment variab [...]
test_zipfile64 skipped -- test requires loads of disk-space bytes and a long time to run
test_winsound skipped -- No module named 'winsound'
test_unicode_file_functions skipped -- only NT+ and systems with Unicode-friendly filesystem encoding
<string>:2: PendingDeprecationWarning: lib2to3 package is deprecated and may not be able to parse Python 3.10+
test_flock (__main__.FNTLEINTRTest) ... ok
test_lockf (__main__.FNTLEINTRTest) ... skipped 'AIX returns PermissionError'
test_read (__main__.OSEINTRTest) ... ok
test_wait (__main__.OSEINTRTest) ... ok
test_wait3 (__main__.OSEINTRTest) ... ok
test_wait4 (__main__.OSEINTRTest) ... ok
test_waitpid (__main__.OSEINTRTest) ... ok
test_write (__main__.OSEINTRTest) ... ok
test_devpoll (__main__.SelectEINTRTest) ... skipped 'need select.devpoll'
test_epoll (__main__.SelectEINTRTest) ... skipped 'need select.epoll'
test_kqueue (__main__.SelectEINTRTest) ... skipped 'need select.kqueue'
test_poll (__main__.SelectEINTRTest) ... ok
test_select (__main__.SelectEINTRTest) ... ok
test_sigtimedwait (__main__.SignalEINTRTest) ... ok
test_sigwaitinfo (__main__.SignalEINTRTest) ... ok
test_accept (__main__.SocketEINTRTest) ... ok
test_open (__main__.SocketEINTRTest) ... ok
test_os_open (__main__.SocketEINTRTest) ... ok
test_recv (__main__.SocketEINTRTest) ... ok
test_recvmsg (__main__.SocketEINTRTest) ... ok
test_send (__main__.SocketEINTRTest) ... ok
test_sendall (__main__.SocketEINTRTest) ... ok
test_sendmsg (__main__.SocketEINTRTest) ... ok
test_sleep (__main__.TimeEINTRTest) ... ok
----------------------------------------------------------------------
Ran 24 tests in 8.076s
OK (skipped=4)
test_startfile skipped -- object <module 'os' from '/home/shager/cpython-buildarea/3.x.edelsohn-aix-ppc64/build/Lib/os.py'> has no attribute 'startfile'
test_devpoll skipped -- test works only on Solaris OS family
test_tix skipped -- Tk unavailable due to TclError: no display name and no $DISPLAY environment variab [...]
test_ioctl skipped -- Unable to open /dev/tty
test_gdb skipped -- gdb not built with embedded python support
test_winreg skipped -- No module named 'winreg'
test_winconsoleio skipped -- test only relevant on win32
test_epoll skipped -- test works only on Linux 2.6
test_unicode_file skipped -- No Unicode filesystem semantics on this platform.
make: *** Waiting for unfinished jobs....
make: *** wait: There are no child processes.. Stop.
Test report
===========
Sincerely,
-The Buildbot
1
0
Nov. 2, 2020
The Buildbot has detected a new failure on builder s390x Fedora Refleaks 3.x while building Python.
Full details are available at:
https://buildbot.python.org/all/#builders/433/builds/76
Buildbot URL: https://buildbot.python.org/all/
Worker for this Build: edelsohn-fedora-z
Build Reason: <unknown>
Blamelist:
BUILD FAILED: failed test (failure)
Summary of the results of the build (if available):
===================================================
==
Captured traceback
==================
Traceback (most recent call last):
File "/home/dje/cpython-buildarea/3.x.edelsohn-fedora-z.refleak/build/Lib/threading.py", line 960, in _bootstrap_inner
self.run()
File "/home/dje/cpython-buildarea/3.x.edelsohn-fedora-z.refleak/build/Lib/concurrent/futures/process.py", line 317, in run
result_item, is_broken, cause = self.wait_result_broken_or_wakeup()
File "/home/dje/cpython-buildarea/3.x.edelsohn-fedora-z.refleak/build/Lib/concurrent/futures/process.py", line 377, in wait_result_broken_or_wakeup
ready = mp.connection.wait(readers + worker_sentinels)
AttributeError: module 'multiprocessing' has no attribute 'connection'
Timeout (3:15:00)!
Thread 0x000003ff83fff900 (most recent call first):
File "/home/dje/cpython-buildarea/3.x.edelsohn-fedora-z.refleak/build/Lib/threading.py", line 312 in wait
File "/home/dje/cpython-buildarea/3.x.edelsohn-fedora-z.refleak/build/Lib/multiprocessing/queues.py", line 233 in _feed
File "/home/dje/cpython-buildarea/3.x.edelsohn-fedora-z.refleak/build/Lib/threading.py", line 898 in run
File "/home/dje/cpython-buildarea/3.x.edelsohn-fedora-z.refleak/build/Lib/threading.py", line 960 in _bootstrap_inner
File "/home/dje/cpython-buildarea/3.x.edelsohn-fedora-z.refleak/build/Lib/threading.py", line 918 in _bootstrap
Traceback (most recent call last):
File "/home/dje/cpython-buildarea/3.x.edelsohn-fedora-z.refleak/build/Lib/multiprocessing/util.py", line 300, in _run_finalizers
finalizer()
File "/home/dje/cpython-buildarea/3.x.edelsohn-fedora-z.refleak/build/Lib/multiprocessing/util.py", line 224, in __call__
res = self._callback(*self._args, **self._kwargs)
File "/home/dje/cpython-buildarea/3.x.edelsohn-fedora-z.refleak/build/Lib/multiprocessing/synchronize.py", line 87, in _cleanup
sem_unlink(name)
FileNotFoundError: [Errno 2] No such file or directory
Traceback (most recent call last):
File "/home/dje/cpython-buildarea/3.x.edelsohn-fedora-z.refleak/build/Lib/multiprocessing/util.py", line 300, in _run_finalizers
finalizer()
File "/home/dje/cpython-buildarea/3.x.edelsohn-fedora-z.refleak/build/Lib/multiprocessing/util.py", line 224, in __call__
res = self._callback(*self._args, **self._kwargs)
File "/home/dje/cpython-buildarea/3.x.edelsohn-fedora-z.refleak/build/Lib/multiprocessing/synchronize.py", line 87, in _cleanup
sem_unlink(name)
FileNotFoundError: [Errno 2] No such file or directory
Traceback (most recent call last):
File "/home/dje/cpython-buildarea/3.x.edelsohn-fedora-z.refleak/build/Lib/multiprocessing/util.py", line 300, in _run_finalizers
finalizer()
File "/home/dje/cpython-buildarea/3.x.edelsohn-fedora-z.refleak/build/Lib/multiprocessing/util.py", line 224, in __call__
res = self._callback(*self._args, **self._kwargs)
File "/home/dje/cpython-buildarea/3.x.edelsohn-fedora-z.refleak/build/Lib/multiprocessing/synchronize.py", line 87, in _cleanup
sem_unlink(name)
FileNotFoundError: [Errno 2] No such file or directory
Traceback (most recent call last):
File "/home/dje/cpython-buildarea/3.x.edelsohn-fedora-z.refleak/build/Lib/multiprocessing/util.py", line 300, in _run_finalizers
finalizer()
File "/home/dje/cpython-buildarea/3.x.edelsohn-fedora-z.refleak/build/Lib/multiprocessing/util.py", line 224, in __call__
res = self._callback(*self._args, **self._kwargs)
File "/home/dje/cpython-buildarea/3.x.edelsohn-fedora-z.refleak/build/Lib/multiprocessing/synchronize.py", line 87, in _cleanup
sem_unlink(name)
FileNotFoundError: [Errno 2] No such file or directory
Traceback (most recent call last):
File "/home/dje/cpython-buildarea/3.x.edelsohn-fedora-z.refleak/build/Lib/multiprocessing/util.py", line 300, in _run_finalizers
finalizer()
File "/home/dje/cpython-buildarea/3.x.edelsohn-fedora-z.refleak/build/Lib/multiprocessing/util.py", line 224, in __call__
res = self._callback(*self._args, **self._kwargs)
File "/home/dje/cpython-buildarea/3.x.edelsohn-fedora-z.refleak/build/Lib/multiprocessing/synchronize.py", line 87, in _cleanup
sem_unlink(name)
FileNotFoundError: [Errno 2] No such file or directory
Traceback (most recent call last):
File "/home/dje/cpython-buildarea/3.x.edelsohn-fedora-z.refleak/build/Lib/multiprocessing/util.py", line 300, in _run_finalizers
finalizer()
File "/home/dje/cpython-buildarea/3.x.edelsohn-fedora-z.refleak/build/Lib/multiprocessing/util.py", line 224, in __call__
res = self._callback(*self._args, **self._kwargs)
File "/home/dje/cpython-buildarea/3.x.edelsohn-fedora-z.refleak/build/Lib/multiprocessing/synchronize.py", line 87, in _cleanup
sem_unlink(name)
FileNotFoundError: [Errno 2] No such file or directory
./home/dje/cpython-buildarea/3.x.edelsohn-fedora-z.refleak/build/Lib/multiprocessing/resource_tracker.py:216: UserWarning: resource_tracker: There appear to be 6 leaked semaphore objects to clean up at shutdown
warnings.warn('resource_tracker: There appear to be %d '
Traceback (most recent call last):
File "/home/dje/cpython-buildarea/3.x.edelsohn-fedora-z.refleak/build/Lib/multiprocessing/util.py", line 300, in _run_finalizers
finalizer()
File "/home/dje/cpython-buildarea/3.x.edelsohn-fedora-z.refleak/build/Lib/multiprocessing/util.py", line 224, in __call__
res = self._callback(*self._args, **self._kwargs)
File "/home/dje/cpython-buildarea/3.x.edelsohn-fedora-z.refleak/build/Lib/multiprocessing/synchronize.py", line 87, in _cleanup
sem_unlink(name)
FileNotFoundError: [Errno 2] No such file or directory
Traceback (most recent call last):
File "/home/dje/cpython-buildarea/3.x.edelsohn-fedora-z.refleak/build/Lib/multiprocessing/util.py", line 300, in _run_finalizers
finalizer()
File "/home/dje/cpython-buildarea/3.x.edelsohn-fedora-z.refleak/build/Lib/multiprocessing/util.py", line 224, in __call__
res = self._callback(*self._args, **self._kwargs)
File "/home/dje/cpython-buildarea/3.x.edelsohn-fedora-z.refleak/build/Lib/multiprocessing/synchronize.py", line 87, in _cleanup
sem_unlink(name)
FileNotFoundError: [Errno 2] No such file or directory
Traceback (most recent call last):
File "/home/dje/cpython-buildarea/3.x.edelsohn-fedora-z.refleak/build/Lib/multiprocessing/util.py", line 300, in _run_finalizers
finalizer()
File "/home/dje/cpython-buildarea/3.x.edelsohn-fedora-z.refleak/build/Lib/multiprocessing/util.py", line 224, in __call__
res = self._callback(*self._args, **self._kwargs)
File "/home/dje/cpython-buildarea/3.x.edelsohn-fedora-z.refleak/build/Lib/multiprocessing/synchronize.py", line 87, in _cleanup
sem_unlink(name)
FileNotFoundError: [Errno 2] No such file or directory
Traceback (most recent call last):
File "/home/dje/cpython-buildarea/3.x.edelsohn-fedora-z.refleak/build/Lib/multiprocessing/util.py", line 300, in _run_finalizers
finalizer()
File "/home/dje/cpython-buildarea/3.x.edelsohn-fedora-z.refleak/build/Lib/multiprocessing/util.py", line 224, in __call__
res = self._callback(*self._args, **self._kwargs)
File "/home/dje/cpython-buildarea/3.x.edelsohn-fedora-z.refleak/build/Lib/multiprocessing/synchronize.py", line 87, in _cleanup
sem_unlink(name)
FileNotFoundError: [Errno 2] No such file or directory
Traceback (most recent call last):
File "/home/dje/cpython-buildarea/3.x.edelsohn-fedora-z.refleak/build/Lib/multiprocessing/util.py", line 300, in _run_finalizers
finalizer()
File "/home/dje/cpython-buildarea/3.x.edelsohn-fedora-z.refleak/build/Lib/multiprocessing/util.py", line 224, in __call__
res = self._callback(*self._args, **self._kwargs)
File "/home/dje/cpython-buildarea/3.x.edelsohn-fedora-z.refleak/build/Lib/multiprocessing/synchronize.py", line 87, in _cleanup
sem_unlink(name)
FileNotFoundError: [Errno 2] No such file or directory
Traceback (most recent call last):
File "/home/dje/cpython-buildarea/3.x.edelsohn-fedora-z.refleak/build/Lib/multiprocessing/util.py", line 300, in _run_finalizers
finalizer()
File "/home/dje/cpython-buildarea/3.x.edelsohn-fedora-z.refleak/build/Lib/multiprocessing/util.py", line 224, in __call__
res = self._callback(*self._args, **self._kwargs)
File "/home/dje/cpython-buildarea/3.x.edelsohn-fedora-z.refleak/build/Lib/multiprocessing/synchronize.py", line 87, in _cleanup
sem_unlink(name)
FileNotFoundError: [Errno 2] No such file or directory
./home/dje/cpython-buildarea/3.x.edelsohn-fedora-z.refleak/build/Lib/multiprocessing/resource_tracker.py:216: UserWarning: resource_tracker: There appear to be 6 leaked semaphore objects to clean up at shutdown
warnings.warn('resource_tracker: There appear to be %d '
Traceback (most recent call last):
File "/home/dje/cpython-buildarea/3.x.edelsohn-fedora-z.refleak/build/Lib/multiprocessing/util.py", line 300, in _run_finalizers
finalizer()
File "/home/dje/cpython-buildarea/3.x.edelsohn-fedora-z.refleak/build/Lib/multiprocessing/util.py", line 224, in __call__
res = self._callback(*self._args, **self._kwargs)
File "/home/dje/cpython-buildarea/3.x.edelsohn-fedora-z.refleak/build/Lib/multiprocessing/synchronize.py", line 87, in _cleanup
sem_unlink(name)
FileNotFoundError: [Errno 2] No such file or directory
Traceback (most recent call last):
File "/home/dje/cpython-buildarea/3.x.edelsohn-fedora-z.refleak/build/Lib/multiprocessing/util.py", line 300, in _run_finalizers
finalizer()
File "/home/dje/cpython-buildarea/3.x.edelsohn-fedora-z.refleak/build/Lib/multiprocessing/util.py", line 224, in __call__
res = self._callback(*self._args, **self._kwargs)
File "/home/dje/cpython-buildarea/3.x.edelsohn-fedora-z.refleak/build/Lib/multiprocessing/synchronize.py", line 87, in _cleanup
sem_unlink(name)
FileNotFoundError: [Errno 2] No such file or directory
Traceback (most recent call last):
File "/home/dje/cpython-buildarea/3.x.edelsohn-fedora-z.refleak/build/Lib/multiprocessing/util.py", line 300, in _run_finalizers
finalizer()
File "/home/dje/cpython-buildarea/3.x.edelsohn-fedora-z.refleak/build/Lib/multiprocessing/util.py", line 224, in __call__
res = self._callback(*self._args, **self._kwargs)
File "/home/dje/cpython-buildarea/3.x.edelsohn-fedora-z.refleak/build/Lib/multiprocessing/synchronize.py", line 87, in _cleanup
sem_unlink(name)
FileNotFoundError: [Errno 2] No such file or directory
Traceback (most recent call last):
File "/home/dje/cpython-buildarea/3.x.edelsohn-fedora-z.refleak/build/Lib/multiprocessing/util.py", line 300, in _run_finalizers
finalizer()
File "/home/dje/cpython-buildarea/3.x.edelsohn-fedora-z.refleak/build/Lib/multiprocessing/util.py", line 224, in __call__
res = self._callback(*self._args, **self._kwargs)
File "/home/dje/cpython-buildarea/3.x.edelsohn-fedora-z.refleak/build/Lib/multiprocessing/synchronize.py", line 87, in _cleanup
sem_unlink(name)
FileNotFoundError: [Errno 2] No such file or directory
Traceback (most recent call last):
File "/home/dje/cpython-buildarea/3.x.edelsohn-fedora-z.refleak/build/Lib/multiprocessing/util.py", line 300, in _run_finalizers
finalizer()
File "/home/dje/cpython-buildarea/3.x.edelsohn-fedora-z.refleak/build/Lib/multiprocessing/util.py", line 224, in __call__
res = self._callback(*self._args, **self._kwargs)
File "/home/dje/cpython-buildarea/3.x.edelsohn-fedora-z.refleak/build/Lib/multiprocessing/synchronize.py", line 87, in _cleanup
sem_unlink(name)
FileNotFoundError: [Errno 2] No such file or directory
Traceback (most recent call last):
File "/home/dje/cpython-buildarea/3.x.edelsohn-fedora-z.refleak/build/Lib/multiprocessing/util.py", line 300, in _run_finalizers
finalizer()
File "/home/dje/cpython-buildarea/3.x.edelsohn-fedora-z.refleak/build/Lib/multiprocessing/util.py", line 224, in __call__
res = self._callback(*self._args, **self._kwargs)
File "/home/dje/cpython-buildarea/3.x.edelsohn-fedora-z.refleak/build/Lib/multiprocessing/synchronize.py", line 87, in _cleanup
sem_unlink(name)
FileNotFoundError: [Errno 2] No such file or directory
./home/dje/cpython-buildarea/3.x.edelsohn-fedora-z.refleak/build/Lib/multiprocessing/resource_tracker.py:216: UserWarning: resource_tracker: There appear to be 6 leaked semaphore objects to clean up at shutdown
warnings.warn('resource_tracker: There appear to be %d '
Traceback (most recent call last):
File "/home/dje/cpython-buildarea/3.x.edelsohn-fedora-z.refleak/build/Lib/multiprocessing/util.py", line 300, in _run_finalizers
finalizer()
File "/home/dje/cpython-buildarea/3.x.edelsohn-fedora-z.refleak/build/Lib/multiprocessing/util.py", line 224, in __call__
res = self._callback(*self._args, **self._kwargs)
File "/home/dje/cpython-buildarea/3.x.edelsohn-fedora-z.refleak/build/Lib/multiprocessing/synchronize.py", line 87, in _cleanup
sem_unlink(name)
FileNotFoundError: [Errno 2] No such file or directory
Traceback (most recent call last):
File "/home/dje/cpython-buildarea/3.x.edelsohn-fedora-z.refleak/build/Lib/multiprocessing/util.py", line 300, in _run_finalizers
finalizer()
File "/home/dje/cpython-buildarea/3.x.edelsohn-fedora-z.refleak/build/Lib/multiprocessing/util.py", line 224, in __call__
res = self._callback(*self._args, **self._kwargs)
File "/home/dje/cpython-buildarea/3.x.edelsohn-fedora-z.refleak/build/Lib/multiprocessing/synchronize.py", line 87, in _cleanup
sem_unlink(name)
FileNotFoundError: [Errno 2] No such file or directory
Traceback (most recent call last):
File "/home/dje/cpython-buildarea/3.x.edelsohn-fedora-z.refleak/build/Lib/multiprocessing/util.py", line 300, in _run_finalizers
finalizer()
File "/home/dje/cpython-buildarea/3.x.edelsohn-fedora-z.refleak/build/Lib/multiprocessing/util.py", line 224, in __call__
res = self._callback(*self._args, **self._kwargs)
File "/home/dje/cpython-buildarea/3.x.edelsohn-fedora-z.refleak/build/Lib/multiprocessing/synchronize.py", line 87, in _cleanup
sem_unlink(name)
FileNotFoundError: [Errno 2] No such file or directory
Traceback (most recent call last):
File "/home/dje/cpython-buildarea/3.x.edelsohn-fedora-z.refleak/build/Lib/multiprocessing/util.py", line 300, in _run_finalizers
finalizer()
File "/home/dje/cpython-buildarea/3.x.edelsohn-fedora-z.refleak/build/Lib/multiprocessing/util.py", line 224, in __call__
res = self._callback(*self._args, **self._kwargs)
File "/home/dje/cpython-buildarea/3.x.edelsohn-fedora-z.refleak/build/Lib/multiprocessing/synchronize.py", line 87, in _cleanup
sem_unlink(name)
FileNotFoundError: [Errno 2] No such file or directory
Traceback (most recent call last):
File "/home/dje/cpython-buildarea/3.x.edelsohn-fedora-z.refleak/build/Lib/multiprocessing/util.py", line 300, in _run_finalizers
finalizer()
File "/home/dje/cpython-buildarea/3.x.edelsohn-fedora-z.refleak/build/Lib/multiprocessing/util.py", line 224, in __call__
res = self._callback(*self._args, **self._kwargs)
File "/home/dje/cpython-buildarea/3.x.edelsohn-fedora-z.refleak/build/Lib/multiprocessing/synchronize.py", line 87, in _cleanup
sem_unlink(name)
FileNotFoundError: [Errno 2] No such file or directory
Traceback (most recent call last):
File "/home/dje/cpython-buildarea/3.x.edelsohn-fedora-z.refleak/build/Lib/multiprocessing/util.py", line 300, in _run_finalizers
finalizer()
File "/home/dje/cpython-buildarea/3.x.edelsohn-fedora-z.refleak/build/Lib/multiprocessing/util.py", line 224, in __call__
res = self._callback(*self._args, **self._kwargs)
File "/home/dje/cpython-buildarea/3.x.edelsohn-fedora-z.refleak/build/Lib/multiprocessing/synchronize.py", line 87, in _cleanup
sem_unlink(name)
FileNotFoundError: [Errno 2] No such file or directory
./home/dje/cpython-buildarea/3.x.edelsohn-fedora-z.refleak/build/Lib/multiprocessing/resource_tracker.py:216: UserWarning: resource_tracker: There appear to be 6 leaked semaphore objects to clean up at shutdown
warnings.warn('resource_tracker: There appear to be %d '
Traceback (most recent call last):
File "/home/dje/cpython-buildarea/3.x.edelsohn-fedora-z.refleak/build/Lib/multiprocessing/util.py", line 300, in _run_finalizers
finalizer()
File "/home/dje/cpython-buildarea/3.x.edelsohn-fedora-z.refleak/build/Lib/multiprocessing/util.py", line 224, in __call__
res = self._callback(*self._args, **self._kwargs)
File "/home/dje/cpython-buildarea/3.x.edelsohn-fedora-z.refleak/build/Lib/multiprocessing/synchronize.py", line 87, in _cleanup
sem_unlink(name)
FileNotFoundError: [Errno 2] No such file or directory
Traceback (most recent call last):
File "/home/dje/cpython-buildarea/3.x.edelsohn-fedora-z.refleak/build/Lib/multiprocessing/util.py", line 300, in _run_finalizers
finalizer()
File "/home/dje/cpython-buildarea/3.x.edelsohn-fedora-z.refleak/build/Lib/multiprocessing/util.py", line 224, in __call__
res = self._callback(*self._args, **self._kwargs)
File "/home/dje/cpython-buildarea/3.x.edelsohn-fedora-z.refleak/build/Lib/multiprocessing/synchronize.py", line 87, in _cleanup
sem_unlink(name)
FileNotFoundError: [Errno 2] No such file or directory
Traceback (most recent call last):
File "/home/dje/cpython-buildarea/3.x.edelsohn-fedora-z.refleak/build/Lib/multiprocessing/util.py", line 300, in _run_finalizers
finalizer()
File "/home/dje/cpython-buildarea/3.x.edelsohn-fedora-z.refleak/build/Lib/multiprocessing/util.py", line 224, in __call__
res = self._callback(*self._args, **self._kwargs)
File "/home/dje/cpython-buildarea/3.x.edelsohn-fedora-z.refleak/build/Lib/multiprocessing/synchronize.py", line 87, in _cleanup
sem_unlink(name)
FileNotFoundError: [Errno 2] No such file or directory
Traceback (most recent call last):
File "/home/dje/cpython-buildarea/3.x.edelsohn-fedora-z.refleak/build/Lib/multiprocessing/util.py", line 300, in _run_finalizers
finalizer()
File "/home/dje/cpython-buildarea/3.x.edelsohn-fedora-z.refleak/build/Lib/multiprocessing/util.py", line 224, in __call__
res = self._callback(*self._args, **self._kwargs)
File "/home/dje/cpython-buildarea/3.x.edelsohn-fedora-z.refleak/build/Lib/multiprocessing/synchronize.py", line 87, in _cleanup
sem_unlink(name)
FileNotFoundError: [Errno 2] No such file or directory
Traceback (most recent call last):
File "/home/dje/cpython-buildarea/3.x.edelsohn-fedora-z.refleak/build/Lib/multiprocessing/util.py", line 300, in _run_finalizers
finalizer()
File "/home/dje/cpython-buildarea/3.x.edelsohn-fedora-z.refleak/build/Lib/multiprocessing/util.py", line 224, in __call__
res = self._callback(*self._args, **self._kwargs)
File "/home/dje/cpython-buildarea/3.x.edelsohn-fedora-z.refleak/build/Lib/multiprocessing/synchronize.py", line 87, in _cleanup
sem_unlink(name)
FileNotFoundError: [Errno 2] No such file or directory
Traceback (most recent call last):
File "/home/dje/cpython-buildarea/3.x.edelsohn-fedora-z.refleak/build/Lib/multiprocessing/util.py", line 300, in _run_finalizers
finalizer()
File "/home/dje/cpython-buildarea/3.x.edelsohn-fedora-z.refleak/build/Lib/multiprocessing/util.py", line 224, in __call__
res = self._callback(*self._args, **self._kwargs)
File "/home/dje/cpython-buildarea/3.x.edelsohn-fedora-z.refleak/build/Lib/multiprocessing/synchronize.py", line 87, in _cleanup
sem_unlink(name)
FileNotFoundError: [Errno 2] No such file or directory
./home/dje/cpython-buildarea/3.x.edelsohn-fedora-z.refleak/build/Lib/multiprocessing/resource_tracker.py:216: UserWarning: resource_tracker: There appear to be 6 leaked semaphore objects to clean up at shutdown
warnings.warn('resource_tracker: There appear to be %d '
Traceback (most recent call last):
File "/home/dje/cpython-buildarea/3.x.edelsohn-fedora-z.refleak/build/Lib/multiprocessing/util.py", line 300, in _run_finalizers
finalizer()
File "/home/dje/cpython-buildarea/3.x.edelsohn-fedora-z.refleak/build/Lib/multiprocessing/util.py", line 224, in __call__
res = self._callback(*self._args, **self._kwargs)
File "/home/dje/cpython-buildarea/3.x.edelsohn-fedora-z.refleak/build/Lib/multiprocessing/synchronize.py", line 87, in _cleanup
sem_unlink(name)
FileNotFoundError: [Errno 2] No such file or directory
Traceback (most recent call last):
File "/home/dje/cpython-buildarea/3.x.edelsohn-fedora-z.refleak/build/Lib/multiprocessing/util.py", line 300, in _run_finalizers
finalizer()
File "/home/dje/cpython-buildarea/3.x.edelsohn-fedora-z.refleak/build/Lib/multiprocessing/util.py", line 224, in __call__
res = self._callback(*self._args, **self._kwargs)
File "/home/dje/cpython-buildarea/3.x.edelsohn-fedora-z.refleak/build/Lib/multiprocessing/synchronize.py", line 87, in _cleanup
sem_unlink(name)
FileNotFoundError: [Errno 2] No such file or directory
Traceback (most recent call last):
File "/home/dje/cpython-buildarea/3.x.edelsohn-fedora-z.refleak/build/Lib/multiprocessing/util.py", line 300, in _run_finalizers
finalizer()
File "/home/dje/cpython-buildarea/3.x.edelsohn-fedora-z.refleak/build/Lib/multiprocessing/util.py", line 224, in __call__
res = self._callback(*self._args, **self._kwargs)
File "/home/dje/cpython-buildarea/3.x.edelsohn-fedora-z.refleak/build/Lib/multiprocessing/synchronize.py", line 87, in _cleanup
sem_unlink(name)
FileNotFoundError: [Errno 2] No such file or directory
Traceback (most recent call last):
File "/home/dje/cpython-buildarea/3.x.edelsohn-fedora-z.refleak/build/Lib/multiprocessing/util.py", line 300, in _run_finalizers
finalizer()
File "/home/dje/cpython-buildarea/3.x.edelsohn-fedora-z.refleak/build/Lib/multiprocessing/util.py", line 224, in __call__
res = self._callback(*self._args, **self._kwargs)
File "/home/dje/cpython-buildarea/3.x.edelsohn-fedora-z.refleak/build/Lib/multiprocessing/synchronize.py", line 87, in _cleanup
sem_unlink(name)
FileNotFoundError: [Errno 2] No such file or directory
Traceback (most recent call last):
File "/home/dje/cpython-buildarea/3.x.edelsohn-fedora-z.refleak/build/Lib/multiprocessing/util.py", line 300, in _run_finalizers
finalizer()
File "/home/dje/cpython-buildarea/3.x.edelsohn-fedora-z.refleak/build/Lib/multiprocessing/util.py", line 224, in __call__
res = self._callback(*self._args, **self._kwargs)
File "/home/dje/cpython-buildarea/3.x.edelsohn-fedora-z.refleak/build/Lib/multiprocessing/synchronize.py", line 87, in _cleanup
sem_unlink(name)
FileNotFoundError: [Errno 2] No such file or directory
Traceback (most recent call last):
File "/home/dje/cpython-buildarea/3.x.edelsohn-fedora-z.refleak/build/Lib/multiprocessing/util.py", line 300, in _run_finalizers
finalizer()
File "/home/dje/cpython-buildarea/3.x.edelsohn-fedora-z.refleak/build/Lib/multiprocessing/util.py", line 224, in __call__
res = self._callback(*self._args, **self._kwargs)
File "/home/dje/cpython-buildarea/3.x.edelsohn-fedora-z.refleak/build/Lib/multiprocessing/synchronize.py", line 87, in _cleanup
sem_unlink(name)
FileNotFoundError: [Errno 2] No such file or directory
.
Test report
===========
Failed tests:
- test_socketserver
- test_logging
- test_asyncio
Test leaking resources:
- test_logging: references
- test_socketserver: references
- test_logging: memory blocks
- test_socketserver: memory blocks
Sincerely,
-The Buildbot
2
1
Nov. 2, 2020
The Buildbot has detected a new failure on builder PPC64LE RHEL7 Refleaks 3.x while building Python.
Full details are available at:
https://buildbot.python.org/all/#builders/205/builds/82
Buildbot URL: https://buildbot.python.org/all/
Worker for this Build: cstratak-RHEL7-ppc64le
Build Reason: <unknown>
Blamelist:
BUILD FAILED: failed test (failure)
Summary of the results of the build (if available):
===================================================
==
Captured traceback
==================
Traceback (most recent call last):
File "/home/buildbot/buildarea/3.x.cstratak-RHEL7-ppc64le.refleak/build/Lib/multiprocessing/util.py", line 300, in _run_finalizers
finalizer()
File "/home/buildbot/buildarea/3.x.cstratak-RHEL7-ppc64le.refleak/build/Lib/multiprocessing/util.py", line 224, in __call__
res = self._callback(*self._args, **self._kwargs)
File "/home/buildbot/buildarea/3.x.cstratak-RHEL7-ppc64le.refleak/build/Lib/multiprocessing/synchronize.py", line 87, in _cleanup
sem_unlink(name)
FileNotFoundError: [Errno 2] No such file or directory
Traceback (most recent call last):
File "/home/buildbot/buildarea/3.x.cstratak-RHEL7-ppc64le.refleak/build/Lib/multiprocessing/util.py", line 300, in _run_finalizers
finalizer()
File "/home/buildbot/buildarea/3.x.cstratak-RHEL7-ppc64le.refleak/build/Lib/multiprocessing/util.py", line 224, in __call__
res = self._callback(*self._args, **self._kwargs)
File "/home/buildbot/buildarea/3.x.cstratak-RHEL7-ppc64le.refleak/build/Lib/multiprocessing/synchronize.py", line 87, in _cleanup
sem_unlink(name)
FileNotFoundError: [Errno 2] No such file or directory
Traceback (most recent call last):
File "/home/buildbot/buildarea/3.x.cstratak-RHEL7-ppc64le.refleak/build/Lib/multiprocessing/util.py", line 300, in _run_finalizers
finalizer()
File "/home/buildbot/buildarea/3.x.cstratak-RHEL7-ppc64le.refleak/build/Lib/multiprocessing/util.py", line 224, in __call__
res = self._callback(*self._args, **self._kwargs)
File "/home/buildbot/buildarea/3.x.cstratak-RHEL7-ppc64le.refleak/build/Lib/multiprocessing/synchronize.py", line 87, in _cleanup
sem_unlink(name)
FileNotFoundError: [Errno 2] No such file or directory
Traceback (most recent call last):
File "/home/buildbot/buildarea/3.x.cstratak-RHEL7-ppc64le.refleak/build/Lib/multiprocessing/util.py", line 300, in _run_finalizers
finalizer()
File "/home/buildbot/buildarea/3.x.cstratak-RHEL7-ppc64le.refleak/build/Lib/multiprocessing/util.py", line 224, in __call__
res = self._callback(*self._args, **self._kwargs)
File "/home/buildbot/buildarea/3.x.cstratak-RHEL7-ppc64le.refleak/build/Lib/multiprocessing/synchronize.py", line 87, in _cleanup
sem_unlink(name)
FileNotFoundError: [Errno 2] No such file or directory
Traceback (most recent call last):
File "/home/buildbot/buildarea/3.x.cstratak-RHEL7-ppc64le.refleak/build/Lib/multiprocessing/util.py", line 300, in _run_finalizers
finalizer()
File "/home/buildbot/buildarea/3.x.cstratak-RHEL7-ppc64le.refleak/build/Lib/multiprocessing/util.py", line 224, in __call__
res = self._callback(*self._args, **self._kwargs)
File "/home/buildbot/buildarea/3.x.cstratak-RHEL7-ppc64le.refleak/build/Lib/multiprocessing/synchronize.py", line 87, in _cleanup
sem_unlink(name)
FileNotFoundError: [Errno 2] No such file or directory
Traceback (most recent call last):
File "/home/buildbot/buildarea/3.x.cstratak-RHEL7-ppc64le.refleak/build/Lib/multiprocessing/util.py", line 300, in _run_finalizers
finalizer()
File "/home/buildbot/buildarea/3.x.cstratak-RHEL7-ppc64le.refleak/build/Lib/multiprocessing/util.py", line 224, in __call__
res = self._callback(*self._args, **self._kwargs)
File "/home/buildbot/buildarea/3.x.cstratak-RHEL7-ppc64le.refleak/build/Lib/multiprocessing/synchronize.py", line 87, in _cleanup
sem_unlink(name)
FileNotFoundError: [Errno 2] No such file or directory
./home/buildbot/buildarea/3.x.cstratak-RHEL7-ppc64le.refleak/build/Lib/multiprocessing/resource_tracker.py:216: UserWarning: resource_tracker: There appear to be 6 leaked semaphore objects to clean up at shutdown
warnings.warn('resource_tracker: There appear to be %d '
Traceback (most recent call last):
File "/home/buildbot/buildarea/3.x.cstratak-RHEL7-ppc64le.refleak/build/Lib/multiprocessing/util.py", line 300, in _run_finalizers
finalizer()
File "/home/buildbot/buildarea/3.x.cstratak-RHEL7-ppc64le.refleak/build/Lib/multiprocessing/util.py", line 224, in __call__
res = self._callback(*self._args, **self._kwargs)
File "/home/buildbot/buildarea/3.x.cstratak-RHEL7-ppc64le.refleak/build/Lib/multiprocessing/synchronize.py", line 87, in _cleanup
sem_unlink(name)
FileNotFoundError: [Errno 2] No such file or directory
Traceback (most recent call last):
File "/home/buildbot/buildarea/3.x.cstratak-RHEL7-ppc64le.refleak/build/Lib/multiprocessing/util.py", line 300, in _run_finalizers
finalizer()
File "/home/buildbot/buildarea/3.x.cstratak-RHEL7-ppc64le.refleak/build/Lib/multiprocessing/util.py", line 224, in __call__
res = self._callback(*self._args, **self._kwargs)
File "/home/buildbot/buildarea/3.x.cstratak-RHEL7-ppc64le.refleak/build/Lib/multiprocessing/synchronize.py", line 87, in _cleanup
sem_unlink(name)
FileNotFoundError: [Errno 2] No such file or directory
Traceback (most recent call last):
File "/home/buildbot/buildarea/3.x.cstratak-RHEL7-ppc64le.refleak/build/Lib/multiprocessing/util.py", line 300, in _run_finalizers
finalizer()
File "/home/buildbot/buildarea/3.x.cstratak-RHEL7-ppc64le.refleak/build/Lib/multiprocessing/util.py", line 224, in __call__
res = self._callback(*self._args, **self._kwargs)
File "/home/buildbot/buildarea/3.x.cstratak-RHEL7-ppc64le.refleak/build/Lib/multiprocessing/synchronize.py", line 87, in _cleanup
sem_unlink(name)
FileNotFoundError: [Errno 2] No such file or directory
Traceback (most recent call last):
File "/home/buildbot/buildarea/3.x.cstratak-RHEL7-ppc64le.refleak/build/Lib/multiprocessing/util.py", line 300, in _run_finalizers
finalizer()
File "/home/buildbot/buildarea/3.x.cstratak-RHEL7-ppc64le.refleak/build/Lib/multiprocessing/util.py", line 224, in __call__
res = self._callback(*self._args, **self._kwargs)
File "/home/buildbot/buildarea/3.x.cstratak-RHEL7-ppc64le.refleak/build/Lib/multiprocessing/synchronize.py", line 87, in _cleanup
sem_unlink(name)
FileNotFoundError: [Errno 2] No such file or directory
Traceback (most recent call last):
File "/home/buildbot/buildarea/3.x.cstratak-RHEL7-ppc64le.refleak/build/Lib/multiprocessing/util.py", line 300, in _run_finalizers
finalizer()
File "/home/buildbot/buildarea/3.x.cstratak-RHEL7-ppc64le.refleak/build/Lib/multiprocessing/util.py", line 224, in __call__
res = self._callback(*self._args, **self._kwargs)
File "/home/buildbot/buildarea/3.x.cstratak-RHEL7-ppc64le.refleak/build/Lib/multiprocessing/synchronize.py", line 87, in _cleanup
sem_unlink(name)
FileNotFoundError: [Errno 2] No such file or directory
Traceback (most recent call last):
File "/home/buildbot/buildarea/3.x.cstratak-RHEL7-ppc64le.refleak/build/Lib/multiprocessing/util.py", line 300, in _run_finalizers
finalizer()
File "/home/buildbot/buildarea/3.x.cstratak-RHEL7-ppc64le.refleak/build/Lib/multiprocessing/util.py", line 224, in __call__
res = self._callback(*self._args, **self._kwargs)
File "/home/buildbot/buildarea/3.x.cstratak-RHEL7-ppc64le.refleak/build/Lib/multiprocessing/synchronize.py", line 87, in _cleanup
sem_unlink(name)
FileNotFoundError: [Errno 2] No such file or directory
./home/buildbot/buildarea/3.x.cstratak-RHEL7-ppc64le.refleak/build/Lib/multiprocessing/resource_tracker.py:216: UserWarning: resource_tracker: There appear to be 6 leaked semaphore objects to clean up at shutdown
warnings.warn('resource_tracker: There appear to be %d '
Traceback (most recent call last):
File "/home/buildbot/buildarea/3.x.cstratak-RHEL7-ppc64le.refleak/build/Lib/multiprocessing/util.py", line 300, in _run_finalizers
finalizer()
File "/home/buildbot/buildarea/3.x.cstratak-RHEL7-ppc64le.refleak/build/Lib/multiprocessing/util.py", line 224, in __call__
res = self._callback(*self._args, **self._kwargs)
File "/home/buildbot/buildarea/3.x.cstratak-RHEL7-ppc64le.refleak/build/Lib/multiprocessing/synchronize.py", line 87, in _cleanup
sem_unlink(name)
FileNotFoundError: [Errno 2] No such file or directory
Traceback (most recent call last):
File "/home/buildbot/buildarea/3.x.cstratak-RHEL7-ppc64le.refleak/build/Lib/multiprocessing/util.py", line 300, in _run_finalizers
finalizer()
File "/home/buildbot/buildarea/3.x.cstratak-RHEL7-ppc64le.refleak/build/Lib/multiprocessing/util.py", line 224, in __call__
res = self._callback(*self._args, **self._kwargs)
File "/home/buildbot/buildarea/3.x.cstratak-RHEL7-ppc64le.refleak/build/Lib/multiprocessing/synchronize.py", line 87, in _cleanup
sem_unlink(name)
FileNotFoundError: [Errno 2] No such file or directory
Traceback (most recent call last):
File "/home/buildbot/buildarea/3.x.cstratak-RHEL7-ppc64le.refleak/build/Lib/multiprocessing/util.py", line 300, in _run_finalizers
finalizer()
File "/home/buildbot/buildarea/3.x.cstratak-RHEL7-ppc64le.refleak/build/Lib/multiprocessing/util.py", line 224, in __call__
res = self._callback(*self._args, **self._kwargs)
File "/home/buildbot/buildarea/3.x.cstratak-RHEL7-ppc64le.refleak/build/Lib/multiprocessing/synchronize.py", line 87, in _cleanup
sem_unlink(name)
FileNotFoundError: [Errno 2] No such file or directory
Traceback (most recent call last):
File "/home/buildbot/buildarea/3.x.cstratak-RHEL7-ppc64le.refleak/build/Lib/multiprocessing/util.py", line 300, in _run_finalizers
finalizer()
File "/home/buildbot/buildarea/3.x.cstratak-RHEL7-ppc64le.refleak/build/Lib/multiprocessing/util.py", line 224, in __call__
res = self._callback(*self._args, **self._kwargs)
File "/home/buildbot/buildarea/3.x.cstratak-RHEL7-ppc64le.refleak/build/Lib/multiprocessing/synchronize.py", line 87, in _cleanup
sem_unlink(name)
FileNotFoundError: [Errno 2] No such file or directory
Traceback (most recent call last):
File "/home/buildbot/buildarea/3.x.cstratak-RHEL7-ppc64le.refleak/build/Lib/multiprocessing/util.py", line 300, in _run_finalizers
finalizer()
File "/home/buildbot/buildarea/3.x.cstratak-RHEL7-ppc64le.refleak/build/Lib/multiprocessing/util.py", line 224, in __call__
res = self._callback(*self._args, **self._kwargs)
File "/home/buildbot/buildarea/3.x.cstratak-RHEL7-ppc64le.refleak/build/Lib/multiprocessing/synchronize.py", line 87, in _cleanup
sem_unlink(name)
FileNotFoundError: [Errno 2] No such file or directory
Traceback (most recent call last):
File "/home/buildbot/buildarea/3.x.cstratak-RHEL7-ppc64le.refleak/build/Lib/multiprocessing/util.py", line 300, in _run_finalizers
finalizer()
File "/home/buildbot/buildarea/3.x.cstratak-RHEL7-ppc64le.refleak/build/Lib/multiprocessing/util.py", line 224, in __call__
res = self._callback(*self._args, **self._kwargs)
File "/home/buildbot/buildarea/3.x.cstratak-RHEL7-ppc64le.refleak/build/Lib/multiprocessing/synchronize.py", line 87, in _cleanup
sem_unlink(name)
FileNotFoundError: [Errno 2] No such file or directory
./home/buildbot/buildarea/3.x.cstratak-RHEL7-ppc64le.refleak/build/Lib/multiprocessing/resource_tracker.py:216: UserWarning: resource_tracker: There appear to be 6 leaked semaphore objects to clean up at shutdown
warnings.warn('resource_tracker: There appear to be %d '
Traceback (most recent call last):
File "/home/buildbot/buildarea/3.x.cstratak-RHEL7-ppc64le.refleak/build/Lib/multiprocessing/util.py", line 300, in _run_finalizers
finalizer()
File "/home/buildbot/buildarea/3.x.cstratak-RHEL7-ppc64le.refleak/build/Lib/multiprocessing/util.py", line 224, in __call__
res = self._callback(*self._args, **self._kwargs)
File "/home/buildbot/buildarea/3.x.cstratak-RHEL7-ppc64le.refleak/build/Lib/multiprocessing/synchronize.py", line 87, in _cleanup
sem_unlink(name)
FileNotFoundError: [Errno 2] No such file or directory
Traceback (most recent call last):
File "/home/buildbot/buildarea/3.x.cstratak-RHEL7-ppc64le.refleak/build/Lib/multiprocessing/util.py", line 300, in _run_finalizers
finalizer()
File "/home/buildbot/buildarea/3.x.cstratak-RHEL7-ppc64le.refleak/build/Lib/multiprocessing/util.py", line 224, in __call__
res = self._callback(*self._args, **self._kwargs)
File "/home/buildbot/buildarea/3.x.cstratak-RHEL7-ppc64le.refleak/build/Lib/multiprocessing/synchronize.py", line 87, in _cleanup
sem_unlink(name)
FileNotFoundError: [Errno 2] No such file or directory
Traceback (most recent call last):
File "/home/buildbot/buildarea/3.x.cstratak-RHEL7-ppc64le.refleak/build/Lib/multiprocessing/util.py", line 300, in _run_finalizers
finalizer()
File "/home/buildbot/buildarea/3.x.cstratak-RHEL7-ppc64le.refleak/build/Lib/multiprocessing/util.py", line 224, in __call__
res = self._callback(*self._args, **self._kwargs)
File "/home/buildbot/buildarea/3.x.cstratak-RHEL7-ppc64le.refleak/build/Lib/multiprocessing/synchronize.py", line 87, in _cleanup
sem_unlink(name)
FileNotFoundError: [Errno 2] No such file or directory
Traceback (most recent call last):
File "/home/buildbot/buildarea/3.x.cstratak-RHEL7-ppc64le.refleak/build/Lib/multiprocessing/util.py", line 300, in _run_finalizers
finalizer()
File "/home/buildbot/buildarea/3.x.cstratak-RHEL7-ppc64le.refleak/build/Lib/multiprocessing/util.py", line 224, in __call__
res = self._callback(*self._args, **self._kwargs)
File "/home/buildbot/buildarea/3.x.cstratak-RHEL7-ppc64le.refleak/build/Lib/multiprocessing/synchronize.py", line 87, in _cleanup
sem_unlink(name)
FileNotFoundError: [Errno 2] No such file or directory
Traceback (most recent call last):
File "/home/buildbot/buildarea/3.x.cstratak-RHEL7-ppc64le.refleak/build/Lib/multiprocessing/util.py", line 300, in _run_finalizers
finalizer()
File "/home/buildbot/buildarea/3.x.cstratak-RHEL7-ppc64le.refleak/build/Lib/multiprocessing/util.py", line 224, in __call__
res = self._callback(*self._args, **self._kwargs)
File "/home/buildbot/buildarea/3.x.cstratak-RHEL7-ppc64le.refleak/build/Lib/multiprocessing/synchronize.py", line 87, in _cleanup
sem_unlink(name)
FileNotFoundError: [Errno 2] No such file or directory
Traceback (most recent call last):
File "/home/buildbot/buildarea/3.x.cstratak-RHEL7-ppc64le.refleak/build/Lib/multiprocessing/util.py", line 300, in _run_finalizers
finalizer()
File "/home/buildbot/buildarea/3.x.cstratak-RHEL7-ppc64le.refleak/build/Lib/multiprocessing/util.py", line 224, in __call__
res = self._callback(*self._args, **self._kwargs)
File "/home/buildbot/buildarea/3.x.cstratak-RHEL7-ppc64le.refleak/build/Lib/multiprocessing/synchronize.py", line 87, in _cleanup
sem_unlink(name)
FileNotFoundError: [Errno 2] No such file or directory
./home/buildbot/buildarea/3.x.cstratak-RHEL7-ppc64le.refleak/build/Lib/multiprocessing/resource_tracker.py:216: UserWarning: resource_tracker: There appear to be 6 leaked semaphore objects to clean up at shutdown
warnings.warn('resource_tracker: There appear to be %d '
Traceback (most recent call last):
File "/home/buildbot/buildarea/3.x.cstratak-RHEL7-ppc64le.refleak/build/Lib/multiprocessing/util.py", line 300, in _run_finalizers
finalizer()
File "/home/buildbot/buildarea/3.x.cstratak-RHEL7-ppc64le.refleak/build/Lib/multiprocessing/util.py", line 224, in __call__
res = self._callback(*self._args, **self._kwargs)
File "/home/buildbot/buildarea/3.x.cstratak-RHEL7-ppc64le.refleak/build/Lib/multiprocessing/synchronize.py", line 87, in _cleanup
sem_unlink(name)
FileNotFoundError: [Errno 2] No such file or directory
Traceback (most recent call last):
File "/home/buildbot/buildarea/3.x.cstratak-RHEL7-ppc64le.refleak/build/Lib/multiprocessing/util.py", line 300, in _run_finalizers
finalizer()
File "/home/buildbot/buildarea/3.x.cstratak-RHEL7-ppc64le.refleak/build/Lib/multiprocessing/util.py", line 224, in __call__
res = self._callback(*self._args, **self._kwargs)
File "/home/buildbot/buildarea/3.x.cstratak-RHEL7-ppc64le.refleak/build/Lib/multiprocessing/synchronize.py", line 87, in _cleanup
sem_unlink(name)
FileNotFoundError: [Errno 2] No such file or directory
Traceback (most recent call last):
File "/home/buildbot/buildarea/3.x.cstratak-RHEL7-ppc64le.refleak/build/Lib/multiprocessing/util.py", line 300, in _run_finalizers
finalizer()
File "/home/buildbot/buildarea/3.x.cstratak-RHEL7-ppc64le.refleak/build/Lib/multiprocessing/util.py", line 224, in __call__
res = self._callback(*self._args, **self._kwargs)
File "/home/buildbot/buildarea/3.x.cstratak-RHEL7-ppc64le.refleak/build/Lib/multiprocessing/synchronize.py", line 87, in _cleanup
sem_unlink(name)
FileNotFoundError: [Errno 2] No such file or directory
Traceback (most recent call last):
File "/home/buildbot/buildarea/3.x.cstratak-RHEL7-ppc64le.refleak/build/Lib/multiprocessing/util.py", line 300, in _run_finalizers
finalizer()
File "/home/buildbot/buildarea/3.x.cstratak-RHEL7-ppc64le.refleak/build/Lib/multiprocessing/util.py", line 224, in __call__
res = self._callback(*self._args, **self._kwargs)
File "/home/buildbot/buildarea/3.x.cstratak-RHEL7-ppc64le.refleak/build/Lib/multiprocessing/synchronize.py", line 87, in _cleanup
sem_unlink(name)
FileNotFoundError: [Errno 2] No such file or directory
Traceback (most recent call last):
File "/home/buildbot/buildarea/3.x.cstratak-RHEL7-ppc64le.refleak/build/Lib/multiprocessing/util.py", line 300, in _run_finalizers
finalizer()
File "/home/buildbot/buildarea/3.x.cstratak-RHEL7-ppc64le.refleak/build/Lib/multiprocessing/util.py", line 224, in __call__
res = self._callback(*self._args, **self._kwargs)
File "/home/buildbot/buildarea/3.x.cstratak-RHEL7-ppc64le.refleak/build/Lib/multiprocessing/synchronize.py", line 87, in _cleanup
sem_unlink(name)
FileNotFoundError: [Errno 2] No such file or directory
Traceback (most recent call last):
File "/home/buildbot/buildarea/3.x.cstratak-RHEL7-ppc64le.refleak/build/Lib/multiprocessing/util.py", line 300, in _run_finalizers
finalizer()
File "/home/buildbot/buildarea/3.x.cstratak-RHEL7-ppc64le.refleak/build/Lib/multiprocessing/util.py", line 224, in __call__
res = self._callback(*self._args, **self._kwargs)
File "/home/buildbot/buildarea/3.x.cstratak-RHEL7-ppc64le.refleak/build/Lib/multiprocessing/synchronize.py", line 87, in _cleanup
sem_unlink(name)
FileNotFoundError: [Errno 2] No such file or directory
./home/buildbot/buildarea/3.x.cstratak-RHEL7-ppc64le.refleak/build/Lib/multiprocessing/resource_tracker.py:216: UserWarning: resource_tracker: There appear to be 6 leaked semaphore objects to clean up at shutdown
warnings.warn('resource_tracker: There appear to be %d '
Traceback (most recent call last):
File "/home/buildbot/buildarea/3.x.cstratak-RHEL7-ppc64le.refleak/build/Lib/multiprocessing/util.py", line 300, in _run_finalizers
finalizer()
File "/home/buildbot/buildarea/3.x.cstratak-RHEL7-ppc64le.refleak/build/Lib/multiprocessing/util.py", line 224, in __call__
res = self._callback(*self._args, **self._kwargs)
File "/home/buildbot/buildarea/3.x.cstratak-RHEL7-ppc64le.refleak/build/Lib/multiprocessing/synchronize.py", line 87, in _cleanup
sem_unlink(name)
FileNotFoundError: [Errno 2] No such file or directory
Traceback (most recent call last):
File "/home/buildbot/buildarea/3.x.cstratak-RHEL7-ppc64le.refleak/build/Lib/multiprocessing/util.py", line 300, in _run_finalizers
finalizer()
File "/home/buildbot/buildarea/3.x.cstratak-RHEL7-ppc64le.refleak/build/Lib/multiprocessing/util.py", line 224, in __call__
res = self._callback(*self._args, **self._kwargs)
File "/home/buildbot/buildarea/3.x.cstratak-RHEL7-ppc64le.refleak/build/Lib/multiprocessing/synchronize.py", line 87, in _cleanup
sem_unlink(name)
FileNotFoundError: [Errno 2] No such file or directory
Traceback (most recent call last):
File "/home/buildbot/buildarea/3.x.cstratak-RHEL7-ppc64le.refleak/build/Lib/multiprocessing/util.py", line 300, in _run_finalizers
finalizer()
File "/home/buildbot/buildarea/3.x.cstratak-RHEL7-ppc64le.refleak/build/Lib/multiprocessing/util.py", line 224, in __call__
res = self._callback(*self._args, **self._kwargs)
File "/home/buildbot/buildarea/3.x.cstratak-RHEL7-ppc64le.refleak/build/Lib/multiprocessing/synchronize.py", line 87, in _cleanup
sem_unlink(name)
FileNotFoundError: [Errno 2] No such file or directory
Traceback (most recent call last):
File "/home/buildbot/buildarea/3.x.cstratak-RHEL7-ppc64le.refleak/build/Lib/multiprocessing/util.py", line 300, in _run_finalizers
finalizer()
File "/home/buildbot/buildarea/3.x.cstratak-RHEL7-ppc64le.refleak/build/Lib/multiprocessing/util.py", line 224, in __call__
res = self._callback(*self._args, **self._kwargs)
File "/home/buildbot/buildarea/3.x.cstratak-RHEL7-ppc64le.refleak/build/Lib/multiprocessing/synchronize.py", line 87, in _cleanup
sem_unlink(name)
FileNotFoundError: [Errno 2] No such file or directory
Traceback (most recent call last):
File "/home/buildbot/buildarea/3.x.cstratak-RHEL7-ppc64le.refleak/build/Lib/multiprocessing/util.py", line 300, in _run_finalizers
finalizer()
File "/home/buildbot/buildarea/3.x.cstratak-RHEL7-ppc64le.refleak/build/Lib/multiprocessing/util.py", line 224, in __call__
res = self._callback(*self._args, **self._kwargs)
File "/home/buildbot/buildarea/3.x.cstratak-RHEL7-ppc64le.refleak/build/Lib/multiprocessing/synchronize.py", line 87, in _cleanup
sem_unlink(name)
FileNotFoundError: [Errno 2] No such file or directory
Traceback (most recent call last):
File "/home/buildbot/buildarea/3.x.cstratak-RHEL7-ppc64le.refleak/build/Lib/multiprocessing/util.py", line 300, in _run_finalizers
finalizer()
File "/home/buildbot/buildarea/3.x.cstratak-RHEL7-ppc64le.refleak/build/Lib/multiprocessing/util.py", line 224, in __call__
res = self._callback(*self._args, **self._kwargs)
File "/home/buildbot/buildarea/3.x.cstratak-RHEL7-ppc64le.refleak/build/Lib/multiprocessing/synchronize.py", line 87, in _cleanup
sem_unlink(name)
FileNotFoundError: [Errno 2] No such file or directory
.
Traceback (most recent call last):
File "/home/buildbot/buildarea/3.x.cstratak-RHEL7-ppc64le.refleak/build/Lib/threading.py", line 960, in _bootstrap_inner
self.run()
File "/home/buildbot/buildarea/3.x.cstratak-RHEL7-ppc64le.refleak/build/Lib/concurrent/futures/process.py", line 317, in run
result_item, is_broken, cause = self.wait_result_broken_or_wakeup()
File "/home/buildbot/buildarea/3.x.cstratak-RHEL7-ppc64le.refleak/build/Lib/concurrent/futures/process.py", line 377, in wait_result_broken_or_wakeup
ready = mp.connection.wait(readers + worker_sentinels)
AttributeError: module 'multiprocessing' has no attribute 'connection'
Timeout (3:15:00)!
Thread 0x00003fff7199f1b0 (most recent call first):
File "/home/buildbot/buildarea/3.x.cstratak-RHEL7-ppc64le.refleak/build/Lib/threading.py", line 312 in wait
File "/home/buildbot/buildarea/3.x.cstratak-RHEL7-ppc64le.refleak/build/Lib/multiprocessing/queues.py", line 233 in _feed
File "/home/buildbot/buildarea/3.x.cstratak-RHEL7-ppc64le.refleak/build/Lib/threading.py", line 898 in run
File "/home/buildbot/buildarea/3.x.cstratak-RHEL7-ppc64le.refleak/build/Lib/threading.py", line 960 in _bootstrap_inner
File "/home/buildbot/buildarea/3.x.cstratak-RHEL7-ppc64le.refleak/build/Lib/threading.py", line 918 in _bootstrap
Test report
===========
Failed tests:
- test_socketserver
- test_logging
- test_asyncio
Test leaking resources:
- test_logging: references
- test_socketserver: references
- test_logging: memory blocks
- test_socketserver: memory blocks
Sincerely,
-The Buildbot
1
0
Buildbot failure in Python on PPC64LE Fedora Stable Refleaks 3.x
by buildbot@python.org Nov. 2, 2020
by buildbot@python.org Nov. 2, 2020
Nov. 2, 2020
The Buildbot has detected a new failure on builder PPC64LE Fedora Stable Refleaks 3.x while building Python.
Full details are available at:
https://buildbot.python.org/all/#builders/280/builds/85
Buildbot URL: https://buildbot.python.org/all/
Worker for this Build: cstratak-fedora-stable-ppc64le
Build Reason: <unknown>
Blamelist:
BUILD FAILED: failed test (failure)
Summary of the results of the build (if available):
===================================================
== Tests result: FAILURE then FAILURE ==
408 tests OK.
10 slowest tests:
- test_signal: 31 min 5 sec
- test_pydoc: 29 min 48 sec
- test_asyncio: 20 min 11 sec
- test_concurrent_futures: 19 min 11 sec
- test_peg_generator: 15 min 4 sec
- test_multiprocessing_spawn: 12 min 26 sec
- test_gdb: 9 min 32 sec
- test_multiprocessing_forkserver: 8 min 42 sec
- test_pickle: 6 min 27 sec
- test_io: 6 min 9 sec
3 tests failed:
test_logging test_multiprocessing_fork test_socketserver
13 tests skipped:
test_devpoll test_ioctl test_kqueue test_msilib test_ossaudiodev
test_startfile test_tix test_tk test_ttk_guionly test_winconsoleio
test_winreg test_winsound test_zipfile64
3 re-run tests:
test_logging test_multiprocessing_fork test_socketserver
Total duration: 3 hour 17 min
Captured traceback
==================
Traceback (most recent call last):
File "/home/buildbot/buildarea/3.x.cstratak-fedora-stable-ppc64le.refleak/build/Lib/multiprocessing/util.py", line 300, in _run_finalizers
finalizer()
File "/home/buildbot/buildarea/3.x.cstratak-fedora-stable-ppc64le.refleak/build/Lib/multiprocessing/util.py", line 224, in __call__
res = self._callback(*self._args, **self._kwargs)
File "/home/buildbot/buildarea/3.x.cstratak-fedora-stable-ppc64le.refleak/build/Lib/multiprocessing/synchronize.py", line 87, in _cleanup
sem_unlink(name)
FileNotFoundError: [Errno 2] No such file or directory
Traceback (most recent call last):
File "/home/buildbot/buildarea/3.x.cstratak-fedora-stable-ppc64le.refleak/build/Lib/multiprocessing/util.py", line 300, in _run_finalizers
finalizer()
File "/home/buildbot/buildarea/3.x.cstratak-fedora-stable-ppc64le.refleak/build/Lib/multiprocessing/util.py", line 224, in __call__
res = self._callback(*self._args, **self._kwargs)
File "/home/buildbot/buildarea/3.x.cstratak-fedora-stable-ppc64le.refleak/build/Lib/multiprocessing/synchronize.py", line 87, in _cleanup
sem_unlink(name)
FileNotFoundError: [Errno 2] No such file or directory
Traceback (most recent call last):
File "/home/buildbot/buildarea/3.x.cstratak-fedora-stable-ppc64le.refleak/build/Lib/multiprocessing/util.py", line 300, in _run_finalizers
finalizer()
File "/home/buildbot/buildarea/3.x.cstratak-fedora-stable-ppc64le.refleak/build/Lib/multiprocessing/util.py", line 224, in __call__
res = self._callback(*self._args, **self._kwargs)
File "/home/buildbot/buildarea/3.x.cstratak-fedora-stable-ppc64le.refleak/build/Lib/multiprocessing/synchronize.py", line 87, in _cleanup
sem_unlink(name)
FileNotFoundError: [Errno 2] No such file or directory
Traceback (most recent call last):
File "/home/buildbot/buildarea/3.x.cstratak-fedora-stable-ppc64le.refleak/build/Lib/multiprocessing/util.py", line 300, in _run_finalizers
finalizer()
File "/home/buildbot/buildarea/3.x.cstratak-fedora-stable-ppc64le.refleak/build/Lib/multiprocessing/util.py", line 224, in __call__
res = self._callback(*self._args, **self._kwargs)
File "/home/buildbot/buildarea/3.x.cstratak-fedora-stable-ppc64le.refleak/build/Lib/multiprocessing/synchronize.py", line 87, in _cleanup
sem_unlink(name)
FileNotFoundError: [Errno 2] No such file or directory
Traceback (most recent call last):
File "/home/buildbot/buildarea/3.x.cstratak-fedora-stable-ppc64le.refleak/build/Lib/multiprocessing/util.py", line 300, in _run_finalizers
finalizer()
File "/home/buildbot/buildarea/3.x.cstratak-fedora-stable-ppc64le.refleak/build/Lib/multiprocessing/util.py", line 224, in __call__
res = self._callback(*self._args, **self._kwargs)
File "/home/buildbot/buildarea/3.x.cstratak-fedora-stable-ppc64le.refleak/build/Lib/multiprocessing/synchronize.py", line 87, in _cleanup
sem_unlink(name)
FileNotFoundError: [Errno 2] No such file or directory
Traceback (most recent call last):
File "/home/buildbot/buildarea/3.x.cstratak-fedora-stable-ppc64le.refleak/build/Lib/multiprocessing/util.py", line 300, in _run_finalizers
finalizer()
File "/home/buildbot/buildarea/3.x.cstratak-fedora-stable-ppc64le.refleak/build/Lib/multiprocessing/util.py", line 224, in __call__
res = self._callback(*self._args, **self._kwargs)
File "/home/buildbot/buildarea/3.x.cstratak-fedora-stable-ppc64le.refleak/build/Lib/multiprocessing/synchronize.py", line 87, in _cleanup
sem_unlink(name)
FileNotFoundError: [Errno 2] No such file or directory
./home/buildbot/buildarea/3.x.cstratak-fedora-stable-ppc64le.refleak/build/Lib/multiprocessing/resource_tracker.py:216: UserWarning: resource_tracker: There appear to be 6 leaked semaphore objects to clean up at shutdown
warnings.warn('resource_tracker: There appear to be %d '
Traceback (most recent call last):
File "/home/buildbot/buildarea/3.x.cstratak-fedora-stable-ppc64le.refleak/build/Lib/multiprocessing/util.py", line 300, in _run_finalizers
finalizer()
File "/home/buildbot/buildarea/3.x.cstratak-fedora-stable-ppc64le.refleak/build/Lib/multiprocessing/util.py", line 224, in __call__
res = self._callback(*self._args, **self._kwargs)
File "/home/buildbot/buildarea/3.x.cstratak-fedora-stable-ppc64le.refleak/build/Lib/multiprocessing/synchronize.py", line 87, in _cleanup
sem_unlink(name)
FileNotFoundError: [Errno 2] No such file or directory
Traceback (most recent call last):
File "/home/buildbot/buildarea/3.x.cstratak-fedora-stable-ppc64le.refleak/build/Lib/multiprocessing/util.py", line 300, in _run_finalizers
finalizer()
File "/home/buildbot/buildarea/3.x.cstratak-fedora-stable-ppc64le.refleak/build/Lib/multiprocessing/util.py", line 224, in __call__
res = self._callback(*self._args, **self._kwargs)
File "/home/buildbot/buildarea/3.x.cstratak-fedora-stable-ppc64le.refleak/build/Lib/multiprocessing/synchronize.py", line 87, in _cleanup
sem_unlink(name)
FileNotFoundError: [Errno 2] No such file or directory
Traceback (most recent call last):
File "/home/buildbot/buildarea/3.x.cstratak-fedora-stable-ppc64le.refleak/build/Lib/multiprocessing/util.py", line 300, in _run_finalizers
finalizer()
File "/home/buildbot/buildarea/3.x.cstratak-fedora-stable-ppc64le.refleak/build/Lib/multiprocessing/util.py", line 224, in __call__
res = self._callback(*self._args, **self._kwargs)
File "/home/buildbot/buildarea/3.x.cstratak-fedora-stable-ppc64le.refleak/build/Lib/multiprocessing/synchronize.py", line 87, in _cleanup
sem_unlink(name)
FileNotFoundError: [Errno 2] No such file or directory
Traceback (most recent call last):
File "/home/buildbot/buildarea/3.x.cstratak-fedora-stable-ppc64le.refleak/build/Lib/multiprocessing/util.py", line 300, in _run_finalizers
finalizer()
File "/home/buildbot/buildarea/3.x.cstratak-fedora-stable-ppc64le.refleak/build/Lib/multiprocessing/util.py", line 224, in __call__
res = self._callback(*self._args, **self._kwargs)
File "/home/buildbot/buildarea/3.x.cstratak-fedora-stable-ppc64le.refleak/build/Lib/multiprocessing/synchronize.py", line 87, in _cleanup
sem_unlink(name)
FileNotFoundError: [Errno 2] No such file or directory
Traceback (most recent call last):
File "/home/buildbot/buildarea/3.x.cstratak-fedora-stable-ppc64le.refleak/build/Lib/multiprocessing/util.py", line 300, in _run_finalizers
finalizer()
File "/home/buildbot/buildarea/3.x.cstratak-fedora-stable-ppc64le.refleak/build/Lib/multiprocessing/util.py", line 224, in __call__
res = self._callback(*self._args, **self._kwargs)
File "/home/buildbot/buildarea/3.x.cstratak-fedora-stable-ppc64le.refleak/build/Lib/multiprocessing/synchronize.py", line 87, in _cleanup
sem_unlink(name)
FileNotFoundError: [Errno 2] No such file or directory
Traceback (most recent call last):
File "/home/buildbot/buildarea/3.x.cstratak-fedora-stable-ppc64le.refleak/build/Lib/multiprocessing/util.py", line 300, in _run_finalizers
finalizer()
File "/home/buildbot/buildarea/3.x.cstratak-fedora-stable-ppc64le.refleak/build/Lib/multiprocessing/util.py", line 224, in __call__
res = self._callback(*self._args, **self._kwargs)
File "/home/buildbot/buildarea/3.x.cstratak-fedora-stable-ppc64le.refleak/build/Lib/multiprocessing/synchronize.py", line 87, in _cleanup
sem_unlink(name)
FileNotFoundError: [Errno 2] No such file or directory
./home/buildbot/buildarea/3.x.cstratak-fedora-stable-ppc64le.refleak/build/Lib/multiprocessing/resource_tracker.py:216: UserWarning: resource_tracker: There appear to be 6 leaked semaphore objects to clean up at shutdown
warnings.warn('resource_tracker: There appear to be %d '
Traceback (most recent call last):
File "/home/buildbot/buildarea/3.x.cstratak-fedora-stable-ppc64le.refleak/build/Lib/multiprocessing/util.py", line 300, in _run_finalizers
finalizer()
File "/home/buildbot/buildarea/3.x.cstratak-fedora-stable-ppc64le.refleak/build/Lib/multiprocessing/util.py", line 224, in __call__
res = self._callback(*self._args, **self._kwargs)
File "/home/buildbot/buildarea/3.x.cstratak-fedora-stable-ppc64le.refleak/build/Lib/multiprocessing/synchronize.py", line 87, in _cleanup
sem_unlink(name)
FileNotFoundError: [Errno 2] No such file or directory
Traceback (most recent call last):
File "/home/buildbot/buildarea/3.x.cstratak-fedora-stable-ppc64le.refleak/build/Lib/multiprocessing/util.py", line 300, in _run_finalizers
finalizer()
File "/home/buildbot/buildarea/3.x.cstratak-fedora-stable-ppc64le.refleak/build/Lib/multiprocessing/util.py", line 224, in __call__
res = self._callback(*self._args, **self._kwargs)
File "/home/buildbot/buildarea/3.x.cstratak-fedora-stable-ppc64le.refleak/build/Lib/multiprocessing/synchronize.py", line 87, in _cleanup
sem_unlink(name)
FileNotFoundError: [Errno 2] No such file or directory
Traceback (most recent call last):
File "/home/buildbot/buildarea/3.x.cstratak-fedora-stable-ppc64le.refleak/build/Lib/multiprocessing/util.py", line 300, in _run_finalizers
finalizer()
File "/home/buildbot/buildarea/3.x.cstratak-fedora-stable-ppc64le.refleak/build/Lib/multiprocessing/util.py", line 224, in __call__
res = self._callback(*self._args, **self._kwargs)
File "/home/buildbot/buildarea/3.x.cstratak-fedora-stable-ppc64le.refleak/build/Lib/multiprocessing/synchronize.py", line 87, in _cleanup
sem_unlink(name)
FileNotFoundError: [Errno 2] No such file or directory
Traceback (most recent call last):
File "/home/buildbot/buildarea/3.x.cstratak-fedora-stable-ppc64le.refleak/build/Lib/multiprocessing/util.py", line 300, in _run_finalizers
finalizer()
File "/home/buildbot/buildarea/3.x.cstratak-fedora-stable-ppc64le.refleak/build/Lib/multiprocessing/util.py", line 224, in __call__
res = self._callback(*self._args, **self._kwargs)
File "/home/buildbot/buildarea/3.x.cstratak-fedora-stable-ppc64le.refleak/build/Lib/multiprocessing/synchronize.py", line 87, in _cleanup
sem_unlink(name)
FileNotFoundError: [Errno 2] No such file or directory
Traceback (most recent call last):
File "/home/buildbot/buildarea/3.x.cstratak-fedora-stable-ppc64le.refleak/build/Lib/multiprocessing/util.py", line 300, in _run_finalizers
finalizer()
File "/home/buildbot/buildarea/3.x.cstratak-fedora-stable-ppc64le.refleak/build/Lib/multiprocessing/util.py", line 224, in __call__
res = self._callback(*self._args, **self._kwargs)
File "/home/buildbot/buildarea/3.x.cstratak-fedora-stable-ppc64le.refleak/build/Lib/multiprocessing/synchronize.py", line 87, in _cleanup
sem_unlink(name)
FileNotFoundError: [Errno 2] No such file or directory
Traceback (most recent call last):
File "/home/buildbot/buildarea/3.x.cstratak-fedora-stable-ppc64le.refleak/build/Lib/multiprocessing/util.py", line 300, in _run_finalizers
finalizer()
File "/home/buildbot/buildarea/3.x.cstratak-fedora-stable-ppc64le.refleak/build/Lib/multiprocessing/util.py", line 224, in __call__
res = self._callback(*self._args, **self._kwargs)
File "/home/buildbot/buildarea/3.x.cstratak-fedora-stable-ppc64le.refleak/build/Lib/multiprocessing/synchronize.py", line 87, in _cleanup
sem_unlink(name)
FileNotFoundError: [Errno 2] No such file or directory
./home/buildbot/buildarea/3.x.cstratak-fedora-stable-ppc64le.refleak/build/Lib/multiprocessing/resource_tracker.py:216: UserWarning: resource_tracker: There appear to be 6 leaked semaphore objects to clean up at shutdown
warnings.warn('resource_tracker: There appear to be %d '
Traceback (most recent call last):
File "/home/buildbot/buildarea/3.x.cstratak-fedora-stable-ppc64le.refleak/build/Lib/multiprocessing/util.py", line 300, in _run_finalizers
finalizer()
File "/home/buildbot/buildarea/3.x.cstratak-fedora-stable-ppc64le.refleak/build/Lib/multiprocessing/util.py", line 224, in __call__
res = self._callback(*self._args, **self._kwargs)
File "/home/buildbot/buildarea/3.x.cstratak-fedora-stable-ppc64le.refleak/build/Lib/multiprocessing/synchronize.py", line 87, in _cleanup
sem_unlink(name)
FileNotFoundError: [Errno 2] No such file or directory
Traceback (most recent call last):
File "/home/buildbot/buildarea/3.x.cstratak-fedora-stable-ppc64le.refleak/build/Lib/multiprocessing/util.py", line 300, in _run_finalizers
finalizer()
File "/home/buildbot/buildarea/3.x.cstratak-fedora-stable-ppc64le.refleak/build/Lib/multiprocessing/util.py", line 224, in __call__
res = self._callback(*self._args, **self._kwargs)
File "/home/buildbot/buildarea/3.x.cstratak-fedora-stable-ppc64le.refleak/build/Lib/multiprocessing/synchronize.py", line 87, in _cleanup
sem_unlink(name)
FileNotFoundError: [Errno 2] No such file or directory
Traceback (most recent call last):
File "/home/buildbot/buildarea/3.x.cstratak-fedora-stable-ppc64le.refleak/build/Lib/multiprocessing/util.py", line 300, in _run_finalizers
finalizer()
File "/home/buildbot/buildarea/3.x.cstratak-fedora-stable-ppc64le.refleak/build/Lib/multiprocessing/util.py", line 224, in __call__
res = self._callback(*self._args, **self._kwargs)
File "/home/buildbot/buildarea/3.x.cstratak-fedora-stable-ppc64le.refleak/build/Lib/multiprocessing/synchronize.py", line 87, in _cleanup
sem_unlink(name)
FileNotFoundError: [Errno 2] No such file or directory
Traceback (most recent call last):
File "/home/buildbot/buildarea/3.x.cstratak-fedora-stable-ppc64le.refleak/build/Lib/multiprocessing/util.py", line 300, in _run_finalizers
finalizer()
File "/home/buildbot/buildarea/3.x.cstratak-fedora-stable-ppc64le.refleak/build/Lib/multiprocessing/util.py", line 224, in __call__
res = self._callback(*self._args, **self._kwargs)
File "/home/buildbot/buildarea/3.x.cstratak-fedora-stable-ppc64le.refleak/build/Lib/multiprocessing/synchronize.py", line 87, in _cleanup
sem_unlink(name)
FileNotFoundError: [Errno 2] No such file or directory
Traceback (most recent call last):
File "/home/buildbot/buildarea/3.x.cstratak-fedora-stable-ppc64le.refleak/build/Lib/multiprocessing/util.py", line 300, in _run_finalizers
finalizer()
File "/home/buildbot/buildarea/3.x.cstratak-fedora-stable-ppc64le.refleak/build/Lib/multiprocessing/util.py", line 224, in __call__
res = self._callback(*self._args, **self._kwargs)
File "/home/buildbot/buildarea/3.x.cstratak-fedora-stable-ppc64le.refleak/build/Lib/multiprocessing/synchronize.py", line 87, in _cleanup
sem_unlink(name)
FileNotFoundError: [Errno 2] No such file or directory
Traceback (most recent call last):
File "/home/buildbot/buildarea/3.x.cstratak-fedora-stable-ppc64le.refleak/build/Lib/multiprocessing/util.py", line 300, in _run_finalizers
finalizer()
File "/home/buildbot/buildarea/3.x.cstratak-fedora-stable-ppc64le.refleak/build/Lib/multiprocessing/util.py", line 224, in __call__
res = self._callback(*self._args, **self._kwargs)
File "/home/buildbot/buildarea/3.x.cstratak-fedora-stable-ppc64le.refleak/build/Lib/multiprocessing/synchronize.py", line 87, in _cleanup
sem_unlink(name)
FileNotFoundError: [Errno 2] No such file or directory
./home/buildbot/buildarea/3.x.cstratak-fedora-stable-ppc64le.refleak/build/Lib/multiprocessing/resource_tracker.py:216: UserWarning: resource_tracker: There appear to be 6 leaked semaphore objects to clean up at shutdown
warnings.warn('resource_tracker: There appear to be %d '
Traceback (most recent call last):
File "/home/buildbot/buildarea/3.x.cstratak-fedora-stable-ppc64le.refleak/build/Lib/multiprocessing/util.py", line 300, in _run_finalizers
finalizer()
File "/home/buildbot/buildarea/3.x.cstratak-fedora-stable-ppc64le.refleak/build/Lib/multiprocessing/util.py", line 224, in __call__
res = self._callback(*self._args, **self._kwargs)
File "/home/buildbot/buildarea/3.x.cstratak-fedora-stable-ppc64le.refleak/build/Lib/multiprocessing/synchronize.py", line 87, in _cleanup
sem_unlink(name)
FileNotFoundError: [Errno 2] No such file or directory
Traceback (most recent call last):
File "/home/buildbot/buildarea/3.x.cstratak-fedora-stable-ppc64le.refleak/build/Lib/multiprocessing/util.py", line 300, in _run_finalizers
finalizer()
File "/home/buildbot/buildarea/3.x.cstratak-fedora-stable-ppc64le.refleak/build/Lib/multiprocessing/util.py", line 224, in __call__
res = self._callback(*self._args, **self._kwargs)
File "/home/buildbot/buildarea/3.x.cstratak-fedora-stable-ppc64le.refleak/build/Lib/multiprocessing/synchronize.py", line 87, in _cleanup
sem_unlink(name)
FileNotFoundError: [Errno 2] No such file or directory
Traceback (most recent call last):
File "/home/buildbot/buildarea/3.x.cstratak-fedora-stable-ppc64le.refleak/build/Lib/multiprocessing/util.py", line 300, in _run_finalizers
finalizer()
File "/home/buildbot/buildarea/3.x.cstratak-fedora-stable-ppc64le.refleak/build/Lib/multiprocessing/util.py", line 224, in __call__
res = self._callback(*self._args, **self._kwargs)
File "/home/buildbot/buildarea/3.x.cstratak-fedora-stable-ppc64le.refleak/build/Lib/multiprocessing/synchronize.py", line 87, in _cleanup
sem_unlink(name)
FileNotFoundError: [Errno 2] No such file or directory
Traceback (most recent call last):
File "/home/buildbot/buildarea/3.x.cstratak-fedora-stable-ppc64le.refleak/build/Lib/multiprocessing/util.py", line 300, in _run_finalizers
finalizer()
File "/home/buildbot/buildarea/3.x.cstratak-fedora-stable-ppc64le.refleak/build/Lib/multiprocessing/util.py", line 224, in __call__
res = self._callback(*self._args, **self._kwargs)
File "/home/buildbot/buildarea/3.x.cstratak-fedora-stable-ppc64le.refleak/build/Lib/multiprocessing/synchronize.py", line 87, in _cleanup
sem_unlink(name)
FileNotFoundError: [Errno 2] No such file or directory
Traceback (most recent call last):
File "/home/buildbot/buildarea/3.x.cstratak-fedora-stable-ppc64le.refleak/build/Lib/multiprocessing/util.py", line 300, in _run_finalizers
finalizer()
File "/home/buildbot/buildarea/3.x.cstratak-fedora-stable-ppc64le.refleak/build/Lib/multiprocessing/util.py", line 224, in __call__
res = self._callback(*self._args, **self._kwargs)
File "/home/buildbot/buildarea/3.x.cstratak-fedora-stable-ppc64le.refleak/build/Lib/multiprocessing/synchronize.py", line 87, in _cleanup
sem_unlink(name)
FileNotFoundError: [Errno 2] No such file or directory
Traceback (most recent call last):
File "/home/buildbot/buildarea/3.x.cstratak-fedora-stable-ppc64le.refleak/build/Lib/multiprocessing/util.py", line 300, in _run_finalizers
finalizer()
File "/home/buildbot/buildarea/3.x.cstratak-fedora-stable-ppc64le.refleak/build/Lib/multiprocessing/util.py", line 224, in __call__
res = self._callback(*self._args, **self._kwargs)
File "/home/buildbot/buildarea/3.x.cstratak-fedora-stable-ppc64le.refleak/build/Lib/multiprocessing/synchronize.py", line 87, in _cleanup
sem_unlink(name)
FileNotFoundError: [Errno 2] No such file or directory
./home/buildbot/buildarea/3.x.cstratak-fedora-stable-ppc64le.refleak/build/Lib/multiprocessing/resource_tracker.py:216: UserWarning: resource_tracker: There appear to be 6 leaked semaphore objects to clean up at shutdown
warnings.warn('resource_tracker: There appear to be %d '
Traceback (most recent call last):
File "/home/buildbot/buildarea/3.x.cstratak-fedora-stable-ppc64le.refleak/build/Lib/multiprocessing/util.py", line 300, in _run_finalizers
finalizer()
File "/home/buildbot/buildarea/3.x.cstratak-fedora-stable-ppc64le.refleak/build/Lib/multiprocessing/util.py", line 224, in __call__
res = self._callback(*self._args, **self._kwargs)
File "/home/buildbot/buildarea/3.x.cstratak-fedora-stable-ppc64le.refleak/build/Lib/multiprocessing/synchronize.py", line 87, in _cleanup
sem_unlink(name)
FileNotFoundError: [Errno 2] No such file or directory
Traceback (most recent call last):
File "/home/buildbot/buildarea/3.x.cstratak-fedora-stable-ppc64le.refleak/build/Lib/multiprocessing/util.py", line 300, in _run_finalizers
finalizer()
File "/home/buildbot/buildarea/3.x.cstratak-fedora-stable-ppc64le.refleak/build/Lib/multiprocessing/util.py", line 224, in __call__
res = self._callback(*self._args, **self._kwargs)
File "/home/buildbot/buildarea/3.x.cstratak-fedora-stable-ppc64le.refleak/build/Lib/multiprocessing/synchronize.py", line 87, in _cleanup
sem_unlink(name)
FileNotFoundError: [Errno 2] No such file or directory
Traceback (most recent call last):
File "/home/buildbot/buildarea/3.x.cstratak-fedora-stable-ppc64le.refleak/build/Lib/multiprocessing/util.py", line 300, in _run_finalizers
finalizer()
File "/home/buildbot/buildarea/3.x.cstratak-fedora-stable-ppc64le.refleak/build/Lib/multiprocessing/util.py", line 224, in __call__
res = self._callback(*self._args, **self._kwargs)
File "/home/buildbot/buildarea/3.x.cstratak-fedora-stable-ppc64le.refleak/build/Lib/multiprocessing/synchronize.py", line 87, in _cleanup
sem_unlink(name)
FileNotFoundError: [Errno 2] No such file or directory
Traceback (most recent call last):
File "/home/buildbot/buildarea/3.x.cstratak-fedora-stable-ppc64le.refleak/build/Lib/multiprocessing/util.py", line 300, in _run_finalizers
finalizer()
File "/home/buildbot/buildarea/3.x.cstratak-fedora-stable-ppc64le.refleak/build/Lib/multiprocessing/util.py", line 224, in __call__
res = self._callback(*self._args, **self._kwargs)
File "/home/buildbot/buildarea/3.x.cstratak-fedora-stable-ppc64le.refleak/build/Lib/multiprocessing/synchronize.py", line 87, in _cleanup
sem_unlink(name)
FileNotFoundError: [Errno 2] No such file or directory
Traceback (most recent call last):
File "/home/buildbot/buildarea/3.x.cstratak-fedora-stable-ppc64le.refleak/build/Lib/multiprocessing/util.py", line 300, in _run_finalizers
finalizer()
File "/home/buildbot/buildarea/3.x.cstratak-fedora-stable-ppc64le.refleak/build/Lib/multiprocessing/util.py", line 224, in __call__
res = self._callback(*self._args, **self._kwargs)
File "/home/buildbot/buildarea/3.x.cstratak-fedora-stable-ppc64le.refleak/build/Lib/multiprocessing/synchronize.py", line 87, in _cleanup
sem_unlink(name)
FileNotFoundError: [Errno 2] No such file or directory
Traceback (most recent call last):
File "/home/buildbot/buildarea/3.x.cstratak-fedora-stable-ppc64le.refleak/build/Lib/multiprocessing/util.py", line 300, in _run_finalizers
finalizer()
File "/home/buildbot/buildarea/3.x.cstratak-fedora-stable-ppc64le.refleak/build/Lib/multiprocessing/util.py", line 224, in __call__
res = self._callback(*self._args, **self._kwargs)
File "/home/buildbot/buildarea/3.x.cstratak-fedora-stable-ppc64le.refleak/build/Lib/multiprocessing/synchronize.py", line 87, in _cleanup
sem_unlink(name)
FileNotFoundError: [Errno 2] No such file or directory
.
Traceback (most recent call last):
File "/home/buildbot/buildarea/3.x.cstratak-fedora-stable-ppc64le.refleak/build/Lib/test/libregrtest/runtest.py", line 272, in _runtest_inner
refleak = _runtest_inner2(ns, test_name)
File "/home/buildbot/buildarea/3.x.cstratak-fedora-stable-ppc64le.refleak/build/Lib/test/libregrtest/runtest.py", line 223, in _runtest_inner2
the_module = importlib.import_module(abstest)
File "/home/buildbot/buildarea/3.x.cstratak-fedora-stable-ppc64le.refleak/build/Lib/importlib/__init__.py", line 126, in import_module
return _bootstrap._gcd_import(name[level:], package, level)
File "<frozen importlib._bootstrap>", line 1030, in _gcd_import
File "<frozen importlib._bootstrap>", line 1007, in _find_and_load
File "<frozen importlib._bootstrap>", line 986, in _find_and_load_unlocked
File "<frozen importlib._bootstrap>", line 680, in _load_unlocked
File "<frozen importlib._bootstrap_external>", line 791, in exec_module
File "<frozen importlib._bootstrap>", line 228, in _call_with_frames_removed
File "/home/buildbot/buildarea/3.x.cstratak-fedora-stable-ppc64le.refleak/build/Lib/test/test_multiprocessing_fork.py", line 2, in <module>
import test._test_multiprocessing
File "/home/buildbot/buildarea/3.x.cstratak-fedora-stable-ppc64le.refleak/build/Lib/test/_test_multiprocessing.py", line 5630, in <module>
class ProcessesMixin(BaseMixin):
File "/home/buildbot/buildarea/3.x.cstratak-fedora-stable-ppc64le.refleak/build/Lib/test/_test_multiprocessing.py", line 5633, in ProcessesMixin
connection = multiprocessing.connection
AttributeError: module 'multiprocessing' has no attribute 'connection'
Test report
===========
Failed tests:
- test_socketserver
- test_logging
- test_multiprocessing_fork
Test leaking resources:
- test_logging: references
- test_socketserver: references
- test_logging: memory blocks
- test_socketserver: memory blocks
Sincerely,
-The Buildbot
1
0
Nov. 2, 2020
The Buildbot has detected a new failure on builder AMD64 Windows8.1 Refleaks 3.x while building Python.
Full details are available at:
https://buildbot.python.org/all/#builders/511/builds/83
Buildbot URL: https://buildbot.python.org/all/
Worker for this Build: ware-win81-release
Build Reason: <unknown>
Blamelist:
BUILD FAILED: failed test (failure)
Summary of the results of the build (if available):
===================================================
== Tests result: FAILURE then FAILURE ==
392 tests OK.
10 slowest tests:
- test_venv: 49 min 55 sec
- test_pydoc: 35 min
- test_peg_generator: 30 min 35 sec
- test_compileall: 30 min 6 sec
- test_zipfile: 27 min 59 sec
- test_multiprocessing_spawn: 27 min 42 sec
- test_asyncio: 27 min
- test_mmap: 19 min 25 sec
- test_concurrent_futures: 17 min 53 sec
- test_largefile: 17 min 35 sec
2 tests failed:
test_logging test_socketserver
30 tests skipped:
test_curses test_dbm_gnu test_dbm_ndbm test_devpoll test_epoll
test_fcntl test_fork1 test_gdb test_grp test_ioctl test_kqueue
test_multiprocessing_fork test_multiprocessing_forkserver test_nis
test_openpty test_ossaudiodev test_pipes test_poll test_posix
test_pty test_pwd test_readline test_resource test_spwd
test_syslog test_threadsignals test_wait3 test_wait4
test_xxtestfuzz test_zipfile64
2 re-run tests:
test_logging test_socketserver
Total duration: 2 hour 36 min
Captured traceback
==================
Traceback (most recent call last):
File "D:\buildarea\3.x.ware-win81-release.refleak\build\lib\logging\handlers.py", line 74, in emit
self.doRollover()
File "D:\buildarea\3.x.ware-win81-release.refleak\build\lib\logging\handlers.py", line 177, in doRollover
self.rotate(self.baseFilename, dfn)
File "D:\buildarea\3.x.ware-win81-release.refleak\build\lib\logging\handlers.py", line 117, in rotate
self.rotator(source, dest)
File "D:\buildarea\3.x.ware-win81-release.refleak\build\lib\test\test_logging.py", line 5176, in rotator
os.rename(source, dest + ".rotated")
FileExistsError: [WinError 183] Cannot create a file when that file already exists: 'D:\\temp\\test_logging-2-sw3is_2_.log' -> 'D:\\temp\\test_logging-2-sw3is_2_.log.1.test.rotated'
Call stack:
File "D:\buildarea\3.x.ware-win81-release.refleak\build\lib\runpy.py", line 197, in _run_module_as_main
return _run_code(code, main_globals, None,
File "D:\buildarea\3.x.ware-win81-release.refleak\build\lib\runpy.py", line 87, in _run_code
exec(code, run_globals)
File "D:\buildarea\3.x.ware-win81-release.refleak\build\lib\test\__main__.py", line 2, in <module>
main()
File "D:\buildarea\3.x.ware-win81-release.refleak\build\lib\test\libregrtest\main.py", line 717, in main
Regrtest().main(tests=tests, **kwargs)
File "D:\buildarea\3.x.ware-win81-release.refleak\build\lib\test\libregrtest\main.py", line 639, in main
self._main(tests, kwargs)
File "D:\buildarea\3.x.ware-win81-release.refleak\build\lib\test\libregrtest\main.py", line 696, in _main
self.rerun_failed_tests()
File "D:\buildarea\3.x.ware-win81-release.refleak\build\lib\test\libregrtest\main.py", line 319, in rerun_failed_tests
result = runtest(self.ns, test_name)
File "D:\buildarea\3.x.ware-win81-release.refleak\build\lib\test\libregrtest\runtest.py", line 195, in runtest
return _runtest(ns, test_name)
File "D:\buildarea\3.x.ware-win81-release.refleak\build\lib\test\libregrtest\runtest.py", line 155, in _runtest
result = _runtest_inner(ns, test_name,
File "D:\buildarea\3.x.ware-win81-release.refleak\build\lib\test\libregrtest\runtest.py", line 272, in _runtest_inner
refleak = _runtest_inner2(ns, test_name)
File "D:\buildarea\3.x.ware-win81-release.refleak\build\lib\test\libregrtest\runtest.py", line 234, in _runtest_inner2
refleak = dash_R(ns, test_name, test_runner)
File "D:\buildarea\3.x.ware-win81-release.refleak\build\lib\test\libregrtest\refleak.py", line 89, in dash_R
test_func()
File "D:\buildarea\3.x.ware-win81-release.refleak\build\lib\test\support\__init__.py", line 682, in inner
return func(*args, **kwds)
File "D:\buildarea\3.x.ware-win81-release.refleak\build\lib\test\test_logging.py", line 5457, in test_main
support.run_unittest(*tests)
File "D:\buildarea\3.x.ware-win81-release.refleak\build\lib\test\support\__init__.py", line 1082, in run_unittest
_run_suite(suite)
File "D:\buildarea\3.x.ware-win81-release.refleak\build\lib\test\support\__init__.py", line 959, in _run_suite
result = runner.run(suite)
File "D:\buildarea\3.x.ware-win81-release.refleak\build\lib\unittest\runner.py", line 176, in run
test(result)
File "D:\buildarea\3.x.ware-win81-release.refleak\build\lib\unittest\suite.py", line 84, in __call__
return self.run(*args, **kwds)
File "D:\buildarea\3.x.ware-win81-release.refleak\build\lib\unittest\suite.py", line 122, in run
test(result)
File "D:\buildarea\3.x.ware-win81-release.refleak\build\lib\unittest\suite.py", line 84, in __call__
return self.run(*args, **kwds)
File "D:\buildarea\3.x.ware-win81-release.refleak\build\lib\unittest\suite.py", line 122, in run
test(result)
File "D:\buildarea\3.x.ware-win81-release.refleak\build\lib\unittest\case.py", line 652, in __call__
return self.run(*args, **kwds)
File "D:\buildarea\3.x.ware-win81-release.refleak\build\lib\unittest\case.py", line 592, in run
self._callTestMethod(testMethod)
File "D:\buildarea\3.x.ware-win81-release.refleak\build\lib\unittest\case.py", line 549, in _callTestMethod
method()
Traceback (most recent call last):
File "D:\buildarea\3.x.ware-win81-release.refleak\build\lib\logging\handlers.py", line 74, in emit
self.doRollover()
File "D:\buildarea\3.x.ware-win81-release.refleak\build\lib\logging\handlers.py", line 177, in doRollover
self.rotate(self.baseFilename, dfn)
File "D:\buildarea\3.x.ware-win81-release.refleak\build\lib\logging\handlers.py", line 117, in rotate
self.rotator(source, dest)
File "D:\buildarea\3.x.ware-win81-release.refleak\build\lib\test\test_logging.py", line 5176, in rotator
os.rename(source, dest + ".rotated")
FileExistsError: [WinError 183] Cannot create a file when that file already exists: 'D:\\temp\\test_logging-2-0n1t_xo9.log' -> 'D:\\temp\\test_logging-2-0n1t_xo9.log.1.test.rotated'
Call stack:
Traceback (most recent call last):
File "D:\buildarea\3.x.ware-win81-release.refleak\build\lib\logging\handlers.py", line 74, in emit
self.doRollover()
File "D:\buildarea\3.x.ware-win81-release.refleak\build\lib\logging\handlers.py", line 177, in doRollover
self.rotate(self.baseFilename, dfn)
File "D:\buildarea\3.x.ware-win81-release.refleak\build\lib\logging\handlers.py", line 117, in rotate
self.rotator(source, dest)
File "D:\buildarea\3.x.ware-win81-release.refleak\build\lib\test\test_logging.py", line 5176, in rotator
os.rename(source, dest + ".rotated")
FileExistsError: [WinError 183] Cannot create a file when that file already exists: 'D:\\temp\\test_logging-2-vuafv4km.log' -> 'D:\\temp\\test_logging-2-vuafv4km.log.1.test.rotated'
Call stack:
File "D:\buildarea\3.x.ware-win81-release.refleak\build\lib\runpy.py", line 197, in _run_module_as_main
return _run_code(code, main_globals, None,
File "D:\buildarea\3.x.ware-win81-release.refleak\build\lib\runpy.py", line 87, in _run_code
exec(code, run_globals)
File "D:\buildarea\3.x.ware-win81-release.refleak\build\lib\test\__main__.py", line 2, in <module>
main()
File "D:\buildarea\3.x.ware-win81-release.refleak\build\lib\test\libregrtest\main.py", line 717, in main
Regrtest().main(tests=tests, **kwargs)
File "D:\buildarea\3.x.ware-win81-release.refleak\build\lib\test\libregrtest\main.py", line 639, in main
self._main(tests, kwargs)
File "D:\buildarea\3.x.ware-win81-release.refleak\build\lib\test\libregrtest\main.py", line 696, in _main
self.rerun_failed_tests()
File "D:\buildarea\3.x.ware-win81-release.refleak\build\lib\test\libregrtest\main.py", line 319, in rerun_failed_tests
result = runtest(self.ns, test_name)
File "D:\buildarea\3.x.ware-win81-release.refleak\build\lib\test\libregrtest\runtest.py", line 195, in runtest
return _runtest(ns, test_name)
File "D:\buildarea\3.x.ware-win81-release.refleak\build\lib\test\libregrtest\runtest.py", line 155, in _runtest
result = _runtest_inner(ns, test_name,
File "D:\buildarea\3.x.ware-win81-release.refleak\build\lib\test\libregrtest\runtest.py", line 272, in _runtest_inner
refleak = _runtest_inner2(ns, test_name)
File "D:\buildarea\3.x.ware-win81-release.refleak\build\lib\test\libregrtest\runtest.py", line 234, in _runtest_inner2
refleak = dash_R(ns, test_name, test_runner)
File "D:\buildarea\3.x.ware-win81-release.refleak\build\lib\test\libregrtest\refleak.py", line 89, in dash_R
test_func()
File "D:\buildarea\3.x.ware-win81-release.refleak\build\lib\test\support\__init__.py", line 682, in inner
return func(*args, **kwds)
File "D:\buildarea\3.x.ware-win81-release.refleak\build\lib\test\test_logging.py", line 5457, in test_main
support.run_unittest(*tests)
File "D:\buildarea\3.x.ware-win81-release.refleak\build\lib\test\support\__init__.py", line 1082, in run_unittest
_run_suite(suite)
File "D:\buildarea\3.x.ware-win81-release.refleak\build\lib\test\support\__init__.py", line 959, in _run_suite
result = runner.run(suite)
File "D:\buildarea\3.x.ware-win81-release.refleak\build\lib\unittest\runner.py", line 176, in run
test(result)
File "D:\buildarea\3.x.ware-win81-release.refleak\build\lib\unittest\suite.py", line 84, in __call__
return self.run(*args, **kwds)
File "D:\buildarea\3.x.ware-win81-release.refleak\build\lib\unittest\suite.py", line 122, in run
test(result)
File "D:\buildarea\3.x.ware-win81-release.refleak\build\lib\unittest\suite.py", line 84, in __call__
return self.run(*args, **kwds)
File "D:\buildarea\3.x.ware-win81-release.refleak\build\lib\unittest\suite.py", line 122, in run
test(result)
File "D:\buildarea\3.x.ware-win81-release.refleak\build\lib\unittest\case.py", line 652, in __call__
return self.run(*args, **kwds)
File "D:\buildarea\3.x.ware-win81-release.refleak\build\lib\unittest\case.py", line 592, in run
self._callTestMethod(testMethod)
File "D:\buildarea\3.x.ware-win81-release.refleak\build\lib\unittest\case.py", line 549, in _callTestMethod
method()
File "D:\buildarea\3.x.ware-win81-release.refleak\build\lib\test\test_logging.py", line 5183, in test_namer_rotator_inheritance
rh.emit(self.next_rec())
Message: '2'
Arguments: None
Traceback (most recent call last):
File "D:\buildarea\3.x.ware-win81-release.refleak\build\lib\logging\handlers.py", line 74, in emit
self.doRollover()
File "D:\buildarea\3.x.ware-win81-release.refleak\build\lib\logging\handlers.py", line 177, in doRollover
self.rotate(self.baseFilename, dfn)
File "D:\buildarea\3.x.ware-win81-release.refleak\build\lib\logging\handlers.py", line 117, in rotate
self.rotator(source, dest)
File "D:\buildarea\3.x.ware-win81-release.refleak\build\lib\test\test_logging.py", line 5176, in rotator
os.rename(source, dest + ".rotated")
FileExistsError: [WinError 183] Cannot create a file when that file already exists: 'D:\\temp\\test_logging-2-blt28iw2.log' -> 'D:\\temp\\test_logging-2-blt28iw2.log.1.test.rotated'
Call stack:
File "D:\buildarea\3.x.ware-win81-release.refleak\build\lib\runpy.py", line 197, in _run_module_as_main
return _run_code(code, main_globals, None,
File "D:\buildarea\3.x.ware-win81-release.refleak\build\lib\runpy.py", line 87, in _run_code
exec(code, run_globals)
File "D:\buildarea\3.x.ware-win81-release.refleak\build\lib\test\__main__.py", line 2, in <module>
main()
File "D:\buildarea\3.x.ware-win81-release.refleak\build\lib\test\libregrtest\main.py", line 717, in main
Regrtest().main(tests=tests, **kwargs)
File "D:\buildarea\3.x.ware-win81-release.refleak\build\lib\test\libregrtest\main.py", line 639, in main
self._main(tests, kwargs)
File "D:\buildarea\3.x.ware-win81-release.refleak\build\lib\test\libregrtest\main.py", line 696, in _main
self.rerun_failed_tests()
File "D:\buildarea\3.x.ware-win81-release.refleak\build\lib\test\libregrtest\main.py", line 319, in rerun_failed_tests
result = runtest(self.ns, test_name)
File "D:\buildarea\3.x.ware-win81-release.refleak\build\lib\test\libregrtest\runtest.py", line 195, in runtest
return _runtest(ns, test_name)
File "D:\buildarea\3.x.ware-win81-release.refleak\build\lib\test\libregrtest\runtest.py", line 155, in _runtest
result = _runtest_inner(ns, test_name,
File "D:\buildarea\3.x.ware-win81-release.refleak\build\lib\test\libregrtest\runtest.py", line 272, in _runtest_inner
refleak = _runtest_inner2(ns, test_name)
File "D:\buildarea\3.x.ware-win81-release.refleak\build\lib\test\libregrtest\runtest.py", line 234, in _runtest_inner2
refleak = dash_R(ns, test_name, test_runner)
File "D:\buildarea\3.x.ware-win81-release.refleak\build\lib\test\libregrtest\refleak.py", line 89, in dash_R
test_func()
File "D:\buildarea\3.x.ware-win81-release.refleak\build\lib\test\support\__init__.py", line 682, in inner
return func(*args, **kwds)
File "D:\buildarea\3.x.ware-win81-release.refleak\build\lib\test\test_logging.py", line 5457, in test_main
support.run_unittest(*tests)
File "D:\buildarea\3.x.ware-win81-release.refleak\build\lib\test\support\__init__.py", line 1082, in run_unittest
_run_suite(suite)
File "D:\buildarea\3.x.ware-win81-release.refleak\build\lib\test\support\__init__.py", line 959, in _run_suite
result = runner.run(suite)
File "D:\buildarea\3.x.ware-win81-release.refleak\build\lib\unittest\runner.py", line 176, in run
test(result)
File "D:\buildarea\3.x.ware-win81-release.refleak\build\lib\unittest\suite.py", line 84, in __call__
return self.run(*args, **kwds)
File "D:\buildarea\3.x.ware-win81-release.refleak\build\lib\unittest\suite.py", line 122, in run
test(result)
File "D:\buildarea\3.x.ware-win81-release.refleak\build\lib\unittest\suite.py", line 84, in __call__
return self.run(*args, **kwds)
File "D:\buildarea\3.x.ware-win81-release.refleak\build\lib\unittest\suite.py", line 122, in run
test(result)
File "D:\buildarea\3.x.ware-win81-release.refleak\build\lib\unittest\case.py", line 652, in __call__
return self.run(*args, **kwds)
File "D:\buildarea\3.x.ware-win81-release.refleak\build\lib\unittest\case.py", line 592, in run
self._callTestMethod(testMethod)
File "D:\buildarea\3.x.ware-win81-release.refleak\build\lib\unittest\case.py", line 549, in _callTestMethod
method()
File "D:\buildarea\3.x.ware-win81-release.refleak\build\lib\test\test_logging.py", line 5183, in test_namer_rotator_inheritance
rh.emit(self.next_rec())
Message: '2'
Arguments: None
Traceback (most recent call last):
File "D:\buildarea\3.x.ware-win81-release.refleak\build\lib\logging\handlers.py", line 74, in emit
self.doRollover()
File "D:\buildarea\3.x.ware-win81-release.refleak\build\lib\logging\handlers.py", line 177, in doRollover
self.rotate(self.baseFilename, dfn)
File "D:\buildarea\3.x.ware-win81-release.refleak\build\lib\logging\handlers.py", line 117, in rotate
self.rotator(source, dest)
File "D:\buildarea\3.x.ware-win81-release.refleak\build\lib\test\test_logging.py", line 5176, in rotator
os.rename(source, dest + ".rotated")
FileExistsError: [WinError 183] Cannot create a file when that file already exists: 'D:\\temp\\test_logging-2-f5gfkviu.log' -> 'D:\\temp\\test_logging-2-f5gfkviu.log.1.test.rotated'
Call stack:
File "D:\buildarea\3.x.ware-win81-release.refleak\build\lib\runpy.py", line 197, in _run_module_as_main
return _run_code(code, main_globals, None,
File "D:\buildarea\3.x.ware-win81-release.refleak\build\lib\runpy.py", line 87, in _run_code
exec(code, run_globals)
File "D:\buildarea\3.x.ware-win81-release.refleak\build\lib\test\__main__.py", line 2, in <module>
main()
File "D:\buildarea\3.x.ware-win81-release.refleak\build\lib\test\libregrtest\main.py", line 717, in main
Regrtest().main(tests=tests, **kwargs)
File "D:\buildarea\3.x.ware-win81-release.refleak\build\lib\test\libregrtest\main.py", line 639, in main
self._main(tests, kwargs)
File "D:\buildarea\3.x.ware-win81-release.refleak\build\lib\test\libregrtest\main.py", line 696, in _main
self.rerun_failed_tests()
File "D:\buildarea\3.x.ware-win81-release.refleak\build\lib\test\libregrtest\main.py", line 319, in rerun_failed_tests
result = runtest(self.ns, test_name)
File "D:\buildarea\3.x.ware-win81-release.refleak\build\lib\test\libregrtest\runtest.py", line 195, in runtest
return _runtest(ns, test_name)
File "D:\buildarea\3.x.ware-win81-release.refleak\build\lib\test\libregrtest\runtest.py", line 155, in _runtest
result = _runtest_inner(ns, test_name,
File "D:\buildarea\3.x.ware-win81-release.refleak\build\lib\test\libregrtest\runtest.py", line 272, in _runtest_inner
refleak = _runtest_inner2(ns, test_name)
File "D:\buildarea\3.x.ware-win81-release.refleak\build\lib\test\libregrtest\runtest.py", line 234, in _runtest_inner2
refleak = dash_R(ns, test_name, test_runner)
File "D:\buildarea\3.x.ware-win81-release.refleak\build\lib\test\libregrtest\refleak.py", line 89, in dash_R
test_func()
File "D:\buildarea\3.x.ware-win81-release.refleak\build\lib\test\support\__init__.py", line 682, in inner
return func(*args, **kwds)
File "D:\buildarea\3.x.ware-win81-release.refleak\build\lib\test\test_logging.py", line 5457, in test_main
support.run_unittest(*tests)
File "D:\buildarea\3.x.ware-win81-release.refleak\build\lib\test\support\__init__.py", line 1082, in run_unittest
_run_suite(suite)
File "D:\buildarea\3.x.ware-win81-release.refleak\build\lib\test\support\__init__.py", line 959, in _run_suite
result = runner.run(suite)
File "D:\buildarea\3.x.ware-win81-release.refleak\build\lib\unittest\runner.py", line 176, in run
test(result)
File "D:\buildarea\3.x.ware-win81-release.refleak\build\lib\unittest\suite.py", line 84, in __call__
return self.run(*args, **kwds)
File "D:\buildarea\3.x.ware-win81-release.refleak\build\lib\unittest\suite.py", line 122, in run
test(result)
File "D:\buildarea\3.x.ware-win81-release.refleak\build\lib\unittest\suite.py", line 84, in __call__
return self.run(*args, **kwds)
File "D:\buildarea\3.x.ware-win81-release.refleak\build\lib\unittest\suite.py", line 122, in run
test(result)
File "D:\buildarea\3.x.ware-win81-release.refleak\build\lib\unittest\case.py", line 652, in __call__
return self.run(*args, **kwds)
File "D:\buildarea\3.x.ware-win81-release.refleak\build\lib\unittest\case.py", line 592, in run
self._callTestMethod(testMethod)
File "D:\buildarea\3.x.ware-win81-release.refleak\build\lib\unittest\case.py", line 549, in _callTestMethod
method()
File "D:\buildarea\3.x.ware-win81-release.refleak\build\lib\test\test_logging.py", line 5183, in test_namer_rotator_inheritance
rh.emit(self.next_rec())
Message: '2'
Arguments: None
Traceback (most recent call last):
File "D:\buildarea\3.x.ware-win81-release.refleak\build\lib\logging\handlers.py", line 74, in emit
self.doRollover()
File "D:\buildarea\3.x.ware-win81-release.refleak\build\lib\logging\handlers.py", line 177, in doRollover
self.rotate(self.baseFilename, dfn)
File "D:\buildarea\3.x.ware-win81-release.refleak\build\lib\logging\handlers.py", line 117, in rotate
self.rotator(source, dest)
File "D:\buildarea\3.x.ware-win81-release.refleak\build\lib\test\test_logging.py", line 5176, in rotator
os.rename(source, dest + ".rotated")
FileExistsError: [WinError 183] Cannot create a file when that file already exists: 'D:\\temp\\test_logging-2-97r0e5e0.log' -> 'D:\\temp\\test_logging-2-97r0e5e0.log.1.test.rotated'
Call stack:
File "D:\buildarea\3.x.ware-win81-release.refleak\build\lib\runpy.py", line 197, in _run_module_as_main
return _run_code(code, main_globals, None,
File "D:\buildarea\3.x.ware-win81-release.refleak\build\lib\runpy.py", line 87, in _run_code
exec(code, run_globals)
File "D:\buildarea\3.x.ware-win81-release.refleak\build\lib\test\__main__.py", line 2, in <module>
main()
File "D:\buildarea\3.x.ware-win81-release.refleak\build\lib\test\libregrtest\main.py", line 717, in main
Regrtest().main(tests=tests, **kwargs)
File "D:\buildarea\3.x.ware-win81-release.refleak\build\lib\test\libregrtest\main.py", line 639, in main
self._main(tests, kwargs)
File "D:\buildarea\3.x.ware-win81-release.refleak\build\lib\test\libregrtest\main.py", line 696, in _main
self.rerun_failed_tests()
File "D:\buildarea\3.x.ware-win81-release.refleak\build\lib\test\libregrtest\main.py", line 319, in rerun_failed_tests
result = runtest(self.ns, test_name)
File "D:\buildarea\3.x.ware-win81-release.refleak\build\lib\test\libregrtest\runtest.py", line 195, in runtest
return _runtest(ns, test_name)
File "D:\buildarea\3.x.ware-win81-release.refleak\build\lib\test\libregrtest\runtest.py", line 155, in _runtest
result = _runtest_inner(ns, test_name,
File "D:\buildarea\3.x.ware-win81-release.refleak\build\lib\test\libregrtest\runtest.py", line 272, in _runtest_inner
refleak = _runtest_inner2(ns, test_name)
File "D:\buildarea\3.x.ware-win81-release.refleak\build\lib\test\libregrtest\runtest.py", line 234, in _runtest_inner2
refleak = dash_R(ns, test_name, test_runner)
File "D:\buildarea\3.x.ware-win81-release.refleak\build\lib\test\libregrtest\refleak.py", line 89, in dash_R
test_func()
File "D:\buildarea\3.x.ware-win81-release.refleak\build\lib\test\support\__init__.py", line 682, in inner
return func(*args, **kwds)
File "D:\buildarea\3.x.ware-win81-release.refleak\build\lib\test\test_logging.py", line 5457, in test_main
support.run_unittest(*tests)
File "D:\buildarea\3.x.ware-win81-release.refleak\build\lib\test\support\__init__.py", line 1082, in run_unittest
_run_suite(suite)
File "D:\buildarea\3.x.ware-win81-release.refleak\build\lib\test\support\__init__.py", line 959, in _run_suite
result = runner.run(suite)
File "D:\buildarea\3.x.ware-win81-release.refleak\build\lib\unittest\runner.py", line 176, in run
test(result)
File "D:\buildarea\3.x.ware-win81-release.refleak\build\lib\unittest\suite.py", line 84, in __call__
return self.run(*args, **kwds)
File "D:\buildarea\3.x.ware-win81-release.refleak\build\lib\unittest\suite.py", line 122, in run
test(result)
File "D:\buildarea\3.x.ware-win81-release.refleak\build\lib\unittest\suite.py", line 84, in __call__
return self.run(*args, **kwds)
File "D:\buildarea\3.x.ware-win81-release.refleak\build\lib\unittest\suite.py", line 122, in run
test(result)
File "D:\buildarea\3.x.ware-win81-release.refleak\build\lib\unittest\case.py", line 652, in __call__
return self.run(*args, **kwds)
File "D:\buildarea\3.x.ware-win81-release.refleak\build\lib\unittest\case.py", line 592, in run
self._callTestMethod(testMethod)
File "D:\buildarea\3.x.ware-win81-release.refleak\build\lib\unittest\case.py", line 549, in _callTestMethod
method()
File "D:\buildarea\3.x.ware-win81-release.refleak\build\lib\test\test_logging.py", line 5183, in test_namer_rotator_inheritance
rh.emit(self.next_rec())
Message: '2'
Arguments: None
Traceback (most recent call last):
File "D:\buildarea\3.x.ware-win81-release.refleak\build\lib\logging\handlers.py", line 74, in emit
self.doRollover()
File "D:\buildarea\3.x.ware-win81-release.refleak\build\lib\logging\handlers.py", line 177, in doRollover
self.rotate(self.baseFilename, dfn)
File "D:\buildarea\3.x.ware-win81-release.refleak\build\lib\logging\handlers.py", line 117, in rotate
self.rotator(source, dest)
File "D:\buildarea\3.x.ware-win81-release.refleak\build\lib\test\test_logging.py", line 5176, in rotator
os.rename(source, dest + ".rotated")
FileExistsError: [WinError 183] Cannot create a file when that file already exists: 'D:\\temp\\test_logging-2-uv3ib3vu.log' -> 'D:\\temp\\test_logging-2-uv3ib3vu.log.1.test.rotated'
Call stack:
File "D:\buildarea\3.x.ware-win81-release.refleak\build\lib\runpy.py", line 197, in _run_module_as_main
return _run_code(code, main_globals, None,
File "D:\buildarea\3.x.ware-win81-release.refleak\build\lib\runpy.py", line 87, in _run_code
exec(code, run_globals)
File "D:\buildarea\3.x.ware-win81-release.refleak\build\lib\test\regrtest.py", line 47, in <module>
_main()
File "D:\buildarea\3.x.ware-win81-release.refleak\build\lib\test\regrtest.py", line 43, in _main
main()
File "D:\buildarea\3.x.ware-win81-release.refleak\build\lib\test\libregrtest\main.py", line 717, in main
Regrtest().main(tests=tests, **kwargs)
File "D:\buildarea\3.x.ware-win81-release.refleak\build\lib\test\libregrtest\main.py", line 639, in main
self._main(tests, kwargs)
File "D:\buildarea\3.x.ware-win81-release.refleak\build\lib\test\libregrtest\main.py", line 659, in _main
run_tests_worker(self.ns, self.worker_test_name)
File "D:\buildarea\3.x.ware-win81-release.refleak\build\lib\test\libregrtest\runtest_mp.py", line 81, in run_tests_worker
result = runtest(ns, test_name)
File "D:\buildarea\3.x.ware-win81-release.refleak\build\lib\test\libregrtest\runtest.py", line 195, in runtest
return _runtest(ns, test_name)
File "D:\buildarea\3.x.ware-win81-release.refleak\build\lib\test\libregrtest\runtest.py", line 155, in _runtest
result = _runtest_inner(ns, test_name,
File "D:\buildarea\3.x.ware-win81-release.refleak\build\lib\test\libregrtest\runtest.py", line 272, in _runtest_inner
refleak = _runtest_inner2(ns, test_name)
File "D:\buildarea\3.x.ware-win81-release.refleak\build\lib\test\libregrtest\runtest.py", line 234, in _runtest_inner2
refleak = dash_R(ns, test_name, test_runner)
File "D:\buildarea\3.x.ware-win81-release.refleak\build\lib\test\libregrtest\refleak.py", line 89, in dash_R
test_func()
File "D:\buildarea\3.x.ware-win81-release.refleak\build\lib\test\support\__init__.py", line 682, in inner
return func(*args, **kwds)
File "D:\buildarea\3.x.ware-win81-release.refleak\build\lib\test\test_logging.py", line 5457, in test_main
support.run_unittest(*tests)
File "D:\buildarea\3.x.ware-win81-release.refleak\build\lib\test\support\__init__.py", line 1082, in run_unittest
_run_suite(suite)
File "D:\buildarea\3.x.ware-win81-release.refleak\build\lib\test\support\__init__.py", line 959, in _run_suite
result = runner.run(suite)
File "D:\buildarea\3.x.ware-win81-release.refleak\build\lib\test\support\testresult.py", line 162, in run
test(self.result)
File "D:\buildarea\3.x.ware-win81-release.refleak\build\lib\unittest\suite.py", line 84, in __call__
return self.run(*args, **kwds)
File "D:\buildarea\3.x.ware-win81-release.refleak\build\lib\unittest\suite.py", line 122, in run
test(result)
File "D:\buildarea\3.x.ware-win81-release.refleak\build\lib\unittest\suite.py", line 84, in __call__
return self.run(*args, **kwds)
File "D:\buildarea\3.x.ware-win81-release.refleak\build\lib\unittest\suite.py", line 122, in run
test(result)
File "D:\buildarea\3.x.ware-win81-release.refleak\build\lib\unittest\case.py", line 652, in __call__
return self.run(*args, **kwds)
File "D:\buildarea\3.x.ware-win81-release.refleak\build\lib\unittest\case.py", line 592, in run
self._callTestMethod(testMethod)
File "D:\buildarea\3.x.ware-win81-release.refleak\build\lib\unittest\case.py", line 549, in _callTestMethod
method()
File "D:\buildarea\3.x.ware-win81-release.refleak\build\lib\test\test_logging.py", line 5183, in test_namer_rotator_inheritance
rh.emit(self.next_rec())
Message: '2'
Arguments: None
.--- Logging error ---
Traceback (most recent call last):
File "D:\buildarea\3.x.ware-win81-release.refleak\build\lib\logging\handlers.py", line 74, in emit
self.doRollover()
File "D:\buildarea\3.x.ware-win81-release.refleak\build\lib\logging\handlers.py", line 177, in doRollover
self.rotate(self.baseFilename, dfn)
File "D:\buildarea\3.x.ware-win81-release.refleak\build\lib\logging\handlers.py", line 117, in rotate
self.rotator(source, dest)
File "D:\buildarea\3.x.ware-win81-release.refleak\build\lib\test\test_logging.py", line 5176, in rotator
os.rename(source, dest + ".rotated")
FileExistsError: [WinError 183] Cannot create a file when that file already exists: 'D:\\temp\\test_logging-2-1v23ei86.log' -> 'D:\\temp\\test_logging-2-1v23ei86.log.1.test.rotated'
Call stack:
File "D:\buildarea\3.x.ware-win81-release.refleak\build\lib\runpy.py", line 197, in _run_module_as_main
return _run_code(code, main_globals, None,
File "D:\buildarea\3.x.ware-win81-release.refleak\build\lib\runpy.py", line 87, in _run_code
exec(code, run_globals)
File "D:\buildarea\3.x.ware-win81-release.refleak\build\lib\test\regrtest.py", line 47, in <module>
_main()
File "D:\buildarea\3.x.ware-win81-release.refleak\build\lib\test\regrtest.py", line 43, in _main
main()
File "D:\buildarea\3.x.ware-win81-release.refleak\build\lib\test\libregrtest\main.py", line 717, in main
Regrtest().main(tests=tests, **kwargs)
File "D:\buildarea\3.x.ware-win81-release.refleak\build\lib\test\libregrtest\main.py", line 639, in main
self._main(tests, kwargs)
File "D:\buildarea\3.x.ware-win81-release.refleak\build\lib\test\libregrtest\main.py", line 659, in _main
run_tests_worker(self.ns, self.worker_test_name)
File "D:\buildarea\3.x.ware-win81-release.refleak\build\lib\test\libregrtest\runtest_mp.py", line 81, in run_tests_worker
result = runtest(ns, test_name)
File "D:\buildarea\3.x.ware-win81-release.refleak\build\lib\test\libregrtest\runtest.py", line 195, in runtest
return _runtest(ns, test_name)
File "D:\buildarea\3.x.ware-win81-release.refleak\build\lib\test\libregrtest\runtest.py", line 155, in _runtest
result = _runtest_inner(ns, test_name,
File "D:\buildarea\3.x.ware-win81-release.refleak\build\lib\test\libregrtest\runtest.py", line 272, in _runtest_inner
refleak = _runtest_inner2(ns, test_name)
File "D:\buildarea\3.x.ware-win81-release.refleak\build\lib\test\libregrtest\runtest.py", line 234, in _runtest_inner2
refleak = dash_R(ns, test_name, test_runner)
File "D:\buildarea\3.x.ware-win81-release.refleak\build\lib\test\libregrtest\refleak.py", line 89, in dash_R
test_func()
File "D:\buildarea\3.x.ware-win81-release.refleak\build\lib\test\support\__init__.py", line 682, in inner
return func(*args, **kwds)
File "D:\buildarea\3.x.ware-win81-release.refleak\build\lib\test\test_logging.py", line 5457, in test_main
support.run_unittest(*tests)
File "D:\buildarea\3.x.ware-win81-release.refleak\build\lib\test\support\__init__.py", line 1082, in run_unittest
_run_suite(suite)
File "D:\buildarea\3.x.ware-win81-release.refleak\build\lib\test\support\__init__.py", line 959, in _run_suite
result = runner.run(suite)
File "D:\buildarea\3.x.ware-win81-release.refleak\build\lib\test\support\testresult.py", line 162, in run
test(self.result)
File "D:\buildarea\3.x.ware-win81-release.refleak\build\lib\unittest\suite.py", line 84, in __call__
return self.run(*args, **kwds)
File "D:\buildarea\3.x.ware-win81-release.refleak\build\lib\unittest\suite.py", line 122, in run
test(result)
File "D:\buildarea\3.x.ware-win81-release.refleak\build\lib\unittest\suite.py", line 84, in __call__
return self.run(*args, **kwds)
File "D:\buildarea\3.x.ware-win81-release.refleak\build\lib\unittest\suite.py", line 122, in run
test(result)
File "D:\buildarea\3.x.ware-win81-release.refleak\build\lib\unittest\case.py", line 652, in __call__
return self.run(*args, **kwds)
File "D:\buildarea\3.x.ware-win81-release.refleak\build\lib\unittest\case.py", line 592, in run
self._callTestMethod(testMethod)
File "D:\buildarea\3.x.ware-win81-release.refleak\build\lib\unittest\case.py", line 549, in _callTestMethod
method()
File "D:\buildarea\3.x.ware-win81-release.refleak\build\lib\test\test_logging.py", line 5183, in test_namer_rotator_inheritance
rh.emit(self.next_rec())
Message: '2'
Arguments: None
.--- Logging error ---
Traceback (most recent call last):
File "D:\buildarea\3.x.ware-win81-release.refleak\build\lib\logging\handlers.py", line 74, in emit
self.doRollover()
File "D:\buildarea\3.x.ware-win81-release.refleak\build\lib\logging\handlers.py", line 177, in doRollover
self.rotate(self.baseFilename, dfn)
File "D:\buildarea\3.x.ware-win81-release.refleak\build\lib\logging\handlers.py", line 117, in rotate
self.rotator(source, dest)
File "D:\buildarea\3.x.ware-win81-release.refleak\build\lib\test\test_logging.py", line 5176, in rotator
os.rename(source, dest + ".rotated")
FileExistsError: [WinError 183] Cannot create a file when that file already exists: 'D:\\temp\\test_logging-2-gdkqo4e5.log' -> 'D:\\temp\\test_logging-2-gdkqo4e5.log.1.test.rotated'
Call stack:
File "D:\buildarea\3.x.ware-win81-release.refleak\build\lib\runpy.py", line 197, in _run_module_as_main
return _run_code(code, main_globals, None,
File "D:\buildarea\3.x.ware-win81-release.refleak\build\lib\runpy.py", line 87, in _run_code
exec(code, run_globals)
File "D:\buildarea\3.x.ware-win81-release.refleak\build\lib\test\regrtest.py", line 47, in <module>
_main()
File "D:\buildarea\3.x.ware-win81-release.refleak\build\lib\test\regrtest.py", line 43, in _main
main()
File "D:\buildarea\3.x.ware-win81-release.refleak\build\lib\test\libregrtest\main.py", line 717, in main
Regrtest().main(tests=tests, **kwargs)
File "D:\buildarea\3.x.ware-win81-release.refleak\build\lib\test\libregrtest\main.py", line 639, in main
self._main(tests, kwargs)
File "D:\buildarea\3.x.ware-win81-release.refleak\build\lib\test\libregrtest\main.py", line 659, in _main
run_tests_worker(self.ns, self.worker_test_name)
File "D:\buildarea\3.x.ware-win81-release.refleak\build\lib\test\libregrtest\runtest_mp.py", line 81, in run_tests_worker
result = runtest(ns, test_name)
File "D:\buildarea\3.x.ware-win81-release.refleak\build\lib\test\libregrtest\runtest.py", line 195, in runtest
return _runtest(ns, test_name)
File "D:\buildarea\3.x.ware-win81-release.refleak\build\lib\test\libregrtest\runtest.py", line 155, in _runtest
result = _runtest_inner(ns, test_name,
File "D:\buildarea\3.x.ware-win81-release.refleak\build\lib\test\libregrtest\runtest.py", line 272, in _runtest_inner
refleak = _runtest_inner2(ns, test_name)
File "D:\buildarea\3.x.ware-win81-release.refleak\build\lib\test\libregrtest\runtest.py", line 234, in _runtest_inner2
refleak = dash_R(ns, test_name, test_runner)
File "D:\buildarea\3.x.ware-win81-release.refleak\build\lib\test\libregrtest\refleak.py", line 89, in dash_R
test_func()
File "D:\buildarea\3.x.ware-win81-release.refleak\build\lib\test\support\__init__.py", line 682, in inner
return func(*args, **kwds)
File "D:\buildarea\3.x.ware-win81-release.refleak\build\lib\test\test_logging.py", line 5457, in test_main
support.run_unittest(*tests)
File "D:\buildarea\3.x.ware-win81-release.refleak\build\lib\test\support\__init__.py", line 1082, in run_unittest
_run_suite(suite)
File "D:\buildarea\3.x.ware-win81-release.refleak\build\lib\test\support\__init__.py", line 959, in _run_suite
result = runner.run(suite)
File "D:\buildarea\3.x.ware-win81-release.refleak\build\lib\test\support\testresult.py", line 162, in run
test(self.result)
File "D:\buildarea\3.x.ware-win81-release.refleak\build\lib\unittest\suite.py", line 84, in __call__
return self.run(*args, **kwds)
File "D:\buildarea\3.x.ware-win81-release.refleak\build\lib\unittest\suite.py", line 122, in run
test(result)
File "D:\buildarea\3.x.ware-win81-release.refleak\build\lib\unittest\suite.py", line 84, in __call__
return self.run(*args, **kwds)
File "D:\buildarea\3.x.ware-win81-release.refleak\build\lib\unittest\suite.py", line 122, in run
test(result)
File "D:\buildarea\3.x.ware-win81-release.refleak\build\lib\unittest\case.py", line 652, in __call__
return self.run(*args, **kwds)
File "D:\buildarea\3.x.ware-win81-release.refleak\build\lib\unittest\case.py", line 592, in run
self._callTestMethod(testMethod)
File "D:\buildarea\3.x.ware-win81-release.refleak\build\lib\unittest\case.py", line 549, in _callTestMethod
method()
File "D:\buildarea\3.x.ware-win81-release.refleak\build\lib\test\test_logging.py", line 5183, in test_namer_rotator_inheritance
rh.emit(self.next_rec())
Message: '2'
Arguments: None
.--- Logging error ---
Traceback (most recent call last):
File "D:\buildarea\3.x.ware-win81-release.refleak\build\lib\logging\handlers.py", line 74, in emit
self.doRollover()
File "D:\buildarea\3.x.ware-win81-release.refleak\build\lib\logging\handlers.py", line 177, in doRollover
self.rotate(self.baseFilename, dfn)
File "D:\buildarea\3.x.ware-win81-release.refleak\build\lib\logging\handlers.py", line 117, in rotate
self.rotator(source, dest)
File "D:\buildarea\3.x.ware-win81-release.refleak\build\lib\test\test_logging.py", line 5176, in rotator
os.rename(source, dest + ".rotated")
FileExistsError: [WinError 183] Cannot create a file when that file already exists: 'D:\\temp\\test_logging-2-s7i1qgr7.log' -> 'D:\\temp\\test_logging-2-s7i1qgr7.log.1.test.rotated'
Call stack:
File "D:\buildarea\3.x.ware-win81-release.refleak\build\lib\runpy.py", line 197, in _run_module_as_main
return _run_code(code, main_globals, None,
File "D:\buildarea\3.x.ware-win81-release.refleak\build\lib\runpy.py", line 87, in _run_code
exec(code, run_globals)
File "D:\buildarea\3.x.ware-win81-release.refleak\build\lib\test\regrtest.py", line 47, in <module>
_main()
File "D:\buildarea\3.x.ware-win81-release.refleak\build\lib\test\regrtest.py", line 43, in _main
main()
File "D:\buildarea\3.x.ware-win81-release.refleak\build\lib\test\libregrtest\main.py", line 717, in main
Regrtest().main(tests=tests, **kwargs)
File "D:\buildarea\3.x.ware-win81-release.refleak\build\lib\test\libregrtest\main.py", line 639, in main
self._main(tests, kwargs)
File "D:\buildarea\3.x.ware-win81-release.refleak\build\lib\test\libregrtest\main.py", line 659, in _main
run_tests_worker(self.ns, self.worker_test_name)
File "D:\buildarea\3.x.ware-win81-release.refleak\build\lib\test\libregrtest\runtest_mp.py", line 81, in run_tests_worker
result = runtest(ns, test_name)
File "D:\buildarea\3.x.ware-win81-release.refleak\build\lib\test\libregrtest\runtest.py", line 195, in runtest
return _runtest(ns, test_name)
File "D:\buildarea\3.x.ware-win81-release.refleak\build\lib\test\libregrtest\runtest.py", line 155, in _runtest
result = _runtest_inner(ns, test_name,
File "D:\buildarea\3.x.ware-win81-release.refleak\build\lib\test\libregrtest\runtest.py", line 272, in _runtest_inner
refleak = _runtest_inner2(ns, test_name)
File "D:\buildarea\3.x.ware-win81-release.refleak\build\lib\test\libregrtest\runtest.py", line 234, in _runtest_inner2
refleak = dash_R(ns, test_name, test_runner)
File "D:\buildarea\3.x.ware-win81-release.refleak\build\lib\test\libregrtest\refleak.py", line 89, in dash_R
test_func()
File "D:\buildarea\3.x.ware-win81-release.refleak\build\lib\test\support\__init__.py", line 682, in inner
return func(*args, **kwds)
File "D:\buildarea\3.x.ware-win81-release.refleak\build\lib\test\test_logging.py", line 5457, in test_main
support.run_unittest(*tests)
File "D:\buildarea\3.x.ware-win81-release.refleak\build\lib\test\support\__init__.py", line 1082, in run_unittest
_run_suite(suite)
File "D:\buildarea\3.x.ware-win81-release.refleak\build\lib\test\support\__init__.py", line 959, in _run_suite
result = runner.run(suite)
File "D:\buildarea\3.x.ware-win81-release.refleak\build\lib\test\support\testresult.py", line 162, in run
test(self.result)
File "D:\buildarea\3.x.ware-win81-release.refleak\build\lib\unittest\suite.py", line 84, in __call__
return self.run(*args, **kwds)
File "D:\buildarea\3.x.ware-win81-release.refleak\build\lib\unittest\suite.py", line 122, in run
test(result)
File "D:\buildarea\3.x.ware-win81-release.refleak\build\lib\unittest\suite.py", line 84, in __call__
return self.run(*args, **kwds)
File "D:\buildarea\3.x.ware-win81-release.refleak\build\lib\unittest\suite.py", line 122, in run
test(result)
File "D:\buildarea\3.x.ware-win81-release.refleak\build\lib\unittest\case.py", line 652, in __call__
return self.run(*args, **kwds)
File "D:\buildarea\3.x.ware-win81-release.refleak\build\lib\unittest\case.py", line 592, in run
self._callTestMethod(testMethod)
File "D:\buildarea\3.x.ware-win81-release.refleak\build\lib\unittest\case.py", line 549, in _callTestMethod
method()
File "D:\buildarea\3.x.ware-win81-release.refleak\build\lib\test\test_logging.py", line 5183, in test_namer_rotator_inheritance
rh.emit(self.next_rec())
Message: '2'
Arguments: None
.--- Logging error ---
Traceback (most recent call last):
File "D:\buildarea\3.x.ware-win81-release.refleak\build\lib\logging\handlers.py", line 74, in emit
self.doRollover()
File "D:\buildarea\3.x.ware-win81-release.refleak\build\lib\logging\handlers.py", line 177, in doRollover
self.rotate(self.baseFilename, dfn)
File "D:\buildarea\3.x.ware-win81-release.refleak\build\lib\logging\handlers.py", line 117, in rotate
self.rotator(source, dest)
File "D:\buildarea\3.x.ware-win81-release.refleak\build\lib\test\test_logging.py", line 5176, in rotator
os.rename(source, dest + ".rotated")
FileExistsError: [WinError 183] Cannot create a file when that file already exists: 'D:\\temp\\test_logging-2-kwtgl_ue.log' -> 'D:\\temp\\test_logging-2-kwtgl_ue.log.1.test.rotated'
Call stack:
File "D:\buildarea\3.x.ware-win81-release.refleak\build\lib\runpy.py", line 197, in _run_module_as_main
return _run_code(code, main_globals, None,
File "D:\buildarea\3.x.ware-win81-release.refleak\build\lib\runpy.py", line 87, in _run_code
exec(code, run_globals)
File "D:\buildarea\3.x.ware-win81-release.refleak\build\lib\test\regrtest.py", line 47, in <module>
_main()
File "D:\buildarea\3.x.ware-win81-release.refleak\build\lib\test\regrtest.py", line 43, in _main
main()
File "D:\buildarea\3.x.ware-win81-release.refleak\build\lib\test\libregrtest\main.py", line 717, in main
Regrtest().main(tests=tests, **kwargs)
File "D:\buildarea\3.x.ware-win81-release.refleak\build\lib\test\libregrtest\main.py", line 639, in main
self._main(tests, kwargs)
File "D:\buildarea\3.x.ware-win81-release.refleak\build\lib\test\libregrtest\main.py", line 659, in _main
run_tests_worker(self.ns, self.worker_test_name)
File "D:\buildarea\3.x.ware-win81-release.refleak\build\lib\test\libregrtest\runtest_mp.py", line 81, in run_tests_worker
result = runtest(ns, test_name)
File "D:\buildarea\3.x.ware-win81-release.refleak\build\lib\test\libregrtest\runtest.py", line 195, in runtest
return _runtest(ns, test_name)
File "D:\buildarea\3.x.ware-win81-release.refleak\build\lib\test\libregrtest\runtest.py", line 155, in _runtest
result = _runtest_inner(ns, test_name,
File "D:\buildarea\3.x.ware-win81-release.refleak\build\lib\test\libregrtest\runtest.py", line 272, in _runtest_inner
refleak = _runtest_inner2(ns, test_name)
File "D:\buildarea\3.x.ware-win81-release.refleak\build\lib\test\libregrtest\runtest.py", line 234, in _runtest_inner2
refleak = dash_R(ns, test_name, test_runner)
File "D:\buildarea\3.x.ware-win81-release.refleak\build\lib\test\libregrtest\refleak.py", line 89, in dash_R
test_func()
File "D:\buildarea\3.x.ware-win81-release.refleak\build\lib\test\support\__init__.py", line 682, in inner
return func(*args, **kwds)
File "D:\buildarea\3.x.ware-win81-release.refleak\build\lib\test\test_logging.py", line 5457, in test_main
support.run_unittest(*tests)
File "D:\buildarea\3.x.ware-win81-release.refleak\build\lib\test\support\__init__.py", line 1082, in run_unittest
_run_suite(suite)
File "D:\buildarea\3.x.ware-win81-release.refleak\build\lib\test\support\__init__.py", line 959, in _run_suite
result = runner.run(suite)
File "D:\buildarea\3.x.ware-win81-release.refleak\build\lib\test\support\testresult.py", line 162, in run
test(self.result)
File "D:\buildarea\3.x.ware-win81-release.refleak\build\lib\unittest\suite.py", line 84, in __call__
return self.run(*args, **kwds)
File "D:\buildarea\3.x.ware-win81-release.refleak\build\lib\unittest\suite.py", line 122, in run
test(result)
File "D:\buildarea\3.x.ware-win81-release.refleak\build\lib\unittest\suite.py", line 84, in __call__
return self.run(*args, **kwds)
File "D:\buildarea\3.x.ware-win81-release.refleak\build\lib\unittest\suite.py", line 122, in run
test(result)
File "D:\buildarea\3.x.ware-win81-release.refleak\build\lib\unittest\case.py", line 652, in __call__
return self.run(*args, **kwds)
File "D:\buildarea\3.x.ware-win81-release.refleak\build\lib\unittest\case.py", line 592, in run
self._callTestMethod(testMethod)
File "D:\buildarea\3.x.ware-win81-release.refleak\build\lib\unittest\case.py", line 549, in _callTestMethod
method()
File "D:\buildarea\3.x.ware-win81-release.refleak\build\lib\test\test_logging.py", line 5183, in test_namer_rotator_inheritance
rh.emit(self.next_rec())
Message: '2'
Arguments: None
.--- Logging error ---
Traceback (most recent call last):
File "D:\buildarea\3.x.ware-win81-release.refleak\build\lib\logging\handlers.py", line 74, in emit
self.doRollover()
File "D:\buildarea\3.x.ware-win81-release.refleak\build\lib\logging\handlers.py", line 177, in doRollover
self.rotate(self.baseFilename, dfn)
File "D:\buildarea\3.x.ware-win81-release.refleak\build\lib\logging\handlers.py", line 117, in rotate
self.rotator(source, dest)
File "D:\buildarea\3.x.ware-win81-release.refleak\build\lib\test\test_logging.py", line 5176, in rotator
os.rename(source, dest + ".rotated")
FileExistsError: [WinError 183] Cannot create a file when that file already exists: 'D:\\temp\\test_logging-2-5_rnv3n9.log' -> 'D:\\temp\\test_logging-2-5_rnv3n9.log.1.test.rotated'
Call stack:
File "D:\buildarea\3.x.ware-win81-release.refleak\build\lib\runpy.py", line 197, in _run_module_as_main
return _run_code(code, main_globals, None,
File "D:\buildarea\3.x.ware-win81-release.refleak\build\lib\runpy.py", line 87, in _run_code
exec(code, run_globals)
File "D:\buildarea\3.x.ware-win81-release.refleak\build\lib\test\regrtest.py", line 47, in <module>
_main()
File "D:\buildarea\3.x.ware-win81-release.refleak\build\lib\test\regrtest.py", line 43, in _main
main()
File "D:\buildarea\3.x.ware-win81-release.refleak\build\lib\test\libregrtest\main.py", line 717, in main
Regrtest().main(tests=tests, **kwargs)
File "D:\buildarea\3.x.ware-win81-release.refleak\build\lib\test\libregrtest\main.py", line 639, in main
self._main(tests, kwargs)
File "D:\buildarea\3.x.ware-win81-release.refleak\build\lib\test\libregrtest\main.py", line 659, in _main
run_tests_worker(self.ns, self.worker_test_name)
File "D:\buildarea\3.x.ware-win81-release.refleak\build\lib\test\libregrtest\runtest_mp.py", line 81, in run_tests_worker
result = runtest(ns, test_name)
File "D:\buildarea\3.x.ware-win81-release.refleak\build\lib\test\libregrtest\runtest.py", line 195, in runtest
return _runtest(ns, test_name)
File "D:\buildarea\3.x.ware-win81-release.refleak\build\lib\test\libregrtest\runtest.py", line 155, in _runtest
result = _runtest_inner(ns, test_name,
File "D:\buildarea\3.x.ware-win81-release.refleak\build\lib\test\libregrtest\runtest.py", line 272, in _runtest_inner
refleak = _runtest_inner2(ns, test_name)
File "D:\buildarea\3.x.ware-win81-release.refleak\build\lib\test\libregrtest\runtest.py", line 234, in _runtest_inner2
refleak = dash_R(ns, test_name, test_runner)
File "D:\buildarea\3.x.ware-win81-release.refleak\build\lib\test\libregrtest\refleak.py", line 89, in dash_R
test_func()
File "D:\buildarea\3.x.ware-win81-release.refleak\build\lib\test\support\__init__.py", line 682, in inner
return func(*args, **kwds)
File "D:\buildarea\3.x.ware-win81-release.refleak\build\lib\test\test_logging.py", line 5457, in test_main
support.run_unittest(*tests)
File "D:\buildarea\3.x.ware-win81-release.refleak\build\lib\test\support\__init__.py", line 1082, in run_unittest
_run_suite(suite)
File "D:\buildarea\3.x.ware-win81-release.refleak\build\lib\test\support\__init__.py", line 959, in _run_suite
result = runner.run(suite)
File "D:\buildarea\3.x.ware-win81-release.refleak\build\lib\test\support\testresult.py", line 162, in run
test(self.result)
File "D:\buildarea\3.x.ware-win81-release.refleak\build\lib\unittest\suite.py", line 84, in __call__
return self.run(*args, **kwds)
File "D:\buildarea\3.x.ware-win81-release.refleak\build\lib\unittest\suite.py", line 122, in run
test(result)
File "D:\buildarea\3.x.ware-win81-release.refleak\build\lib\unittest\suite.py", line 84, in __call__
return self.run(*args, **kwds)
File "D:\buildarea\3.x.ware-win81-release.refleak\build\lib\unittest\suite.py", line 122, in run
test(result)
File "D:\buildarea\3.x.ware-win81-release.refleak\build\lib\unittest\case.py", line 652, in __call__
return self.run(*args, **kwds)
File "D:\buildarea\3.x.ware-win81-release.refleak\build\lib\unittest\case.py", line 592, in run
self._callTestMethod(testMethod)
File "D:\buildarea\3.x.ware-win81-release.refleak\build\lib\unittest\case.py", line 549, in _callTestMethod
method()
File "D:\buildarea\3.x.ware-win81-release.refleak\build\lib\test\test_logging.py", line 5183, in test_namer_rotator_inheritance
rh.emit(self.next_rec())
Message: '2'
Arguments: None
.
Test report
===========
Failed tests:
- test_socketserver
- test_logging
Test leaking resources:
- test_logging: references
- test_socketserver: references
- test_logging: memory blocks
- test_socketserver: memory blocks
Sincerely,
-The Buildbot
1
0
Buildbot failure in Python on aarch64 Fedora Rawhide Refleaks 3.x
by buildbot@python.org Nov. 2, 2020
by buildbot@python.org Nov. 2, 2020
Nov. 2, 2020
The Buildbot has detected a new failure on builder aarch64 Fedora Rawhide Refleaks 3.x while building Python.
Full details are available at:
https://buildbot.python.org/all/#builders/290/builds/300
Buildbot URL: https://buildbot.python.org/all/
Worker for this Build: cstratak-fedora-rawhide-aarch64
Build Reason: <unknown>
Blamelist:
BUILD FAILED: failed test (failure)
Summary of the results of the build (if available):
===================================================
== Tests result: FAILURE then FAILURE ==
408 tests OK.
10 slowest tests:
- test_asyncio: 36 min 13 sec
- test_signal: 31 min 9 sec
- test_pydoc: 30 min 7 sec
- test_peg_generator: 23 min 56 sec
- test_concurrent_futures: 21 min 30 sec
- test_multiprocessing_spawn: 18 min 2 sec
- test_multiprocessing_forkserver: 12 min 18 sec
- test_zipfile: 8 min 28 sec
- test_nntplib: 8 min 1 sec
- test_lib2to3: 7 min 40 sec
2 tests failed:
test_logging test_socketserver
14 tests skipped:
test_devpoll test_gdb test_ioctl test_kqueue test_msilib
test_ossaudiodev test_startfile test_tix test_tk test_ttk_guionly
test_winconsoleio test_winreg test_winsound test_zipfile64
2 re-run tests:
test_logging test_socketserver
Total duration: 1 hour 1 min
Captured traceback
==================
Traceback (most recent call last):
File "/home/buildbot/buildarea/3.x.cstratak-fedora-rawhide-aarch64.refleak/build/Lib/multiprocessing/util.py", line 300, in _run_finalizers
finalizer()
File "/home/buildbot/buildarea/3.x.cstratak-fedora-rawhide-aarch64.refleak/build/Lib/multiprocessing/util.py", line 224, in __call__
res = self._callback(*self._args, **self._kwargs)
File "/home/buildbot/buildarea/3.x.cstratak-fedora-rawhide-aarch64.refleak/build/Lib/multiprocessing/synchronize.py", line 87, in _cleanup
sem_unlink(name)
FileNotFoundError: [Errno 2] No such file or directory
Traceback (most recent call last):
File "/home/buildbot/buildarea/3.x.cstratak-fedora-rawhide-aarch64.refleak/build/Lib/multiprocessing/util.py", line 300, in _run_finalizers
finalizer()
File "/home/buildbot/buildarea/3.x.cstratak-fedora-rawhide-aarch64.refleak/build/Lib/multiprocessing/util.py", line 224, in __call__
res = self._callback(*self._args, **self._kwargs)
File "/home/buildbot/buildarea/3.x.cstratak-fedora-rawhide-aarch64.refleak/build/Lib/multiprocessing/synchronize.py", line 87, in _cleanup
sem_unlink(name)
FileNotFoundError: [Errno 2] No such file or directory
Traceback (most recent call last):
File "/home/buildbot/buildarea/3.x.cstratak-fedora-rawhide-aarch64.refleak/build/Lib/multiprocessing/util.py", line 300, in _run_finalizers
finalizer()
File "/home/buildbot/buildarea/3.x.cstratak-fedora-rawhide-aarch64.refleak/build/Lib/multiprocessing/util.py", line 224, in __call__
res = self._callback(*self._args, **self._kwargs)
File "/home/buildbot/buildarea/3.x.cstratak-fedora-rawhide-aarch64.refleak/build/Lib/multiprocessing/synchronize.py", line 87, in _cleanup
sem_unlink(name)
FileNotFoundError: [Errno 2] No such file or directory
Traceback (most recent call last):
File "/home/buildbot/buildarea/3.x.cstratak-fedora-rawhide-aarch64.refleak/build/Lib/multiprocessing/util.py", line 300, in _run_finalizers
finalizer()
File "/home/buildbot/buildarea/3.x.cstratak-fedora-rawhide-aarch64.refleak/build/Lib/multiprocessing/util.py", line 224, in __call__
res = self._callback(*self._args, **self._kwargs)
File "/home/buildbot/buildarea/3.x.cstratak-fedora-rawhide-aarch64.refleak/build/Lib/multiprocessing/synchronize.py", line 87, in _cleanup
sem_unlink(name)
FileNotFoundError: [Errno 2] No such file or directory
Traceback (most recent call last):
File "/home/buildbot/buildarea/3.x.cstratak-fedora-rawhide-aarch64.refleak/build/Lib/multiprocessing/util.py", line 300, in _run_finalizers
finalizer()
File "/home/buildbot/buildarea/3.x.cstratak-fedora-rawhide-aarch64.refleak/build/Lib/multiprocessing/util.py", line 224, in __call__
res = self._callback(*self._args, **self._kwargs)
File "/home/buildbot/buildarea/3.x.cstratak-fedora-rawhide-aarch64.refleak/build/Lib/multiprocessing/synchronize.py", line 87, in _cleanup
sem_unlink(name)
FileNotFoundError: [Errno 2] No such file or directory
Traceback (most recent call last):
File "/home/buildbot/buildarea/3.x.cstratak-fedora-rawhide-aarch64.refleak/build/Lib/multiprocessing/util.py", line 300, in _run_finalizers
finalizer()
File "/home/buildbot/buildarea/3.x.cstratak-fedora-rawhide-aarch64.refleak/build/Lib/multiprocessing/util.py", line 224, in __call__
res = self._callback(*self._args, **self._kwargs)
File "/home/buildbot/buildarea/3.x.cstratak-fedora-rawhide-aarch64.refleak/build/Lib/multiprocessing/synchronize.py", line 87, in _cleanup
sem_unlink(name)
FileNotFoundError: [Errno 2] No such file or directory
./home/buildbot/buildarea/3.x.cstratak-fedora-rawhide-aarch64.refleak/build/Lib/multiprocessing/resource_tracker.py:216: UserWarning: resource_tracker: There appear to be 6 leaked semaphore objects to clean up at shutdown
warnings.warn('resource_tracker: There appear to be %d '
Traceback (most recent call last):
File "/home/buildbot/buildarea/3.x.cstratak-fedora-rawhide-aarch64.refleak/build/Lib/multiprocessing/util.py", line 300, in _run_finalizers
finalizer()
File "/home/buildbot/buildarea/3.x.cstratak-fedora-rawhide-aarch64.refleak/build/Lib/multiprocessing/util.py", line 224, in __call__
res = self._callback(*self._args, **self._kwargs)
File "/home/buildbot/buildarea/3.x.cstratak-fedora-rawhide-aarch64.refleak/build/Lib/multiprocessing/synchronize.py", line 87, in _cleanup
sem_unlink(name)
FileNotFoundError: [Errno 2] No such file or directory
Traceback (most recent call last):
File "/home/buildbot/buildarea/3.x.cstratak-fedora-rawhide-aarch64.refleak/build/Lib/multiprocessing/util.py", line 300, in _run_finalizers
finalizer()
File "/home/buildbot/buildarea/3.x.cstratak-fedora-rawhide-aarch64.refleak/build/Lib/multiprocessing/util.py", line 224, in __call__
res = self._callback(*self._args, **self._kwargs)
File "/home/buildbot/buildarea/3.x.cstratak-fedora-rawhide-aarch64.refleak/build/Lib/multiprocessing/synchronize.py", line 87, in _cleanup
sem_unlink(name)
FileNotFoundError: [Errno 2] No such file or directory
Traceback (most recent call last):
File "/home/buildbot/buildarea/3.x.cstratak-fedora-rawhide-aarch64.refleak/build/Lib/multiprocessing/util.py", line 300, in _run_finalizers
finalizer()
File "/home/buildbot/buildarea/3.x.cstratak-fedora-rawhide-aarch64.refleak/build/Lib/multiprocessing/util.py", line 224, in __call__
res = self._callback(*self._args, **self._kwargs)
File "/home/buildbot/buildarea/3.x.cstratak-fedora-rawhide-aarch64.refleak/build/Lib/multiprocessing/synchronize.py", line 87, in _cleanup
sem_unlink(name)
FileNotFoundError: [Errno 2] No such file or directory
Traceback (most recent call last):
File "/home/buildbot/buildarea/3.x.cstratak-fedora-rawhide-aarch64.refleak/build/Lib/multiprocessing/util.py", line 300, in _run_finalizers
finalizer()
File "/home/buildbot/buildarea/3.x.cstratak-fedora-rawhide-aarch64.refleak/build/Lib/multiprocessing/util.py", line 224, in __call__
res = self._callback(*self._args, **self._kwargs)
File "/home/buildbot/buildarea/3.x.cstratak-fedora-rawhide-aarch64.refleak/build/Lib/multiprocessing/synchronize.py", line 87, in _cleanup
sem_unlink(name)
FileNotFoundError: [Errno 2] No such file or directory
Traceback (most recent call last):
File "/home/buildbot/buildarea/3.x.cstratak-fedora-rawhide-aarch64.refleak/build/Lib/multiprocessing/util.py", line 300, in _run_finalizers
finalizer()
File "/home/buildbot/buildarea/3.x.cstratak-fedora-rawhide-aarch64.refleak/build/Lib/multiprocessing/util.py", line 224, in __call__
res = self._callback(*self._args, **self._kwargs)
File "/home/buildbot/buildarea/3.x.cstratak-fedora-rawhide-aarch64.refleak/build/Lib/multiprocessing/synchronize.py", line 87, in _cleanup
sem_unlink(name)
FileNotFoundError: [Errno 2] No such file or directory
Traceback (most recent call last):
File "/home/buildbot/buildarea/3.x.cstratak-fedora-rawhide-aarch64.refleak/build/Lib/multiprocessing/util.py", line 300, in _run_finalizers
finalizer()
File "/home/buildbot/buildarea/3.x.cstratak-fedora-rawhide-aarch64.refleak/build/Lib/multiprocessing/util.py", line 224, in __call__
res = self._callback(*self._args, **self._kwargs)
File "/home/buildbot/buildarea/3.x.cstratak-fedora-rawhide-aarch64.refleak/build/Lib/multiprocessing/synchronize.py", line 87, in _cleanup
sem_unlink(name)
FileNotFoundError: [Errno 2] No such file or directory
./home/buildbot/buildarea/3.x.cstratak-fedora-rawhide-aarch64.refleak/build/Lib/multiprocessing/resource_tracker.py:216: UserWarning: resource_tracker: There appear to be 6 leaked semaphore objects to clean up at shutdown
warnings.warn('resource_tracker: There appear to be %d '
Traceback (most recent call last):
File "/home/buildbot/buildarea/3.x.cstratak-fedora-rawhide-aarch64.refleak/build/Lib/multiprocessing/util.py", line 300, in _run_finalizers
finalizer()
File "/home/buildbot/buildarea/3.x.cstratak-fedora-rawhide-aarch64.refleak/build/Lib/multiprocessing/util.py", line 224, in __call__
res = self._callback(*self._args, **self._kwargs)
File "/home/buildbot/buildarea/3.x.cstratak-fedora-rawhide-aarch64.refleak/build/Lib/multiprocessing/synchronize.py", line 87, in _cleanup
sem_unlink(name)
FileNotFoundError: [Errno 2] No such file or directory
Traceback (most recent call last):
File "/home/buildbot/buildarea/3.x.cstratak-fedora-rawhide-aarch64.refleak/build/Lib/multiprocessing/util.py", line 300, in _run_finalizers
finalizer()
File "/home/buildbot/buildarea/3.x.cstratak-fedora-rawhide-aarch64.refleak/build/Lib/multiprocessing/util.py", line 224, in __call__
res = self._callback(*self._args, **self._kwargs)
File "/home/buildbot/buildarea/3.x.cstratak-fedora-rawhide-aarch64.refleak/build/Lib/multiprocessing/synchronize.py", line 87, in _cleanup
sem_unlink(name)
FileNotFoundError: [Errno 2] No such file or directory
Traceback (most recent call last):
File "/home/buildbot/buildarea/3.x.cstratak-fedora-rawhide-aarch64.refleak/build/Lib/multiprocessing/util.py", line 300, in _run_finalizers
finalizer()
File "/home/buildbot/buildarea/3.x.cstratak-fedora-rawhide-aarch64.refleak/build/Lib/multiprocessing/util.py", line 224, in __call__
res = self._callback(*self._args, **self._kwargs)
File "/home/buildbot/buildarea/3.x.cstratak-fedora-rawhide-aarch64.refleak/build/Lib/multiprocessing/synchronize.py", line 87, in _cleanup
sem_unlink(name)
FileNotFoundError: [Errno 2] No such file or directory
Traceback (most recent call last):
File "/home/buildbot/buildarea/3.x.cstratak-fedora-rawhide-aarch64.refleak/build/Lib/multiprocessing/util.py", line 300, in _run_finalizers
finalizer()
File "/home/buildbot/buildarea/3.x.cstratak-fedora-rawhide-aarch64.refleak/build/Lib/multiprocessing/util.py", line 224, in __call__
res = self._callback(*self._args, **self._kwargs)
File "/home/buildbot/buildarea/3.x.cstratak-fedora-rawhide-aarch64.refleak/build/Lib/multiprocessing/synchronize.py", line 87, in _cleanup
sem_unlink(name)
FileNotFoundError: [Errno 2] No such file or directory
Traceback (most recent call last):
File "/home/buildbot/buildarea/3.x.cstratak-fedora-rawhide-aarch64.refleak/build/Lib/multiprocessing/util.py", line 300, in _run_finalizers
finalizer()
File "/home/buildbot/buildarea/3.x.cstratak-fedora-rawhide-aarch64.refleak/build/Lib/multiprocessing/util.py", line 224, in __call__
res = self._callback(*self._args, **self._kwargs)
File "/home/buildbot/buildarea/3.x.cstratak-fedora-rawhide-aarch64.refleak/build/Lib/multiprocessing/synchronize.py", line 87, in _cleanup
sem_unlink(name)
FileNotFoundError: [Errno 2] No such file or directory
Traceback (most recent call last):
File "/home/buildbot/buildarea/3.x.cstratak-fedora-rawhide-aarch64.refleak/build/Lib/multiprocessing/util.py", line 300, in _run_finalizers
finalizer()
File "/home/buildbot/buildarea/3.x.cstratak-fedora-rawhide-aarch64.refleak/build/Lib/multiprocessing/util.py", line 224, in __call__
res = self._callback(*self._args, **self._kwargs)
File "/home/buildbot/buildarea/3.x.cstratak-fedora-rawhide-aarch64.refleak/build/Lib/multiprocessing/synchronize.py", line 87, in _cleanup
sem_unlink(name)
FileNotFoundError: [Errno 2] No such file or directory
./home/buildbot/buildarea/3.x.cstratak-fedora-rawhide-aarch64.refleak/build/Lib/multiprocessing/resource_tracker.py:216: UserWarning: resource_tracker: There appear to be 6 leaked semaphore objects to clean up at shutdown
warnings.warn('resource_tracker: There appear to be %d '
Traceback (most recent call last):
File "/home/buildbot/buildarea/3.x.cstratak-fedora-rawhide-aarch64.refleak/build/Lib/multiprocessing/util.py", line 300, in _run_finalizers
finalizer()
File "/home/buildbot/buildarea/3.x.cstratak-fedora-rawhide-aarch64.refleak/build/Lib/multiprocessing/util.py", line 224, in __call__
res = self._callback(*self._args, **self._kwargs)
File "/home/buildbot/buildarea/3.x.cstratak-fedora-rawhide-aarch64.refleak/build/Lib/multiprocessing/synchronize.py", line 87, in _cleanup
sem_unlink(name)
FileNotFoundError: [Errno 2] No such file or directory
Traceback (most recent call last):
File "/home/buildbot/buildarea/3.x.cstratak-fedora-rawhide-aarch64.refleak/build/Lib/multiprocessing/util.py", line 300, in _run_finalizers
finalizer()
File "/home/buildbot/buildarea/3.x.cstratak-fedora-rawhide-aarch64.refleak/build/Lib/multiprocessing/util.py", line 224, in __call__
res = self._callback(*self._args, **self._kwargs)
File "/home/buildbot/buildarea/3.x.cstratak-fedora-rawhide-aarch64.refleak/build/Lib/multiprocessing/synchronize.py", line 87, in _cleanup
sem_unlink(name)
FileNotFoundError: [Errno 2] No such file or directory
Traceback (most recent call last):
File "/home/buildbot/buildarea/3.x.cstratak-fedora-rawhide-aarch64.refleak/build/Lib/multiprocessing/util.py", line 300, in _run_finalizers
finalizer()
File "/home/buildbot/buildarea/3.x.cstratak-fedora-rawhide-aarch64.refleak/build/Lib/multiprocessing/util.py", line 224, in __call__
res = self._callback(*self._args, **self._kwargs)
File "/home/buildbot/buildarea/3.x.cstratak-fedora-rawhide-aarch64.refleak/build/Lib/multiprocessing/synchronize.py", line 87, in _cleanup
sem_unlink(name)
FileNotFoundError: [Errno 2] No such file or directory
Traceback (most recent call last):
File "/home/buildbot/buildarea/3.x.cstratak-fedora-rawhide-aarch64.refleak/build/Lib/multiprocessing/util.py", line 300, in _run_finalizers
finalizer()
File "/home/buildbot/buildarea/3.x.cstratak-fedora-rawhide-aarch64.refleak/build/Lib/multiprocessing/util.py", line 224, in __call__
res = self._callback(*self._args, **self._kwargs)
File "/home/buildbot/buildarea/3.x.cstratak-fedora-rawhide-aarch64.refleak/build/Lib/multiprocessing/synchronize.py", line 87, in _cleanup
sem_unlink(name)
FileNotFoundError: [Errno 2] No such file or directory
Traceback (most recent call last):
File "/home/buildbot/buildarea/3.x.cstratak-fedora-rawhide-aarch64.refleak/build/Lib/multiprocessing/util.py", line 300, in _run_finalizers
finalizer()
File "/home/buildbot/buildarea/3.x.cstratak-fedora-rawhide-aarch64.refleak/build/Lib/multiprocessing/util.py", line 224, in __call__
res = self._callback(*self._args, **self._kwargs)
File "/home/buildbot/buildarea/3.x.cstratak-fedora-rawhide-aarch64.refleak/build/Lib/multiprocessing/synchronize.py", line 87, in _cleanup
sem_unlink(name)
FileNotFoundError: [Errno 2] No such file or directory
Traceback (most recent call last):
File "/home/buildbot/buildarea/3.x.cstratak-fedora-rawhide-aarch64.refleak/build/Lib/multiprocessing/util.py", line 300, in _run_finalizers
finalizer()
File "/home/buildbot/buildarea/3.x.cstratak-fedora-rawhide-aarch64.refleak/build/Lib/multiprocessing/util.py", line 224, in __call__
res = self._callback(*self._args, **self._kwargs)
File "/home/buildbot/buildarea/3.x.cstratak-fedora-rawhide-aarch64.refleak/build/Lib/multiprocessing/synchronize.py", line 87, in _cleanup
sem_unlink(name)
FileNotFoundError: [Errno 2] No such file or directory
./home/buildbot/buildarea/3.x.cstratak-fedora-rawhide-aarch64.refleak/build/Lib/multiprocessing/resource_tracker.py:216: UserWarning: resource_tracker: There appear to be 6 leaked semaphore objects to clean up at shutdown
warnings.warn('resource_tracker: There appear to be %d '
Traceback (most recent call last):
File "/home/buildbot/buildarea/3.x.cstratak-fedora-rawhide-aarch64.refleak/build/Lib/multiprocessing/util.py", line 300, in _run_finalizers
finalizer()
File "/home/buildbot/buildarea/3.x.cstratak-fedora-rawhide-aarch64.refleak/build/Lib/multiprocessing/util.py", line 224, in __call__
res = self._callback(*self._args, **self._kwargs)
File "/home/buildbot/buildarea/3.x.cstratak-fedora-rawhide-aarch64.refleak/build/Lib/multiprocessing/synchronize.py", line 87, in _cleanup
sem_unlink(name)
FileNotFoundError: [Errno 2] No such file or directory
Traceback (most recent call last):
File "/home/buildbot/buildarea/3.x.cstratak-fedora-rawhide-aarch64.refleak/build/Lib/multiprocessing/util.py", line 300, in _run_finalizers
finalizer()
File "/home/buildbot/buildarea/3.x.cstratak-fedora-rawhide-aarch64.refleak/build/Lib/multiprocessing/util.py", line 224, in __call__
res = self._callback(*self._args, **self._kwargs)
File "/home/buildbot/buildarea/3.x.cstratak-fedora-rawhide-aarch64.refleak/build/Lib/multiprocessing/synchronize.py", line 87, in _cleanup
sem_unlink(name)
FileNotFoundError: [Errno 2] No such file or directory
Traceback (most recent call last):
File "/home/buildbot/buildarea/3.x.cstratak-fedora-rawhide-aarch64.refleak/build/Lib/multiprocessing/util.py", line 300, in _run_finalizers
finalizer()
File "/home/buildbot/buildarea/3.x.cstratak-fedora-rawhide-aarch64.refleak/build/Lib/multiprocessing/util.py", line 224, in __call__
res = self._callback(*self._args, **self._kwargs)
File "/home/buildbot/buildarea/3.x.cstratak-fedora-rawhide-aarch64.refleak/build/Lib/multiprocessing/synchronize.py", line 87, in _cleanup
sem_unlink(name)
FileNotFoundError: [Errno 2] No such file or directory
Traceback (most recent call last):
File "/home/buildbot/buildarea/3.x.cstratak-fedora-rawhide-aarch64.refleak/build/Lib/multiprocessing/util.py", line 300, in _run_finalizers
finalizer()
File "/home/buildbot/buildarea/3.x.cstratak-fedora-rawhide-aarch64.refleak/build/Lib/multiprocessing/util.py", line 224, in __call__
res = self._callback(*self._args, **self._kwargs)
File "/home/buildbot/buildarea/3.x.cstratak-fedora-rawhide-aarch64.refleak/build/Lib/multiprocessing/synchronize.py", line 87, in _cleanup
sem_unlink(name)
FileNotFoundError: [Errno 2] No such file or directory
Traceback (most recent call last):
File "/home/buildbot/buildarea/3.x.cstratak-fedora-rawhide-aarch64.refleak/build/Lib/multiprocessing/util.py", line 300, in _run_finalizers
finalizer()
File "/home/buildbot/buildarea/3.x.cstratak-fedora-rawhide-aarch64.refleak/build/Lib/multiprocessing/util.py", line 224, in __call__
res = self._callback(*self._args, **self._kwargs)
File "/home/buildbot/buildarea/3.x.cstratak-fedora-rawhide-aarch64.refleak/build/Lib/multiprocessing/synchronize.py", line 87, in _cleanup
sem_unlink(name)
FileNotFoundError: [Errno 2] No such file or directory
Traceback (most recent call last):
File "/home/buildbot/buildarea/3.x.cstratak-fedora-rawhide-aarch64.refleak/build/Lib/multiprocessing/util.py", line 300, in _run_finalizers
finalizer()
File "/home/buildbot/buildarea/3.x.cstratak-fedora-rawhide-aarch64.refleak/build/Lib/multiprocessing/util.py", line 224, in __call__
res = self._callback(*self._args, **self._kwargs)
File "/home/buildbot/buildarea/3.x.cstratak-fedora-rawhide-aarch64.refleak/build/Lib/multiprocessing/synchronize.py", line 87, in _cleanup
sem_unlink(name)
FileNotFoundError: [Errno 2] No such file or directory
./home/buildbot/buildarea/3.x.cstratak-fedora-rawhide-aarch64.refleak/build/Lib/multiprocessing/resource_tracker.py:216: UserWarning: resource_tracker: There appear to be 6 leaked semaphore objects to clean up at shutdown
warnings.warn('resource_tracker: There appear to be %d '
Traceback (most recent call last):
File "/home/buildbot/buildarea/3.x.cstratak-fedora-rawhide-aarch64.refleak/build/Lib/multiprocessing/util.py", line 300, in _run_finalizers
finalizer()
File "/home/buildbot/buildarea/3.x.cstratak-fedora-rawhide-aarch64.refleak/build/Lib/multiprocessing/util.py", line 224, in __call__
res = self._callback(*self._args, **self._kwargs)
File "/home/buildbot/buildarea/3.x.cstratak-fedora-rawhide-aarch64.refleak/build/Lib/multiprocessing/synchronize.py", line 87, in _cleanup
sem_unlink(name)
FileNotFoundError: [Errno 2] No such file or directory
Traceback (most recent call last):
File "/home/buildbot/buildarea/3.x.cstratak-fedora-rawhide-aarch64.refleak/build/Lib/multiprocessing/util.py", line 300, in _run_finalizers
finalizer()
File "/home/buildbot/buildarea/3.x.cstratak-fedora-rawhide-aarch64.refleak/build/Lib/multiprocessing/util.py", line 224, in __call__
res = self._callback(*self._args, **self._kwargs)
File "/home/buildbot/buildarea/3.x.cstratak-fedora-rawhide-aarch64.refleak/build/Lib/multiprocessing/synchronize.py", line 87, in _cleanup
sem_unlink(name)
FileNotFoundError: [Errno 2] No such file or directory
Traceback (most recent call last):
File "/home/buildbot/buildarea/3.x.cstratak-fedora-rawhide-aarch64.refleak/build/Lib/multiprocessing/util.py", line 300, in _run_finalizers
finalizer()
File "/home/buildbot/buildarea/3.x.cstratak-fedora-rawhide-aarch64.refleak/build/Lib/multiprocessing/util.py", line 224, in __call__
res = self._callback(*self._args, **self._kwargs)
File "/home/buildbot/buildarea/3.x.cstratak-fedora-rawhide-aarch64.refleak/build/Lib/multiprocessing/synchronize.py", line 87, in _cleanup
sem_unlink(name)
FileNotFoundError: [Errno 2] No such file or directory
Traceback (most recent call last):
File "/home/buildbot/buildarea/3.x.cstratak-fedora-rawhide-aarch64.refleak/build/Lib/multiprocessing/util.py", line 300, in _run_finalizers
finalizer()
File "/home/buildbot/buildarea/3.x.cstratak-fedora-rawhide-aarch64.refleak/build/Lib/multiprocessing/util.py", line 224, in __call__
res = self._callback(*self._args, **self._kwargs)
File "/home/buildbot/buildarea/3.x.cstratak-fedora-rawhide-aarch64.refleak/build/Lib/multiprocessing/synchronize.py", line 87, in _cleanup
sem_unlink(name)
FileNotFoundError: [Errno 2] No such file or directory
Traceback (most recent call last):
File "/home/buildbot/buildarea/3.x.cstratak-fedora-rawhide-aarch64.refleak/build/Lib/multiprocessing/util.py", line 300, in _run_finalizers
finalizer()
File "/home/buildbot/buildarea/3.x.cstratak-fedora-rawhide-aarch64.refleak/build/Lib/multiprocessing/util.py", line 224, in __call__
res = self._callback(*self._args, **self._kwargs)
File "/home/buildbot/buildarea/3.x.cstratak-fedora-rawhide-aarch64.refleak/build/Lib/multiprocessing/synchronize.py", line 87, in _cleanup
sem_unlink(name)
FileNotFoundError: [Errno 2] No such file or directory
Traceback (most recent call last):
File "/home/buildbot/buildarea/3.x.cstratak-fedora-rawhide-aarch64.refleak/build/Lib/multiprocessing/util.py", line 300, in _run_finalizers
finalizer()
File "/home/buildbot/buildarea/3.x.cstratak-fedora-rawhide-aarch64.refleak/build/Lib/multiprocessing/util.py", line 224, in __call__
res = self._callback(*self._args, **self._kwargs)
File "/home/buildbot/buildarea/3.x.cstratak-fedora-rawhide-aarch64.refleak/build/Lib/multiprocessing/synchronize.py", line 87, in _cleanup
sem_unlink(name)
FileNotFoundError: [Errno 2] No such file or directory
.
Test report
===========
Failed tests:
- test_socketserver
- test_logging
Test leaking resources:
- test_logging: references
- test_socketserver: references
- test_logging: memory blocks
- test_socketserver: memory blocks
Sincerely,
-The Buildbot
1
0
Buildbot failure in Python on aarch64 Fedora Stable Refleaks 3.x
by buildbot@python.org Nov. 2, 2020
by buildbot@python.org Nov. 2, 2020
Nov. 2, 2020
The Buildbot has detected a new failure on builder aarch64 Fedora Stable Refleaks 3.x while building Python.
Full details are available at:
https://buildbot.python.org/all/#builders/123/builds/78
Buildbot URL: https://buildbot.python.org/all/
Worker for this Build: cstratak-fedora-stable-aarch64
Build Reason: <unknown>
Blamelist:
BUILD FAILED: failed test (failure)
Summary of the results of the build (if available):
===================================================
== Tests result: FAILURE then FAILURE ==
409 tests OK.
10 slowest tests:
- test_asyncio: 56 min 9 sec
- test_signal: 31 min 10 sec
- test_pydoc: 29 min 53 sec
- test_concurrent_futures: 22 min
- test_peg_generator: 18 min 47 sec
- test_multiprocessing_spawn: 14 min 11 sec
- test_multiprocessing_forkserver: 10 min 37 sec
- test_gdb: 8 min 30 sec
- test_nntplib: 7 min 59 sec
- test_lib2to3: 7 min 48 sec
2 tests failed:
test_logging test_socketserver
13 tests skipped:
test_devpoll test_ioctl test_kqueue test_msilib test_ossaudiodev
test_startfile test_tix test_tk test_ttk_guionly test_winconsoleio
test_winreg test_winsound test_zipfile64
2 re-run tests:
test_logging test_socketserver
Total duration: 58 min 20 sec
Captured traceback
==================
Traceback (most recent call last):
File "/home/buildbot/buildarea/3.x.cstratak-fedora-stable-aarch64.refleak/build/Lib/multiprocessing/util.py", line 300, in _run_finalizers
finalizer()
File "/home/buildbot/buildarea/3.x.cstratak-fedora-stable-aarch64.refleak/build/Lib/multiprocessing/util.py", line 224, in __call__
res = self._callback(*self._args, **self._kwargs)
File "/home/buildbot/buildarea/3.x.cstratak-fedora-stable-aarch64.refleak/build/Lib/multiprocessing/synchronize.py", line 87, in _cleanup
sem_unlink(name)
FileNotFoundError: [Errno 2] No such file or directory
Traceback (most recent call last):
File "/home/buildbot/buildarea/3.x.cstratak-fedora-stable-aarch64.refleak/build/Lib/multiprocessing/util.py", line 300, in _run_finalizers
finalizer()
File "/home/buildbot/buildarea/3.x.cstratak-fedora-stable-aarch64.refleak/build/Lib/multiprocessing/util.py", line 224, in __call__
res = self._callback(*self._args, **self._kwargs)
File "/home/buildbot/buildarea/3.x.cstratak-fedora-stable-aarch64.refleak/build/Lib/multiprocessing/synchronize.py", line 87, in _cleanup
sem_unlink(name)
FileNotFoundError: [Errno 2] No such file or directory
Traceback (most recent call last):
File "/home/buildbot/buildarea/3.x.cstratak-fedora-stable-aarch64.refleak/build/Lib/multiprocessing/util.py", line 300, in _run_finalizers
finalizer()
File "/home/buildbot/buildarea/3.x.cstratak-fedora-stable-aarch64.refleak/build/Lib/multiprocessing/util.py", line 224, in __call__
res = self._callback(*self._args, **self._kwargs)
File "/home/buildbot/buildarea/3.x.cstratak-fedora-stable-aarch64.refleak/build/Lib/multiprocessing/synchronize.py", line 87, in _cleanup
sem_unlink(name)
FileNotFoundError: [Errno 2] No such file or directory
Traceback (most recent call last):
File "/home/buildbot/buildarea/3.x.cstratak-fedora-stable-aarch64.refleak/build/Lib/multiprocessing/util.py", line 300, in _run_finalizers
finalizer()
File "/home/buildbot/buildarea/3.x.cstratak-fedora-stable-aarch64.refleak/build/Lib/multiprocessing/util.py", line 224, in __call__
res = self._callback(*self._args, **self._kwargs)
File "/home/buildbot/buildarea/3.x.cstratak-fedora-stable-aarch64.refleak/build/Lib/multiprocessing/synchronize.py", line 87, in _cleanup
sem_unlink(name)
FileNotFoundError: [Errno 2] No such file or directory
Traceback (most recent call last):
File "/home/buildbot/buildarea/3.x.cstratak-fedora-stable-aarch64.refleak/build/Lib/multiprocessing/util.py", line 300, in _run_finalizers
finalizer()
File "/home/buildbot/buildarea/3.x.cstratak-fedora-stable-aarch64.refleak/build/Lib/multiprocessing/util.py", line 224, in __call__
res = self._callback(*self._args, **self._kwargs)
File "/home/buildbot/buildarea/3.x.cstratak-fedora-stable-aarch64.refleak/build/Lib/multiprocessing/synchronize.py", line 87, in _cleanup
sem_unlink(name)
FileNotFoundError: [Errno 2] No such file or directory
Traceback (most recent call last):
File "/home/buildbot/buildarea/3.x.cstratak-fedora-stable-aarch64.refleak/build/Lib/multiprocessing/util.py", line 300, in _run_finalizers
finalizer()
File "/home/buildbot/buildarea/3.x.cstratak-fedora-stable-aarch64.refleak/build/Lib/multiprocessing/util.py", line 224, in __call__
res = self._callback(*self._args, **self._kwargs)
File "/home/buildbot/buildarea/3.x.cstratak-fedora-stable-aarch64.refleak/build/Lib/multiprocessing/synchronize.py", line 87, in _cleanup
sem_unlink(name)
FileNotFoundError: [Errno 2] No such file or directory
./home/buildbot/buildarea/3.x.cstratak-fedora-stable-aarch64.refleak/build/Lib/multiprocessing/resource_tracker.py:216: UserWarning: resource_tracker: There appear to be 6 leaked semaphore objects to clean up at shutdown
warnings.warn('resource_tracker: There appear to be %d '
Traceback (most recent call last):
File "/home/buildbot/buildarea/3.x.cstratak-fedora-stable-aarch64.refleak/build/Lib/multiprocessing/util.py", line 300, in _run_finalizers
finalizer()
File "/home/buildbot/buildarea/3.x.cstratak-fedora-stable-aarch64.refleak/build/Lib/multiprocessing/util.py", line 224, in __call__
res = self._callback(*self._args, **self._kwargs)
File "/home/buildbot/buildarea/3.x.cstratak-fedora-stable-aarch64.refleak/build/Lib/multiprocessing/synchronize.py", line 87, in _cleanup
sem_unlink(name)
FileNotFoundError: [Errno 2] No such file or directory
Traceback (most recent call last):
File "/home/buildbot/buildarea/3.x.cstratak-fedora-stable-aarch64.refleak/build/Lib/multiprocessing/util.py", line 300, in _run_finalizers
finalizer()
File "/home/buildbot/buildarea/3.x.cstratak-fedora-stable-aarch64.refleak/build/Lib/multiprocessing/util.py", line 224, in __call__
res = self._callback(*self._args, **self._kwargs)
File "/home/buildbot/buildarea/3.x.cstratak-fedora-stable-aarch64.refleak/build/Lib/multiprocessing/synchronize.py", line 87, in _cleanup
sem_unlink(name)
FileNotFoundError: [Errno 2] No such file or directory
Traceback (most recent call last):
File "/home/buildbot/buildarea/3.x.cstratak-fedora-stable-aarch64.refleak/build/Lib/multiprocessing/util.py", line 300, in _run_finalizers
finalizer()
File "/home/buildbot/buildarea/3.x.cstratak-fedora-stable-aarch64.refleak/build/Lib/multiprocessing/util.py", line 224, in __call__
res = self._callback(*self._args, **self._kwargs)
File "/home/buildbot/buildarea/3.x.cstratak-fedora-stable-aarch64.refleak/build/Lib/multiprocessing/synchronize.py", line 87, in _cleanup
sem_unlink(name)
FileNotFoundError: [Errno 2] No such file or directory
Traceback (most recent call last):
File "/home/buildbot/buildarea/3.x.cstratak-fedora-stable-aarch64.refleak/build/Lib/multiprocessing/util.py", line 300, in _run_finalizers
finalizer()
File "/home/buildbot/buildarea/3.x.cstratak-fedora-stable-aarch64.refleak/build/Lib/multiprocessing/util.py", line 224, in __call__
res = self._callback(*self._args, **self._kwargs)
File "/home/buildbot/buildarea/3.x.cstratak-fedora-stable-aarch64.refleak/build/Lib/multiprocessing/synchronize.py", line 87, in _cleanup
sem_unlink(name)
FileNotFoundError: [Errno 2] No such file or directory
Traceback (most recent call last):
File "/home/buildbot/buildarea/3.x.cstratak-fedora-stable-aarch64.refleak/build/Lib/multiprocessing/util.py", line 300, in _run_finalizers
finalizer()
File "/home/buildbot/buildarea/3.x.cstratak-fedora-stable-aarch64.refleak/build/Lib/multiprocessing/util.py", line 224, in __call__
res = self._callback(*self._args, **self._kwargs)
File "/home/buildbot/buildarea/3.x.cstratak-fedora-stable-aarch64.refleak/build/Lib/multiprocessing/synchronize.py", line 87, in _cleanup
sem_unlink(name)
FileNotFoundError: [Errno 2] No such file or directory
Traceback (most recent call last):
File "/home/buildbot/buildarea/3.x.cstratak-fedora-stable-aarch64.refleak/build/Lib/multiprocessing/util.py", line 300, in _run_finalizers
finalizer()
File "/home/buildbot/buildarea/3.x.cstratak-fedora-stable-aarch64.refleak/build/Lib/multiprocessing/util.py", line 224, in __call__
res = self._callback(*self._args, **self._kwargs)
File "/home/buildbot/buildarea/3.x.cstratak-fedora-stable-aarch64.refleak/build/Lib/multiprocessing/synchronize.py", line 87, in _cleanup
sem_unlink(name)
FileNotFoundError: [Errno 2] No such file or directory
./home/buildbot/buildarea/3.x.cstratak-fedora-stable-aarch64.refleak/build/Lib/multiprocessing/resource_tracker.py:216: UserWarning: resource_tracker: There appear to be 6 leaked semaphore objects to clean up at shutdown
warnings.warn('resource_tracker: There appear to be %d '
Traceback (most recent call last):
File "/home/buildbot/buildarea/3.x.cstratak-fedora-stable-aarch64.refleak/build/Lib/multiprocessing/util.py", line 300, in _run_finalizers
finalizer()
File "/home/buildbot/buildarea/3.x.cstratak-fedora-stable-aarch64.refleak/build/Lib/multiprocessing/util.py", line 224, in __call__
res = self._callback(*self._args, **self._kwargs)
File "/home/buildbot/buildarea/3.x.cstratak-fedora-stable-aarch64.refleak/build/Lib/multiprocessing/synchronize.py", line 87, in _cleanup
sem_unlink(name)
FileNotFoundError: [Errno 2] No such file or directory
Traceback (most recent call last):
File "/home/buildbot/buildarea/3.x.cstratak-fedora-stable-aarch64.refleak/build/Lib/multiprocessing/util.py", line 300, in _run_finalizers
finalizer()
File "/home/buildbot/buildarea/3.x.cstratak-fedora-stable-aarch64.refleak/build/Lib/multiprocessing/util.py", line 224, in __call__
res = self._callback(*self._args, **self._kwargs)
File "/home/buildbot/buildarea/3.x.cstratak-fedora-stable-aarch64.refleak/build/Lib/multiprocessing/synchronize.py", line 87, in _cleanup
sem_unlink(name)
FileNotFoundError: [Errno 2] No such file or directory
Traceback (most recent call last):
File "/home/buildbot/buildarea/3.x.cstratak-fedora-stable-aarch64.refleak/build/Lib/multiprocessing/util.py", line 300, in _run_finalizers
finalizer()
File "/home/buildbot/buildarea/3.x.cstratak-fedora-stable-aarch64.refleak/build/Lib/multiprocessing/util.py", line 224, in __call__
res = self._callback(*self._args, **self._kwargs)
File "/home/buildbot/buildarea/3.x.cstratak-fedora-stable-aarch64.refleak/build/Lib/multiprocessing/synchronize.py", line 87, in _cleanup
sem_unlink(name)
FileNotFoundError: [Errno 2] No such file or directory
Traceback (most recent call last):
File "/home/buildbot/buildarea/3.x.cstratak-fedora-stable-aarch64.refleak/build/Lib/multiprocessing/util.py", line 300, in _run_finalizers
finalizer()
File "/home/buildbot/buildarea/3.x.cstratak-fedora-stable-aarch64.refleak/build/Lib/multiprocessing/util.py", line 224, in __call__
res = self._callback(*self._args, **self._kwargs)
File "/home/buildbot/buildarea/3.x.cstratak-fedora-stable-aarch64.refleak/build/Lib/multiprocessing/synchronize.py", line 87, in _cleanup
sem_unlink(name)
FileNotFoundError: [Errno 2] No such file or directory
Traceback (most recent call last):
File "/home/buildbot/buildarea/3.x.cstratak-fedora-stable-aarch64.refleak/build/Lib/multiprocessing/util.py", line 300, in _run_finalizers
finalizer()
File "/home/buildbot/buildarea/3.x.cstratak-fedora-stable-aarch64.refleak/build/Lib/multiprocessing/util.py", line 224, in __call__
res = self._callback(*self._args, **self._kwargs)
File "/home/buildbot/buildarea/3.x.cstratak-fedora-stable-aarch64.refleak/build/Lib/multiprocessing/synchronize.py", line 87, in _cleanup
sem_unlink(name)
FileNotFoundError: [Errno 2] No such file or directory
Traceback (most recent call last):
File "/home/buildbot/buildarea/3.x.cstratak-fedora-stable-aarch64.refleak/build/Lib/multiprocessing/util.py", line 300, in _run_finalizers
finalizer()
File "/home/buildbot/buildarea/3.x.cstratak-fedora-stable-aarch64.refleak/build/Lib/multiprocessing/util.py", line 224, in __call__
res = self._callback(*self._args, **self._kwargs)
File "/home/buildbot/buildarea/3.x.cstratak-fedora-stable-aarch64.refleak/build/Lib/multiprocessing/synchronize.py", line 87, in _cleanup
sem_unlink(name)
FileNotFoundError: [Errno 2] No such file or directory
./home/buildbot/buildarea/3.x.cstratak-fedora-stable-aarch64.refleak/build/Lib/multiprocessing/resource_tracker.py:216: UserWarning: resource_tracker: There appear to be 6 leaked semaphore objects to clean up at shutdown
warnings.warn('resource_tracker: There appear to be %d '
Traceback (most recent call last):
File "/home/buildbot/buildarea/3.x.cstratak-fedora-stable-aarch64.refleak/build/Lib/multiprocessing/util.py", line 300, in _run_finalizers
finalizer()
File "/home/buildbot/buildarea/3.x.cstratak-fedora-stable-aarch64.refleak/build/Lib/multiprocessing/util.py", line 224, in __call__
res = self._callback(*self._args, **self._kwargs)
File "/home/buildbot/buildarea/3.x.cstratak-fedora-stable-aarch64.refleak/build/Lib/multiprocessing/synchronize.py", line 87, in _cleanup
sem_unlink(name)
FileNotFoundError: [Errno 2] No such file or directory
Traceback (most recent call last):
File "/home/buildbot/buildarea/3.x.cstratak-fedora-stable-aarch64.refleak/build/Lib/multiprocessing/util.py", line 300, in _run_finalizers
finalizer()
File "/home/buildbot/buildarea/3.x.cstratak-fedora-stable-aarch64.refleak/build/Lib/multiprocessing/util.py", line 224, in __call__
res = self._callback(*self._args, **self._kwargs)
File "/home/buildbot/buildarea/3.x.cstratak-fedora-stable-aarch64.refleak/build/Lib/multiprocessing/synchronize.py", line 87, in _cleanup
sem_unlink(name)
FileNotFoundError: [Errno 2] No such file or directory
Traceback (most recent call last):
File "/home/buildbot/buildarea/3.x.cstratak-fedora-stable-aarch64.refleak/build/Lib/multiprocessing/util.py", line 300, in _run_finalizers
finalizer()
File "/home/buildbot/buildarea/3.x.cstratak-fedora-stable-aarch64.refleak/build/Lib/multiprocessing/util.py", line 224, in __call__
res = self._callback(*self._args, **self._kwargs)
File "/home/buildbot/buildarea/3.x.cstratak-fedora-stable-aarch64.refleak/build/Lib/multiprocessing/synchronize.py", line 87, in _cleanup
sem_unlink(name)
FileNotFoundError: [Errno 2] No such file or directory
Traceback (most recent call last):
File "/home/buildbot/buildarea/3.x.cstratak-fedora-stable-aarch64.refleak/build/Lib/multiprocessing/util.py", line 300, in _run_finalizers
finalizer()
File "/home/buildbot/buildarea/3.x.cstratak-fedora-stable-aarch64.refleak/build/Lib/multiprocessing/util.py", line 224, in __call__
res = self._callback(*self._args, **self._kwargs)
File "/home/buildbot/buildarea/3.x.cstratak-fedora-stable-aarch64.refleak/build/Lib/multiprocessing/synchronize.py", line 87, in _cleanup
sem_unlink(name)
FileNotFoundError: [Errno 2] No such file or directory
Traceback (most recent call last):
File "/home/buildbot/buildarea/3.x.cstratak-fedora-stable-aarch64.refleak/build/Lib/multiprocessing/util.py", line 300, in _run_finalizers
finalizer()
File "/home/buildbot/buildarea/3.x.cstratak-fedora-stable-aarch64.refleak/build/Lib/multiprocessing/util.py", line 224, in __call__
res = self._callback(*self._args, **self._kwargs)
File "/home/buildbot/buildarea/3.x.cstratak-fedora-stable-aarch64.refleak/build/Lib/multiprocessing/synchronize.py", line 87, in _cleanup
sem_unlink(name)
FileNotFoundError: [Errno 2] No such file or directory
Traceback (most recent call last):
File "/home/buildbot/buildarea/3.x.cstratak-fedora-stable-aarch64.refleak/build/Lib/multiprocessing/util.py", line 300, in _run_finalizers
finalizer()
File "/home/buildbot/buildarea/3.x.cstratak-fedora-stable-aarch64.refleak/build/Lib/multiprocessing/util.py", line 224, in __call__
res = self._callback(*self._args, **self._kwargs)
File "/home/buildbot/buildarea/3.x.cstratak-fedora-stable-aarch64.refleak/build/Lib/multiprocessing/synchronize.py", line 87, in _cleanup
sem_unlink(name)
FileNotFoundError: [Errno 2] No such file or directory
./home/buildbot/buildarea/3.x.cstratak-fedora-stable-aarch64.refleak/build/Lib/multiprocessing/resource_tracker.py:216: UserWarning: resource_tracker: There appear to be 6 leaked semaphore objects to clean up at shutdown
warnings.warn('resource_tracker: There appear to be %d '
Traceback (most recent call last):
File "/home/buildbot/buildarea/3.x.cstratak-fedora-stable-aarch64.refleak/build/Lib/multiprocessing/util.py", line 300, in _run_finalizers
finalizer()
File "/home/buildbot/buildarea/3.x.cstratak-fedora-stable-aarch64.refleak/build/Lib/multiprocessing/util.py", line 224, in __call__
res = self._callback(*self._args, **self._kwargs)
File "/home/buildbot/buildarea/3.x.cstratak-fedora-stable-aarch64.refleak/build/Lib/multiprocessing/synchronize.py", line 87, in _cleanup
sem_unlink(name)
FileNotFoundError: [Errno 2] No such file or directory
Traceback (most recent call last):
File "/home/buildbot/buildarea/3.x.cstratak-fedora-stable-aarch64.refleak/build/Lib/multiprocessing/util.py", line 300, in _run_finalizers
finalizer()
File "/home/buildbot/buildarea/3.x.cstratak-fedora-stable-aarch64.refleak/build/Lib/multiprocessing/util.py", line 224, in __call__
res = self._callback(*self._args, **self._kwargs)
File "/home/buildbot/buildarea/3.x.cstratak-fedora-stable-aarch64.refleak/build/Lib/multiprocessing/synchronize.py", line 87, in _cleanup
sem_unlink(name)
FileNotFoundError: [Errno 2] No such file or directory
Traceback (most recent call last):
File "/home/buildbot/buildarea/3.x.cstratak-fedora-stable-aarch64.refleak/build/Lib/multiprocessing/util.py", line 300, in _run_finalizers
finalizer()
File "/home/buildbot/buildarea/3.x.cstratak-fedora-stable-aarch64.refleak/build/Lib/multiprocessing/util.py", line 224, in __call__
res = self._callback(*self._args, **self._kwargs)
File "/home/buildbot/buildarea/3.x.cstratak-fedora-stable-aarch64.refleak/build/Lib/multiprocessing/synchronize.py", line 87, in _cleanup
sem_unlink(name)
FileNotFoundError: [Errno 2] No such file or directory
Traceback (most recent call last):
File "/home/buildbot/buildarea/3.x.cstratak-fedora-stable-aarch64.refleak/build/Lib/multiprocessing/util.py", line 300, in _run_finalizers
finalizer()
File "/home/buildbot/buildarea/3.x.cstratak-fedora-stable-aarch64.refleak/build/Lib/multiprocessing/util.py", line 224, in __call__
res = self._callback(*self._args, **self._kwargs)
File "/home/buildbot/buildarea/3.x.cstratak-fedora-stable-aarch64.refleak/build/Lib/multiprocessing/synchronize.py", line 87, in _cleanup
sem_unlink(name)
FileNotFoundError: [Errno 2] No such file or directory
Traceback (most recent call last):
File "/home/buildbot/buildarea/3.x.cstratak-fedora-stable-aarch64.refleak/build/Lib/multiprocessing/util.py", line 300, in _run_finalizers
finalizer()
File "/home/buildbot/buildarea/3.x.cstratak-fedora-stable-aarch64.refleak/build/Lib/multiprocessing/util.py", line 224, in __call__
res = self._callback(*self._args, **self._kwargs)
File "/home/buildbot/buildarea/3.x.cstratak-fedora-stable-aarch64.refleak/build/Lib/multiprocessing/synchronize.py", line 87, in _cleanup
sem_unlink(name)
FileNotFoundError: [Errno 2] No such file or directory
Traceback (most recent call last):
File "/home/buildbot/buildarea/3.x.cstratak-fedora-stable-aarch64.refleak/build/Lib/multiprocessing/util.py", line 300, in _run_finalizers
finalizer()
File "/home/buildbot/buildarea/3.x.cstratak-fedora-stable-aarch64.refleak/build/Lib/multiprocessing/util.py", line 224, in __call__
res = self._callback(*self._args, **self._kwargs)
File "/home/buildbot/buildarea/3.x.cstratak-fedora-stable-aarch64.refleak/build/Lib/multiprocessing/synchronize.py", line 87, in _cleanup
sem_unlink(name)
FileNotFoundError: [Errno 2] No such file or directory
./home/buildbot/buildarea/3.x.cstratak-fedora-stable-aarch64.refleak/build/Lib/multiprocessing/resource_tracker.py:216: UserWarning: resource_tracker: There appear to be 6 leaked semaphore objects to clean up at shutdown
warnings.warn('resource_tracker: There appear to be %d '
Traceback (most recent call last):
File "/home/buildbot/buildarea/3.x.cstratak-fedora-stable-aarch64.refleak/build/Lib/multiprocessing/util.py", line 300, in _run_finalizers
finalizer()
File "/home/buildbot/buildarea/3.x.cstratak-fedora-stable-aarch64.refleak/build/Lib/multiprocessing/util.py", line 224, in __call__
res = self._callback(*self._args, **self._kwargs)
File "/home/buildbot/buildarea/3.x.cstratak-fedora-stable-aarch64.refleak/build/Lib/multiprocessing/synchronize.py", line 87, in _cleanup
sem_unlink(name)
FileNotFoundError: [Errno 2] No such file or directory
Traceback (most recent call last):
File "/home/buildbot/buildarea/3.x.cstratak-fedora-stable-aarch64.refleak/build/Lib/multiprocessing/util.py", line 300, in _run_finalizers
finalizer()
File "/home/buildbot/buildarea/3.x.cstratak-fedora-stable-aarch64.refleak/build/Lib/multiprocessing/util.py", line 224, in __call__
res = self._callback(*self._args, **self._kwargs)
File "/home/buildbot/buildarea/3.x.cstratak-fedora-stable-aarch64.refleak/build/Lib/multiprocessing/synchronize.py", line 87, in _cleanup
sem_unlink(name)
FileNotFoundError: [Errno 2] No such file or directory
Traceback (most recent call last):
File "/home/buildbot/buildarea/3.x.cstratak-fedora-stable-aarch64.refleak/build/Lib/multiprocessing/util.py", line 300, in _run_finalizers
finalizer()
File "/home/buildbot/buildarea/3.x.cstratak-fedora-stable-aarch64.refleak/build/Lib/multiprocessing/util.py", line 224, in __call__
res = self._callback(*self._args, **self._kwargs)
File "/home/buildbot/buildarea/3.x.cstratak-fedora-stable-aarch64.refleak/build/Lib/multiprocessing/synchronize.py", line 87, in _cleanup
sem_unlink(name)
FileNotFoundError: [Errno 2] No such file or directory
Traceback (most recent call last):
File "/home/buildbot/buildarea/3.x.cstratak-fedora-stable-aarch64.refleak/build/Lib/multiprocessing/util.py", line 300, in _run_finalizers
finalizer()
File "/home/buildbot/buildarea/3.x.cstratak-fedora-stable-aarch64.refleak/build/Lib/multiprocessing/util.py", line 224, in __call__
res = self._callback(*self._args, **self._kwargs)
File "/home/buildbot/buildarea/3.x.cstratak-fedora-stable-aarch64.refleak/build/Lib/multiprocessing/synchronize.py", line 87, in _cleanup
sem_unlink(name)
FileNotFoundError: [Errno 2] No such file or directory
Traceback (most recent call last):
File "/home/buildbot/buildarea/3.x.cstratak-fedora-stable-aarch64.refleak/build/Lib/multiprocessing/util.py", line 300, in _run_finalizers
finalizer()
File "/home/buildbot/buildarea/3.x.cstratak-fedora-stable-aarch64.refleak/build/Lib/multiprocessing/util.py", line 224, in __call__
res = self._callback(*self._args, **self._kwargs)
File "/home/buildbot/buildarea/3.x.cstratak-fedora-stable-aarch64.refleak/build/Lib/multiprocessing/synchronize.py", line 87, in _cleanup
sem_unlink(name)
FileNotFoundError: [Errno 2] No such file or directory
Traceback (most recent call last):
File "/home/buildbot/buildarea/3.x.cstratak-fedora-stable-aarch64.refleak/build/Lib/multiprocessing/util.py", line 300, in _run_finalizers
finalizer()
File "/home/buildbot/buildarea/3.x.cstratak-fedora-stable-aarch64.refleak/build/Lib/multiprocessing/util.py", line 224, in __call__
res = self._callback(*self._args, **self._kwargs)
File "/home/buildbot/buildarea/3.x.cstratak-fedora-stable-aarch64.refleak/build/Lib/multiprocessing/synchronize.py", line 87, in _cleanup
sem_unlink(name)
FileNotFoundError: [Errno 2] No such file or directory
.
Test report
===========
Failed tests:
- test_socketserver
- test_logging
Test leaking resources:
- test_logging: references
- test_socketserver: references
- test_logging: memory blocks
- test_socketserver: memory blocks
Sincerely,
-The Buildbot
1
0
Nov. 2, 2020
The Buildbot has detected a new failure on builder AMD64 Fedora Stable Refleaks 3.x while building Python.
Full details are available at:
https://buildbot.python.org/all/#builders/320/builds/73
Buildbot URL: https://buildbot.python.org/all/
Worker for this Build: cstratak-fedora-stable-x86_64
Build Reason: <unknown>
Blamelist:
BUILD FAILED: failed test (failure)
Summary of the results of the build (if available):
===================================================
== Tests result: FAILURE then FAILURE ==
409 tests OK.
10 slowest tests:
- test_signal: 30 min 59 sec
- test_asyncio: 30 min 23 sec
- test_pydoc: 29 min 45 sec
- test_concurrent_futures: 18 min 13 sec
- test_mailbox: 14 min 47 sec
- test_peg_generator: 11 min 44 sec
- test_shelve: 10 min 40 sec
- test_multiprocessing_spawn: 10 min 29 sec
- test_nntplib: 8 min 5 sec
- test_multiprocessing_forkserver: 7 min 37 sec
2 tests failed:
test_logging test_socketserver
13 tests skipped:
test_devpoll test_ioctl test_kqueue test_msilib test_ossaudiodev
test_startfile test_tix test_tk test_ttk_guionly test_winconsoleio
test_winreg test_winsound test_zipfile64
2 re-run tests:
test_logging test_socketserver
Total duration: 55 min 14 sec
Captured traceback
==================
Traceback (most recent call last):
File "/home/buildbot/buildarea/3.x.cstratak-fedora-stable-x86_64.refleak/build/Lib/multiprocessing/util.py", line 300, in _run_finalizers
finalizer()
File "/home/buildbot/buildarea/3.x.cstratak-fedora-stable-x86_64.refleak/build/Lib/multiprocessing/util.py", line 224, in __call__
res = self._callback(*self._args, **self._kwargs)
File "/home/buildbot/buildarea/3.x.cstratak-fedora-stable-x86_64.refleak/build/Lib/multiprocessing/synchronize.py", line 87, in _cleanup
sem_unlink(name)
FileNotFoundError: [Errno 2] No such file or directory
Traceback (most recent call last):
File "/home/buildbot/buildarea/3.x.cstratak-fedora-stable-x86_64.refleak/build/Lib/multiprocessing/util.py", line 300, in _run_finalizers
finalizer()
File "/home/buildbot/buildarea/3.x.cstratak-fedora-stable-x86_64.refleak/build/Lib/multiprocessing/util.py", line 224, in __call__
res = self._callback(*self._args, **self._kwargs)
File "/home/buildbot/buildarea/3.x.cstratak-fedora-stable-x86_64.refleak/build/Lib/multiprocessing/synchronize.py", line 87, in _cleanup
sem_unlink(name)
FileNotFoundError: [Errno 2] No such file or directory
Traceback (most recent call last):
File "/home/buildbot/buildarea/3.x.cstratak-fedora-stable-x86_64.refleak/build/Lib/multiprocessing/util.py", line 300, in _run_finalizers
finalizer()
File "/home/buildbot/buildarea/3.x.cstratak-fedora-stable-x86_64.refleak/build/Lib/multiprocessing/util.py", line 224, in __call__
res = self._callback(*self._args, **self._kwargs)
File "/home/buildbot/buildarea/3.x.cstratak-fedora-stable-x86_64.refleak/build/Lib/multiprocessing/synchronize.py", line 87, in _cleanup
sem_unlink(name)
FileNotFoundError: [Errno 2] No such file or directory
Traceback (most recent call last):
File "/home/buildbot/buildarea/3.x.cstratak-fedora-stable-x86_64.refleak/build/Lib/multiprocessing/util.py", line 300, in _run_finalizers
finalizer()
File "/home/buildbot/buildarea/3.x.cstratak-fedora-stable-x86_64.refleak/build/Lib/multiprocessing/util.py", line 224, in __call__
res = self._callback(*self._args, **self._kwargs)
File "/home/buildbot/buildarea/3.x.cstratak-fedora-stable-x86_64.refleak/build/Lib/multiprocessing/synchronize.py", line 87, in _cleanup
sem_unlink(name)
FileNotFoundError: [Errno 2] No such file or directory
Traceback (most recent call last):
File "/home/buildbot/buildarea/3.x.cstratak-fedora-stable-x86_64.refleak/build/Lib/multiprocessing/util.py", line 300, in _run_finalizers
finalizer()
File "/home/buildbot/buildarea/3.x.cstratak-fedora-stable-x86_64.refleak/build/Lib/multiprocessing/util.py", line 224, in __call__
res = self._callback(*self._args, **self._kwargs)
File "/home/buildbot/buildarea/3.x.cstratak-fedora-stable-x86_64.refleak/build/Lib/multiprocessing/synchronize.py", line 87, in _cleanup
sem_unlink(name)
FileNotFoundError: [Errno 2] No such file or directory
Traceback (most recent call last):
File "/home/buildbot/buildarea/3.x.cstratak-fedora-stable-x86_64.refleak/build/Lib/multiprocessing/util.py", line 300, in _run_finalizers
finalizer()
File "/home/buildbot/buildarea/3.x.cstratak-fedora-stable-x86_64.refleak/build/Lib/multiprocessing/util.py", line 224, in __call__
res = self._callback(*self._args, **self._kwargs)
File "/home/buildbot/buildarea/3.x.cstratak-fedora-stable-x86_64.refleak/build/Lib/multiprocessing/synchronize.py", line 87, in _cleanup
sem_unlink(name)
FileNotFoundError: [Errno 2] No such file or directory
./home/buildbot/buildarea/3.x.cstratak-fedora-stable-x86_64.refleak/build/Lib/multiprocessing/resource_tracker.py:216: UserWarning: resource_tracker: There appear to be 6 leaked semaphore objects to clean up at shutdown
warnings.warn('resource_tracker: There appear to be %d '
Traceback (most recent call last):
File "/home/buildbot/buildarea/3.x.cstratak-fedora-stable-x86_64.refleak/build/Lib/multiprocessing/util.py", line 300, in _run_finalizers
finalizer()
File "/home/buildbot/buildarea/3.x.cstratak-fedora-stable-x86_64.refleak/build/Lib/multiprocessing/util.py", line 224, in __call__
res = self._callback(*self._args, **self._kwargs)
File "/home/buildbot/buildarea/3.x.cstratak-fedora-stable-x86_64.refleak/build/Lib/multiprocessing/synchronize.py", line 87, in _cleanup
sem_unlink(name)
FileNotFoundError: [Errno 2] No such file or directory
Traceback (most recent call last):
File "/home/buildbot/buildarea/3.x.cstratak-fedora-stable-x86_64.refleak/build/Lib/multiprocessing/util.py", line 300, in _run_finalizers
finalizer()
File "/home/buildbot/buildarea/3.x.cstratak-fedora-stable-x86_64.refleak/build/Lib/multiprocessing/util.py", line 224, in __call__
res = self._callback(*self._args, **self._kwargs)
File "/home/buildbot/buildarea/3.x.cstratak-fedora-stable-x86_64.refleak/build/Lib/multiprocessing/synchronize.py", line 87, in _cleanup
sem_unlink(name)
FileNotFoundError: [Errno 2] No such file or directory
Traceback (most recent call last):
File "/home/buildbot/buildarea/3.x.cstratak-fedora-stable-x86_64.refleak/build/Lib/multiprocessing/util.py", line 300, in _run_finalizers
finalizer()
File "/home/buildbot/buildarea/3.x.cstratak-fedora-stable-x86_64.refleak/build/Lib/multiprocessing/util.py", line 224, in __call__
res = self._callback(*self._args, **self._kwargs)
File "/home/buildbot/buildarea/3.x.cstratak-fedora-stable-x86_64.refleak/build/Lib/multiprocessing/synchronize.py", line 87, in _cleanup
sem_unlink(name)
FileNotFoundError: [Errno 2] No such file or directory
Traceback (most recent call last):
File "/home/buildbot/buildarea/3.x.cstratak-fedora-stable-x86_64.refleak/build/Lib/multiprocessing/util.py", line 300, in _run_finalizers
finalizer()
File "/home/buildbot/buildarea/3.x.cstratak-fedora-stable-x86_64.refleak/build/Lib/multiprocessing/util.py", line 224, in __call__
res = self._callback(*self._args, **self._kwargs)
File "/home/buildbot/buildarea/3.x.cstratak-fedora-stable-x86_64.refleak/build/Lib/multiprocessing/synchronize.py", line 87, in _cleanup
sem_unlink(name)
FileNotFoundError: [Errno 2] No such file or directory
Traceback (most recent call last):
File "/home/buildbot/buildarea/3.x.cstratak-fedora-stable-x86_64.refleak/build/Lib/multiprocessing/util.py", line 300, in _run_finalizers
finalizer()
File "/home/buildbot/buildarea/3.x.cstratak-fedora-stable-x86_64.refleak/build/Lib/multiprocessing/util.py", line 224, in __call__
res = self._callback(*self._args, **self._kwargs)
File "/home/buildbot/buildarea/3.x.cstratak-fedora-stable-x86_64.refleak/build/Lib/multiprocessing/synchronize.py", line 87, in _cleanup
sem_unlink(name)
FileNotFoundError: [Errno 2] No such file or directory
Traceback (most recent call last):
File "/home/buildbot/buildarea/3.x.cstratak-fedora-stable-x86_64.refleak/build/Lib/multiprocessing/util.py", line 300, in _run_finalizers
finalizer()
File "/home/buildbot/buildarea/3.x.cstratak-fedora-stable-x86_64.refleak/build/Lib/multiprocessing/util.py", line 224, in __call__
res = self._callback(*self._args, **self._kwargs)
File "/home/buildbot/buildarea/3.x.cstratak-fedora-stable-x86_64.refleak/build/Lib/multiprocessing/synchronize.py", line 87, in _cleanup
sem_unlink(name)
FileNotFoundError: [Errno 2] No such file or directory
./home/buildbot/buildarea/3.x.cstratak-fedora-stable-x86_64.refleak/build/Lib/multiprocessing/resource_tracker.py:216: UserWarning: resource_tracker: There appear to be 6 leaked semaphore objects to clean up at shutdown
warnings.warn('resource_tracker: There appear to be %d '
Traceback (most recent call last):
File "/home/buildbot/buildarea/3.x.cstratak-fedora-stable-x86_64.refleak/build/Lib/multiprocessing/util.py", line 300, in _run_finalizers
finalizer()
File "/home/buildbot/buildarea/3.x.cstratak-fedora-stable-x86_64.refleak/build/Lib/multiprocessing/util.py", line 224, in __call__
res = self._callback(*self._args, **self._kwargs)
File "/home/buildbot/buildarea/3.x.cstratak-fedora-stable-x86_64.refleak/build/Lib/multiprocessing/synchronize.py", line 87, in _cleanup
sem_unlink(name)
FileNotFoundError: [Errno 2] No such file or directory
Traceback (most recent call last):
File "/home/buildbot/buildarea/3.x.cstratak-fedora-stable-x86_64.refleak/build/Lib/multiprocessing/util.py", line 300, in _run_finalizers
finalizer()
File "/home/buildbot/buildarea/3.x.cstratak-fedora-stable-x86_64.refleak/build/Lib/multiprocessing/util.py", line 224, in __call__
res = self._callback(*self._args, **self._kwargs)
File "/home/buildbot/buildarea/3.x.cstratak-fedora-stable-x86_64.refleak/build/Lib/multiprocessing/synchronize.py", line 87, in _cleanup
sem_unlink(name)
FileNotFoundError: [Errno 2] No such file or directory
Traceback (most recent call last):
File "/home/buildbot/buildarea/3.x.cstratak-fedora-stable-x86_64.refleak/build/Lib/multiprocessing/util.py", line 300, in _run_finalizers
finalizer()
File "/home/buildbot/buildarea/3.x.cstratak-fedora-stable-x86_64.refleak/build/Lib/multiprocessing/util.py", line 224, in __call__
res = self._callback(*self._args, **self._kwargs)
File "/home/buildbot/buildarea/3.x.cstratak-fedora-stable-x86_64.refleak/build/Lib/multiprocessing/synchronize.py", line 87, in _cleanup
sem_unlink(name)
FileNotFoundError: [Errno 2] No such file or directory
Traceback (most recent call last):
File "/home/buildbot/buildarea/3.x.cstratak-fedora-stable-x86_64.refleak/build/Lib/multiprocessing/util.py", line 300, in _run_finalizers
finalizer()
File "/home/buildbot/buildarea/3.x.cstratak-fedora-stable-x86_64.refleak/build/Lib/multiprocessing/util.py", line 224, in __call__
res = self._callback(*self._args, **self._kwargs)
File "/home/buildbot/buildarea/3.x.cstratak-fedora-stable-x86_64.refleak/build/Lib/multiprocessing/synchronize.py", line 87, in _cleanup
sem_unlink(name)
FileNotFoundError: [Errno 2] No such file or directory
Traceback (most recent call last):
File "/home/buildbot/buildarea/3.x.cstratak-fedora-stable-x86_64.refleak/build/Lib/multiprocessing/util.py", line 300, in _run_finalizers
finalizer()
File "/home/buildbot/buildarea/3.x.cstratak-fedora-stable-x86_64.refleak/build/Lib/multiprocessing/util.py", line 224, in __call__
res = self._callback(*self._args, **self._kwargs)
File "/home/buildbot/buildarea/3.x.cstratak-fedora-stable-x86_64.refleak/build/Lib/multiprocessing/synchronize.py", line 87, in _cleanup
sem_unlink(name)
FileNotFoundError: [Errno 2] No such file or directory
Traceback (most recent call last):
File "/home/buildbot/buildarea/3.x.cstratak-fedora-stable-x86_64.refleak/build/Lib/multiprocessing/util.py", line 300, in _run_finalizers
finalizer()
File "/home/buildbot/buildarea/3.x.cstratak-fedora-stable-x86_64.refleak/build/Lib/multiprocessing/util.py", line 224, in __call__
res = self._callback(*self._args, **self._kwargs)
File "/home/buildbot/buildarea/3.x.cstratak-fedora-stable-x86_64.refleak/build/Lib/multiprocessing/synchronize.py", line 87, in _cleanup
sem_unlink(name)
FileNotFoundError: [Errno 2] No such file or directory
./home/buildbot/buildarea/3.x.cstratak-fedora-stable-x86_64.refleak/build/Lib/multiprocessing/resource_tracker.py:216: UserWarning: resource_tracker: There appear to be 6 leaked semaphore objects to clean up at shutdown
warnings.warn('resource_tracker: There appear to be %d '
Traceback (most recent call last):
File "/home/buildbot/buildarea/3.x.cstratak-fedora-stable-x86_64.refleak/build/Lib/multiprocessing/util.py", line 300, in _run_finalizers
finalizer()
File "/home/buildbot/buildarea/3.x.cstratak-fedora-stable-x86_64.refleak/build/Lib/multiprocessing/util.py", line 224, in __call__
res = self._callback(*self._args, **self._kwargs)
File "/home/buildbot/buildarea/3.x.cstratak-fedora-stable-x86_64.refleak/build/Lib/multiprocessing/synchronize.py", line 87, in _cleanup
sem_unlink(name)
FileNotFoundError: [Errno 2] No such file or directory
Traceback (most recent call last):
File "/home/buildbot/buildarea/3.x.cstratak-fedora-stable-x86_64.refleak/build/Lib/multiprocessing/util.py", line 300, in _run_finalizers
finalizer()
File "/home/buildbot/buildarea/3.x.cstratak-fedora-stable-x86_64.refleak/build/Lib/multiprocessing/util.py", line 224, in __call__
res = self._callback(*self._args, **self._kwargs)
File "/home/buildbot/buildarea/3.x.cstratak-fedora-stable-x86_64.refleak/build/Lib/multiprocessing/synchronize.py", line 87, in _cleanup
sem_unlink(name)
FileNotFoundError: [Errno 2] No such file or directory
Traceback (most recent call last):
File "/home/buildbot/buildarea/3.x.cstratak-fedora-stable-x86_64.refleak/build/Lib/multiprocessing/util.py", line 300, in _run_finalizers
finalizer()
File "/home/buildbot/buildarea/3.x.cstratak-fedora-stable-x86_64.refleak/build/Lib/multiprocessing/util.py", line 224, in __call__
res = self._callback(*self._args, **self._kwargs)
File "/home/buildbot/buildarea/3.x.cstratak-fedora-stable-x86_64.refleak/build/Lib/multiprocessing/synchronize.py", line 87, in _cleanup
sem_unlink(name)
FileNotFoundError: [Errno 2] No such file or directory
Traceback (most recent call last):
File "/home/buildbot/buildarea/3.x.cstratak-fedora-stable-x86_64.refleak/build/Lib/multiprocessing/util.py", line 300, in _run_finalizers
finalizer()
File "/home/buildbot/buildarea/3.x.cstratak-fedora-stable-x86_64.refleak/build/Lib/multiprocessing/util.py", line 224, in __call__
res = self._callback(*self._args, **self._kwargs)
File "/home/buildbot/buildarea/3.x.cstratak-fedora-stable-x86_64.refleak/build/Lib/multiprocessing/synchronize.py", line 87, in _cleanup
sem_unlink(name)
FileNotFoundError: [Errno 2] No such file or directory
Traceback (most recent call last):
File "/home/buildbot/buildarea/3.x.cstratak-fedora-stable-x86_64.refleak/build/Lib/multiprocessing/util.py", line 300, in _run_finalizers
finalizer()
File "/home/buildbot/buildarea/3.x.cstratak-fedora-stable-x86_64.refleak/build/Lib/multiprocessing/util.py", line 224, in __call__
res = self._callback(*self._args, **self._kwargs)
File "/home/buildbot/buildarea/3.x.cstratak-fedora-stable-x86_64.refleak/build/Lib/multiprocessing/synchronize.py", line 87, in _cleanup
sem_unlink(name)
FileNotFoundError: [Errno 2] No such file or directory
Traceback (most recent call last):
File "/home/buildbot/buildarea/3.x.cstratak-fedora-stable-x86_64.refleak/build/Lib/multiprocessing/util.py", line 300, in _run_finalizers
finalizer()
File "/home/buildbot/buildarea/3.x.cstratak-fedora-stable-x86_64.refleak/build/Lib/multiprocessing/util.py", line 224, in __call__
res = self._callback(*self._args, **self._kwargs)
File "/home/buildbot/buildarea/3.x.cstratak-fedora-stable-x86_64.refleak/build/Lib/multiprocessing/synchronize.py", line 87, in _cleanup
sem_unlink(name)
FileNotFoundError: [Errno 2] No such file or directory
./home/buildbot/buildarea/3.x.cstratak-fedora-stable-x86_64.refleak/build/Lib/multiprocessing/resource_tracker.py:216: UserWarning: resource_tracker: There appear to be 6 leaked semaphore objects to clean up at shutdown
warnings.warn('resource_tracker: There appear to be %d '
Traceback (most recent call last):
File "/home/buildbot/buildarea/3.x.cstratak-fedora-stable-x86_64.refleak/build/Lib/multiprocessing/util.py", line 300, in _run_finalizers
finalizer()
File "/home/buildbot/buildarea/3.x.cstratak-fedora-stable-x86_64.refleak/build/Lib/multiprocessing/util.py", line 224, in __call__
res = self._callback(*self._args, **self._kwargs)
File "/home/buildbot/buildarea/3.x.cstratak-fedora-stable-x86_64.refleak/build/Lib/multiprocessing/synchronize.py", line 87, in _cleanup
sem_unlink(name)
FileNotFoundError: [Errno 2] No such file or directory
Traceback (most recent call last):
File "/home/buildbot/buildarea/3.x.cstratak-fedora-stable-x86_64.refleak/build/Lib/multiprocessing/util.py", line 300, in _run_finalizers
finalizer()
File "/home/buildbot/buildarea/3.x.cstratak-fedora-stable-x86_64.refleak/build/Lib/multiprocessing/util.py", line 224, in __call__
res = self._callback(*self._args, **self._kwargs)
File "/home/buildbot/buildarea/3.x.cstratak-fedora-stable-x86_64.refleak/build/Lib/multiprocessing/synchronize.py", line 87, in _cleanup
sem_unlink(name)
FileNotFoundError: [Errno 2] No such file or directory
Traceback (most recent call last):
File "/home/buildbot/buildarea/3.x.cstratak-fedora-stable-x86_64.refleak/build/Lib/multiprocessing/util.py", line 300, in _run_finalizers
finalizer()
File "/home/buildbot/buildarea/3.x.cstratak-fedora-stable-x86_64.refleak/build/Lib/multiprocessing/util.py", line 224, in __call__
res = self._callback(*self._args, **self._kwargs)
File "/home/buildbot/buildarea/3.x.cstratak-fedora-stable-x86_64.refleak/build/Lib/multiprocessing/synchronize.py", line 87, in _cleanup
sem_unlink(name)
FileNotFoundError: [Errno 2] No such file or directory
Traceback (most recent call last):
File "/home/buildbot/buildarea/3.x.cstratak-fedora-stable-x86_64.refleak/build/Lib/multiprocessing/util.py", line 300, in _run_finalizers
finalizer()
File "/home/buildbot/buildarea/3.x.cstratak-fedora-stable-x86_64.refleak/build/Lib/multiprocessing/util.py", line 224, in __call__
res = self._callback(*self._args, **self._kwargs)
File "/home/buildbot/buildarea/3.x.cstratak-fedora-stable-x86_64.refleak/build/Lib/multiprocessing/synchronize.py", line 87, in _cleanup
sem_unlink(name)
FileNotFoundError: [Errno 2] No such file or directory
Traceback (most recent call last):
File "/home/buildbot/buildarea/3.x.cstratak-fedora-stable-x86_64.refleak/build/Lib/multiprocessing/util.py", line 300, in _run_finalizers
finalizer()
File "/home/buildbot/buildarea/3.x.cstratak-fedora-stable-x86_64.refleak/build/Lib/multiprocessing/util.py", line 224, in __call__
res = self._callback(*self._args, **self._kwargs)
File "/home/buildbot/buildarea/3.x.cstratak-fedora-stable-x86_64.refleak/build/Lib/multiprocessing/synchronize.py", line 87, in _cleanup
sem_unlink(name)
FileNotFoundError: [Errno 2] No such file or directory
Traceback (most recent call last):
File "/home/buildbot/buildarea/3.x.cstratak-fedora-stable-x86_64.refleak/build/Lib/multiprocessing/util.py", line 300, in _run_finalizers
finalizer()
File "/home/buildbot/buildarea/3.x.cstratak-fedora-stable-x86_64.refleak/build/Lib/multiprocessing/util.py", line 224, in __call__
res = self._callback(*self._args, **self._kwargs)
File "/home/buildbot/buildarea/3.x.cstratak-fedora-stable-x86_64.refleak/build/Lib/multiprocessing/synchronize.py", line 87, in _cleanup
sem_unlink(name)
FileNotFoundError: [Errno 2] No such file or directory
./home/buildbot/buildarea/3.x.cstratak-fedora-stable-x86_64.refleak/build/Lib/multiprocessing/resource_tracker.py:216: UserWarning: resource_tracker: There appear to be 6 leaked semaphore objects to clean up at shutdown
warnings.warn('resource_tracker: There appear to be %d '
Traceback (most recent call last):
File "/home/buildbot/buildarea/3.x.cstratak-fedora-stable-x86_64.refleak/build/Lib/multiprocessing/util.py", line 300, in _run_finalizers
finalizer()
File "/home/buildbot/buildarea/3.x.cstratak-fedora-stable-x86_64.refleak/build/Lib/multiprocessing/util.py", line 224, in __call__
res = self._callback(*self._args, **self._kwargs)
File "/home/buildbot/buildarea/3.x.cstratak-fedora-stable-x86_64.refleak/build/Lib/multiprocessing/synchronize.py", line 87, in _cleanup
sem_unlink(name)
FileNotFoundError: [Errno 2] No such file or directory
Traceback (most recent call last):
File "/home/buildbot/buildarea/3.x.cstratak-fedora-stable-x86_64.refleak/build/Lib/multiprocessing/util.py", line 300, in _run_finalizers
finalizer()
File "/home/buildbot/buildarea/3.x.cstratak-fedora-stable-x86_64.refleak/build/Lib/multiprocessing/util.py", line 224, in __call__
res = self._callback(*self._args, **self._kwargs)
File "/home/buildbot/buildarea/3.x.cstratak-fedora-stable-x86_64.refleak/build/Lib/multiprocessing/synchronize.py", line 87, in _cleanup
sem_unlink(name)
FileNotFoundError: [Errno 2] No such file or directory
Traceback (most recent call last):
File "/home/buildbot/buildarea/3.x.cstratak-fedora-stable-x86_64.refleak/build/Lib/multiprocessing/util.py", line 300, in _run_finalizers
finalizer()
File "/home/buildbot/buildarea/3.x.cstratak-fedora-stable-x86_64.refleak/build/Lib/multiprocessing/util.py", line 224, in __call__
res = self._callback(*self._args, **self._kwargs)
File "/home/buildbot/buildarea/3.x.cstratak-fedora-stable-x86_64.refleak/build/Lib/multiprocessing/synchronize.py", line 87, in _cleanup
sem_unlink(name)
FileNotFoundError: [Errno 2] No such file or directory
Traceback (most recent call last):
File "/home/buildbot/buildarea/3.x.cstratak-fedora-stable-x86_64.refleak/build/Lib/multiprocessing/util.py", line 300, in _run_finalizers
finalizer()
File "/home/buildbot/buildarea/3.x.cstratak-fedora-stable-x86_64.refleak/build/Lib/multiprocessing/util.py", line 224, in __call__
res = self._callback(*self._args, **self._kwargs)
File "/home/buildbot/buildarea/3.x.cstratak-fedora-stable-x86_64.refleak/build/Lib/multiprocessing/synchronize.py", line 87, in _cleanup
sem_unlink(name)
FileNotFoundError: [Errno 2] No such file or directory
Traceback (most recent call last):
File "/home/buildbot/buildarea/3.x.cstratak-fedora-stable-x86_64.refleak/build/Lib/multiprocessing/util.py", line 300, in _run_finalizers
finalizer()
File "/home/buildbot/buildarea/3.x.cstratak-fedora-stable-x86_64.refleak/build/Lib/multiprocessing/util.py", line 224, in __call__
res = self._callback(*self._args, **self._kwargs)
File "/home/buildbot/buildarea/3.x.cstratak-fedora-stable-x86_64.refleak/build/Lib/multiprocessing/synchronize.py", line 87, in _cleanup
sem_unlink(name)
FileNotFoundError: [Errno 2] No such file or directory
Traceback (most recent call last):
File "/home/buildbot/buildarea/3.x.cstratak-fedora-stable-x86_64.refleak/build/Lib/multiprocessing/util.py", line 300, in _run_finalizers
finalizer()
File "/home/buildbot/buildarea/3.x.cstratak-fedora-stable-x86_64.refleak/build/Lib/multiprocessing/util.py", line 224, in __call__
res = self._callback(*self._args, **self._kwargs)
File "/home/buildbot/buildarea/3.x.cstratak-fedora-stable-x86_64.refleak/build/Lib/multiprocessing/synchronize.py", line 87, in _cleanup
sem_unlink(name)
FileNotFoundError: [Errno 2] No such file or directory
.
Test report
===========
Failed tests:
- test_socketserver
- test_logging
Test leaking resources:
- test_logging: references
- test_socketserver: references
- test_logging: memory blocks
- test_socketserver: memory blocks
Sincerely,
-The Buildbot
1
0
Buildbot failure in Python on PPC64LE Fedora Rawhide Refleaks 3.x
by buildbot@python.org Nov. 2, 2020
by buildbot@python.org Nov. 2, 2020
Nov. 2, 2020
The Buildbot has detected a new failure on builder PPC64LE Fedora Rawhide Refleaks 3.x while building Python.
Full details are available at:
https://buildbot.python.org/all/#builders/300/builds/69
Buildbot URL: https://buildbot.python.org/all/
Worker for this Build: cstratak-fedora-rawhide-ppc64le
Build Reason: <unknown>
Blamelist:
BUILD FAILED: failed test (failure)
Summary of the results of the build (if available):
===================================================
== Tests result: FAILURE then FAILURE ==
408 tests OK.
10 slowest tests:
- test_signal: 31 min 8 sec
- test_pydoc: 29 min 44 sec
- test_asyncio: 25 min 54 sec
- test_concurrent_futures: 21 min 44 sec
- test_peg_generator: 16 min 9 sec
- test_multiprocessing_spawn: 14 min 43 sec
- test_multiprocessing_forkserver: 9 min 7 sec
- test_pickle: 6 min 47 sec
- test_lib2to3: 6 min 8 sec
- test_multiprocessing_fork: 5 min 51 sec
2 tests failed:
test_logging test_socketserver
14 tests skipped:
test_devpoll test_gdb test_ioctl test_kqueue test_msilib
test_ossaudiodev test_startfile test_tix test_tk test_ttk_guionly
test_winconsoleio test_winreg test_winsound test_zipfile64
2 re-run tests:
test_logging test_socketserver
Total duration: 51 min
Captured traceback
==================
Traceback (most recent call last):
File "/home/buildbot/buildarea/3.x.cstratak-fedora-rawhide-ppc64le.refleak/build/Lib/multiprocessing/util.py", line 300, in _run_finalizers
finalizer()
File "/home/buildbot/buildarea/3.x.cstratak-fedora-rawhide-ppc64le.refleak/build/Lib/multiprocessing/util.py", line 224, in __call__
res = self._callback(*self._args, **self._kwargs)
File "/home/buildbot/buildarea/3.x.cstratak-fedora-rawhide-ppc64le.refleak/build/Lib/multiprocessing/synchronize.py", line 87, in _cleanup
sem_unlink(name)
FileNotFoundError: [Errno 2] No such file or directory
Traceback (most recent call last):
File "/home/buildbot/buildarea/3.x.cstratak-fedora-rawhide-ppc64le.refleak/build/Lib/multiprocessing/util.py", line 300, in _run_finalizers
finalizer()
File "/home/buildbot/buildarea/3.x.cstratak-fedora-rawhide-ppc64le.refleak/build/Lib/multiprocessing/util.py", line 224, in __call__
res = self._callback(*self._args, **self._kwargs)
File "/home/buildbot/buildarea/3.x.cstratak-fedora-rawhide-ppc64le.refleak/build/Lib/multiprocessing/synchronize.py", line 87, in _cleanup
sem_unlink(name)
FileNotFoundError: [Errno 2] No such file or directory
Traceback (most recent call last):
File "/home/buildbot/buildarea/3.x.cstratak-fedora-rawhide-ppc64le.refleak/build/Lib/multiprocessing/util.py", line 300, in _run_finalizers
finalizer()
File "/home/buildbot/buildarea/3.x.cstratak-fedora-rawhide-ppc64le.refleak/build/Lib/multiprocessing/util.py", line 224, in __call__
res = self._callback(*self._args, **self._kwargs)
File "/home/buildbot/buildarea/3.x.cstratak-fedora-rawhide-ppc64le.refleak/build/Lib/multiprocessing/synchronize.py", line 87, in _cleanup
sem_unlink(name)
FileNotFoundError: [Errno 2] No such file or directory
Traceback (most recent call last):
File "/home/buildbot/buildarea/3.x.cstratak-fedora-rawhide-ppc64le.refleak/build/Lib/multiprocessing/util.py", line 300, in _run_finalizers
finalizer()
File "/home/buildbot/buildarea/3.x.cstratak-fedora-rawhide-ppc64le.refleak/build/Lib/multiprocessing/util.py", line 224, in __call__
res = self._callback(*self._args, **self._kwargs)
File "/home/buildbot/buildarea/3.x.cstratak-fedora-rawhide-ppc64le.refleak/build/Lib/multiprocessing/synchronize.py", line 87, in _cleanup
sem_unlink(name)
FileNotFoundError: [Errno 2] No such file or directory
Traceback (most recent call last):
File "/home/buildbot/buildarea/3.x.cstratak-fedora-rawhide-ppc64le.refleak/build/Lib/multiprocessing/util.py", line 300, in _run_finalizers
finalizer()
File "/home/buildbot/buildarea/3.x.cstratak-fedora-rawhide-ppc64le.refleak/build/Lib/multiprocessing/util.py", line 224, in __call__
res = self._callback(*self._args, **self._kwargs)
File "/home/buildbot/buildarea/3.x.cstratak-fedora-rawhide-ppc64le.refleak/build/Lib/multiprocessing/synchronize.py", line 87, in _cleanup
sem_unlink(name)
FileNotFoundError: [Errno 2] No such file or directory
Traceback (most recent call last):
File "/home/buildbot/buildarea/3.x.cstratak-fedora-rawhide-ppc64le.refleak/build/Lib/multiprocessing/util.py", line 300, in _run_finalizers
finalizer()
File "/home/buildbot/buildarea/3.x.cstratak-fedora-rawhide-ppc64le.refleak/build/Lib/multiprocessing/util.py", line 224, in __call__
res = self._callback(*self._args, **self._kwargs)
File "/home/buildbot/buildarea/3.x.cstratak-fedora-rawhide-ppc64le.refleak/build/Lib/multiprocessing/synchronize.py", line 87, in _cleanup
sem_unlink(name)
FileNotFoundError: [Errno 2] No such file or directory
./home/buildbot/buildarea/3.x.cstratak-fedora-rawhide-ppc64le.refleak/build/Lib/multiprocessing/resource_tracker.py:216: UserWarning: resource_tracker: There appear to be 6 leaked semaphore objects to clean up at shutdown
warnings.warn('resource_tracker: There appear to be %d '
Traceback (most recent call last):
File "/home/buildbot/buildarea/3.x.cstratak-fedora-rawhide-ppc64le.refleak/build/Lib/multiprocessing/util.py", line 300, in _run_finalizers
finalizer()
File "/home/buildbot/buildarea/3.x.cstratak-fedora-rawhide-ppc64le.refleak/build/Lib/multiprocessing/util.py", line 224, in __call__
res = self._callback(*self._args, **self._kwargs)
File "/home/buildbot/buildarea/3.x.cstratak-fedora-rawhide-ppc64le.refleak/build/Lib/multiprocessing/synchronize.py", line 87, in _cleanup
sem_unlink(name)
FileNotFoundError: [Errno 2] No such file or directory
Traceback (most recent call last):
File "/home/buildbot/buildarea/3.x.cstratak-fedora-rawhide-ppc64le.refleak/build/Lib/multiprocessing/util.py", line 300, in _run_finalizers
finalizer()
File "/home/buildbot/buildarea/3.x.cstratak-fedora-rawhide-ppc64le.refleak/build/Lib/multiprocessing/util.py", line 224, in __call__
res = self._callback(*self._args, **self._kwargs)
File "/home/buildbot/buildarea/3.x.cstratak-fedora-rawhide-ppc64le.refleak/build/Lib/multiprocessing/synchronize.py", line 87, in _cleanup
sem_unlink(name)
FileNotFoundError: [Errno 2] No such file or directory
Traceback (most recent call last):
File "/home/buildbot/buildarea/3.x.cstratak-fedora-rawhide-ppc64le.refleak/build/Lib/multiprocessing/util.py", line 300, in _run_finalizers
finalizer()
File "/home/buildbot/buildarea/3.x.cstratak-fedora-rawhide-ppc64le.refleak/build/Lib/multiprocessing/util.py", line 224, in __call__
res = self._callback(*self._args, **self._kwargs)
File "/home/buildbot/buildarea/3.x.cstratak-fedora-rawhide-ppc64le.refleak/build/Lib/multiprocessing/synchronize.py", line 87, in _cleanup
sem_unlink(name)
FileNotFoundError: [Errno 2] No such file or directory
Traceback (most recent call last):
File "/home/buildbot/buildarea/3.x.cstratak-fedora-rawhide-ppc64le.refleak/build/Lib/multiprocessing/util.py", line 300, in _run_finalizers
finalizer()
File "/home/buildbot/buildarea/3.x.cstratak-fedora-rawhide-ppc64le.refleak/build/Lib/multiprocessing/util.py", line 224, in __call__
res = self._callback(*self._args, **self._kwargs)
File "/home/buildbot/buildarea/3.x.cstratak-fedora-rawhide-ppc64le.refleak/build/Lib/multiprocessing/synchronize.py", line 87, in _cleanup
sem_unlink(name)
FileNotFoundError: [Errno 2] No such file or directory
Traceback (most recent call last):
File "/home/buildbot/buildarea/3.x.cstratak-fedora-rawhide-ppc64le.refleak/build/Lib/multiprocessing/util.py", line 300, in _run_finalizers
finalizer()
File "/home/buildbot/buildarea/3.x.cstratak-fedora-rawhide-ppc64le.refleak/build/Lib/multiprocessing/util.py", line 224, in __call__
res = self._callback(*self._args, **self._kwargs)
File "/home/buildbot/buildarea/3.x.cstratak-fedora-rawhide-ppc64le.refleak/build/Lib/multiprocessing/synchronize.py", line 87, in _cleanup
sem_unlink(name)
FileNotFoundError: [Errno 2] No such file or directory
Traceback (most recent call last):
File "/home/buildbot/buildarea/3.x.cstratak-fedora-rawhide-ppc64le.refleak/build/Lib/multiprocessing/util.py", line 300, in _run_finalizers
finalizer()
File "/home/buildbot/buildarea/3.x.cstratak-fedora-rawhide-ppc64le.refleak/build/Lib/multiprocessing/util.py", line 224, in __call__
res = self._callback(*self._args, **self._kwargs)
File "/home/buildbot/buildarea/3.x.cstratak-fedora-rawhide-ppc64le.refleak/build/Lib/multiprocessing/synchronize.py", line 87, in _cleanup
sem_unlink(name)
FileNotFoundError: [Errno 2] No such file or directory
./home/buildbot/buildarea/3.x.cstratak-fedora-rawhide-ppc64le.refleak/build/Lib/multiprocessing/resource_tracker.py:216: UserWarning: resource_tracker: There appear to be 6 leaked semaphore objects to clean up at shutdown
warnings.warn('resource_tracker: There appear to be %d '
Traceback (most recent call last):
File "/home/buildbot/buildarea/3.x.cstratak-fedora-rawhide-ppc64le.refleak/build/Lib/multiprocessing/util.py", line 300, in _run_finalizers
finalizer()
File "/home/buildbot/buildarea/3.x.cstratak-fedora-rawhide-ppc64le.refleak/build/Lib/multiprocessing/util.py", line 224, in __call__
res = self._callback(*self._args, **self._kwargs)
File "/home/buildbot/buildarea/3.x.cstratak-fedora-rawhide-ppc64le.refleak/build/Lib/multiprocessing/synchronize.py", line 87, in _cleanup
sem_unlink(name)
FileNotFoundError: [Errno 2] No such file or directory
Traceback (most recent call last):
File "/home/buildbot/buildarea/3.x.cstratak-fedora-rawhide-ppc64le.refleak/build/Lib/multiprocessing/util.py", line 300, in _run_finalizers
finalizer()
File "/home/buildbot/buildarea/3.x.cstratak-fedora-rawhide-ppc64le.refleak/build/Lib/multiprocessing/util.py", line 224, in __call__
res = self._callback(*self._args, **self._kwargs)
File "/home/buildbot/buildarea/3.x.cstratak-fedora-rawhide-ppc64le.refleak/build/Lib/multiprocessing/synchronize.py", line 87, in _cleanup
sem_unlink(name)
FileNotFoundError: [Errno 2] No such file or directory
Traceback (most recent call last):
File "/home/buildbot/buildarea/3.x.cstratak-fedora-rawhide-ppc64le.refleak/build/Lib/multiprocessing/util.py", line 300, in _run_finalizers
finalizer()
File "/home/buildbot/buildarea/3.x.cstratak-fedora-rawhide-ppc64le.refleak/build/Lib/multiprocessing/util.py", line 224, in __call__
res = self._callback(*self._args, **self._kwargs)
File "/home/buildbot/buildarea/3.x.cstratak-fedora-rawhide-ppc64le.refleak/build/Lib/multiprocessing/synchronize.py", line 87, in _cleanup
sem_unlink(name)
FileNotFoundError: [Errno 2] No such file or directory
Traceback (most recent call last):
File "/home/buildbot/buildarea/3.x.cstratak-fedora-rawhide-ppc64le.refleak/build/Lib/multiprocessing/util.py", line 300, in _run_finalizers
finalizer()
File "/home/buildbot/buildarea/3.x.cstratak-fedora-rawhide-ppc64le.refleak/build/Lib/multiprocessing/util.py", line 224, in __call__
res = self._callback(*self._args, **self._kwargs)
File "/home/buildbot/buildarea/3.x.cstratak-fedora-rawhide-ppc64le.refleak/build/Lib/multiprocessing/synchronize.py", line 87, in _cleanup
sem_unlink(name)
FileNotFoundError: [Errno 2] No such file or directory
Traceback (most recent call last):
File "/home/buildbot/buildarea/3.x.cstratak-fedora-rawhide-ppc64le.refleak/build/Lib/multiprocessing/util.py", line 300, in _run_finalizers
finalizer()
File "/home/buildbot/buildarea/3.x.cstratak-fedora-rawhide-ppc64le.refleak/build/Lib/multiprocessing/util.py", line 224, in __call__
res = self._callback(*self._args, **self._kwargs)
File "/home/buildbot/buildarea/3.x.cstratak-fedora-rawhide-ppc64le.refleak/build/Lib/multiprocessing/synchronize.py", line 87, in _cleanup
sem_unlink(name)
FileNotFoundError: [Errno 2] No such file or directory
Traceback (most recent call last):
File "/home/buildbot/buildarea/3.x.cstratak-fedora-rawhide-ppc64le.refleak/build/Lib/multiprocessing/util.py", line 300, in _run_finalizers
finalizer()
File "/home/buildbot/buildarea/3.x.cstratak-fedora-rawhide-ppc64le.refleak/build/Lib/multiprocessing/util.py", line 224, in __call__
res = self._callback(*self._args, **self._kwargs)
File "/home/buildbot/buildarea/3.x.cstratak-fedora-rawhide-ppc64le.refleak/build/Lib/multiprocessing/synchronize.py", line 87, in _cleanup
sem_unlink(name)
FileNotFoundError: [Errno 2] No such file or directory
./home/buildbot/buildarea/3.x.cstratak-fedora-rawhide-ppc64le.refleak/build/Lib/multiprocessing/resource_tracker.py:216: UserWarning: resource_tracker: There appear to be 6 leaked semaphore objects to clean up at shutdown
warnings.warn('resource_tracker: There appear to be %d '
Traceback (most recent call last):
File "/home/buildbot/buildarea/3.x.cstratak-fedora-rawhide-ppc64le.refleak/build/Lib/multiprocessing/util.py", line 300, in _run_finalizers
finalizer()
File "/home/buildbot/buildarea/3.x.cstratak-fedora-rawhide-ppc64le.refleak/build/Lib/multiprocessing/util.py", line 224, in __call__
res = self._callback(*self._args, **self._kwargs)
File "/home/buildbot/buildarea/3.x.cstratak-fedora-rawhide-ppc64le.refleak/build/Lib/multiprocessing/synchronize.py", line 87, in _cleanup
sem_unlink(name)
FileNotFoundError: [Errno 2] No such file or directory
Traceback (most recent call last):
File "/home/buildbot/buildarea/3.x.cstratak-fedora-rawhide-ppc64le.refleak/build/Lib/multiprocessing/util.py", line 300, in _run_finalizers
finalizer()
File "/home/buildbot/buildarea/3.x.cstratak-fedora-rawhide-ppc64le.refleak/build/Lib/multiprocessing/util.py", line 224, in __call__
res = self._callback(*self._args, **self._kwargs)
File "/home/buildbot/buildarea/3.x.cstratak-fedora-rawhide-ppc64le.refleak/build/Lib/multiprocessing/synchronize.py", line 87, in _cleanup
sem_unlink(name)
FileNotFoundError: [Errno 2] No such file or directory
Traceback (most recent call last):
File "/home/buildbot/buildarea/3.x.cstratak-fedora-rawhide-ppc64le.refleak/build/Lib/multiprocessing/util.py", line 300, in _run_finalizers
finalizer()
File "/home/buildbot/buildarea/3.x.cstratak-fedora-rawhide-ppc64le.refleak/build/Lib/multiprocessing/util.py", line 224, in __call__
res = self._callback(*self._args, **self._kwargs)
File "/home/buildbot/buildarea/3.x.cstratak-fedora-rawhide-ppc64le.refleak/build/Lib/multiprocessing/synchronize.py", line 87, in _cleanup
sem_unlink(name)
FileNotFoundError: [Errno 2] No such file or directory
Traceback (most recent call last):
File "/home/buildbot/buildarea/3.x.cstratak-fedora-rawhide-ppc64le.refleak/build/Lib/multiprocessing/util.py", line 300, in _run_finalizers
finalizer()
File "/home/buildbot/buildarea/3.x.cstratak-fedora-rawhide-ppc64le.refleak/build/Lib/multiprocessing/util.py", line 224, in __call__
res = self._callback(*self._args, **self._kwargs)
File "/home/buildbot/buildarea/3.x.cstratak-fedora-rawhide-ppc64le.refleak/build/Lib/multiprocessing/synchronize.py", line 87, in _cleanup
sem_unlink(name)
FileNotFoundError: [Errno 2] No such file or directory
Traceback (most recent call last):
File "/home/buildbot/buildarea/3.x.cstratak-fedora-rawhide-ppc64le.refleak/build/Lib/multiprocessing/util.py", line 300, in _run_finalizers
finalizer()
File "/home/buildbot/buildarea/3.x.cstratak-fedora-rawhide-ppc64le.refleak/build/Lib/multiprocessing/util.py", line 224, in __call__
res = self._callback(*self._args, **self._kwargs)
File "/home/buildbot/buildarea/3.x.cstratak-fedora-rawhide-ppc64le.refleak/build/Lib/multiprocessing/synchronize.py", line 87, in _cleanup
sem_unlink(name)
FileNotFoundError: [Errno 2] No such file or directory
Traceback (most recent call last):
File "/home/buildbot/buildarea/3.x.cstratak-fedora-rawhide-ppc64le.refleak/build/Lib/multiprocessing/util.py", line 300, in _run_finalizers
finalizer()
File "/home/buildbot/buildarea/3.x.cstratak-fedora-rawhide-ppc64le.refleak/build/Lib/multiprocessing/util.py", line 224, in __call__
res = self._callback(*self._args, **self._kwargs)
File "/home/buildbot/buildarea/3.x.cstratak-fedora-rawhide-ppc64le.refleak/build/Lib/multiprocessing/synchronize.py", line 87, in _cleanup
sem_unlink(name)
FileNotFoundError: [Errno 2] No such file or directory
./home/buildbot/buildarea/3.x.cstratak-fedora-rawhide-ppc64le.refleak/build/Lib/multiprocessing/resource_tracker.py:216: UserWarning: resource_tracker: There appear to be 6 leaked semaphore objects to clean up at shutdown
warnings.warn('resource_tracker: There appear to be %d '
Traceback (most recent call last):
File "/home/buildbot/buildarea/3.x.cstratak-fedora-rawhide-ppc64le.refleak/build/Lib/multiprocessing/util.py", line 300, in _run_finalizers
finalizer()
File "/home/buildbot/buildarea/3.x.cstratak-fedora-rawhide-ppc64le.refleak/build/Lib/multiprocessing/util.py", line 224, in __call__
res = self._callback(*self._args, **self._kwargs)
File "/home/buildbot/buildarea/3.x.cstratak-fedora-rawhide-ppc64le.refleak/build/Lib/multiprocessing/synchronize.py", line 87, in _cleanup
sem_unlink(name)
FileNotFoundError: [Errno 2] No such file or directory
Traceback (most recent call last):
File "/home/buildbot/buildarea/3.x.cstratak-fedora-rawhide-ppc64le.refleak/build/Lib/multiprocessing/util.py", line 300, in _run_finalizers
finalizer()
File "/home/buildbot/buildarea/3.x.cstratak-fedora-rawhide-ppc64le.refleak/build/Lib/multiprocessing/util.py", line 224, in __call__
res = self._callback(*self._args, **self._kwargs)
File "/home/buildbot/buildarea/3.x.cstratak-fedora-rawhide-ppc64le.refleak/build/Lib/multiprocessing/synchronize.py", line 87, in _cleanup
sem_unlink(name)
FileNotFoundError: [Errno 2] No such file or directory
Traceback (most recent call last):
File "/home/buildbot/buildarea/3.x.cstratak-fedora-rawhide-ppc64le.refleak/build/Lib/multiprocessing/util.py", line 300, in _run_finalizers
finalizer()
File "/home/buildbot/buildarea/3.x.cstratak-fedora-rawhide-ppc64le.refleak/build/Lib/multiprocessing/util.py", line 224, in __call__
res = self._callback(*self._args, **self._kwargs)
File "/home/buildbot/buildarea/3.x.cstratak-fedora-rawhide-ppc64le.refleak/build/Lib/multiprocessing/synchronize.py", line 87, in _cleanup
sem_unlink(name)
FileNotFoundError: [Errno 2] No such file or directory
Traceback (most recent call last):
File "/home/buildbot/buildarea/3.x.cstratak-fedora-rawhide-ppc64le.refleak/build/Lib/multiprocessing/util.py", line 300, in _run_finalizers
finalizer()
File "/home/buildbot/buildarea/3.x.cstratak-fedora-rawhide-ppc64le.refleak/build/Lib/multiprocessing/util.py", line 224, in __call__
res = self._callback(*self._args, **self._kwargs)
File "/home/buildbot/buildarea/3.x.cstratak-fedora-rawhide-ppc64le.refleak/build/Lib/multiprocessing/synchronize.py", line 87, in _cleanup
sem_unlink(name)
FileNotFoundError: [Errno 2] No such file or directory
Traceback (most recent call last):
File "/home/buildbot/buildarea/3.x.cstratak-fedora-rawhide-ppc64le.refleak/build/Lib/multiprocessing/util.py", line 300, in _run_finalizers
finalizer()
File "/home/buildbot/buildarea/3.x.cstratak-fedora-rawhide-ppc64le.refleak/build/Lib/multiprocessing/util.py", line 224, in __call__
res = self._callback(*self._args, **self._kwargs)
File "/home/buildbot/buildarea/3.x.cstratak-fedora-rawhide-ppc64le.refleak/build/Lib/multiprocessing/synchronize.py", line 87, in _cleanup
sem_unlink(name)
FileNotFoundError: [Errno 2] No such file or directory
Traceback (most recent call last):
File "/home/buildbot/buildarea/3.x.cstratak-fedora-rawhide-ppc64le.refleak/build/Lib/multiprocessing/util.py", line 300, in _run_finalizers
finalizer()
File "/home/buildbot/buildarea/3.x.cstratak-fedora-rawhide-ppc64le.refleak/build/Lib/multiprocessing/util.py", line 224, in __call__
res = self._callback(*self._args, **self._kwargs)
File "/home/buildbot/buildarea/3.x.cstratak-fedora-rawhide-ppc64le.refleak/build/Lib/multiprocessing/synchronize.py", line 87, in _cleanup
sem_unlink(name)
FileNotFoundError: [Errno 2] No such file or directory
./home/buildbot/buildarea/3.x.cstratak-fedora-rawhide-ppc64le.refleak/build/Lib/multiprocessing/resource_tracker.py:216: UserWarning: resource_tracker: There appear to be 6 leaked semaphore objects to clean up at shutdown
warnings.warn('resource_tracker: There appear to be %d '
Traceback (most recent call last):
File "/home/buildbot/buildarea/3.x.cstratak-fedora-rawhide-ppc64le.refleak/build/Lib/multiprocessing/util.py", line 300, in _run_finalizers
finalizer()
File "/home/buildbot/buildarea/3.x.cstratak-fedora-rawhide-ppc64le.refleak/build/Lib/multiprocessing/util.py", line 224, in __call__
res = self._callback(*self._args, **self._kwargs)
File "/home/buildbot/buildarea/3.x.cstratak-fedora-rawhide-ppc64le.refleak/build/Lib/multiprocessing/synchronize.py", line 87, in _cleanup
sem_unlink(name)
FileNotFoundError: [Errno 2] No such file or directory
Traceback (most recent call last):
File "/home/buildbot/buildarea/3.x.cstratak-fedora-rawhide-ppc64le.refleak/build/Lib/multiprocessing/util.py", line 300, in _run_finalizers
finalizer()
File "/home/buildbot/buildarea/3.x.cstratak-fedora-rawhide-ppc64le.refleak/build/Lib/multiprocessing/util.py", line 224, in __call__
res = self._callback(*self._args, **self._kwargs)
File "/home/buildbot/buildarea/3.x.cstratak-fedora-rawhide-ppc64le.refleak/build/Lib/multiprocessing/synchronize.py", line 87, in _cleanup
sem_unlink(name)
FileNotFoundError: [Errno 2] No such file or directory
Traceback (most recent call last):
File "/home/buildbot/buildarea/3.x.cstratak-fedora-rawhide-ppc64le.refleak/build/Lib/multiprocessing/util.py", line 300, in _run_finalizers
finalizer()
File "/home/buildbot/buildarea/3.x.cstratak-fedora-rawhide-ppc64le.refleak/build/Lib/multiprocessing/util.py", line 224, in __call__
res = self._callback(*self._args, **self._kwargs)
File "/home/buildbot/buildarea/3.x.cstratak-fedora-rawhide-ppc64le.refleak/build/Lib/multiprocessing/synchronize.py", line 87, in _cleanup
sem_unlink(name)
FileNotFoundError: [Errno 2] No such file or directory
Traceback (most recent call last):
File "/home/buildbot/buildarea/3.x.cstratak-fedora-rawhide-ppc64le.refleak/build/Lib/multiprocessing/util.py", line 300, in _run_finalizers
finalizer()
File "/home/buildbot/buildarea/3.x.cstratak-fedora-rawhide-ppc64le.refleak/build/Lib/multiprocessing/util.py", line 224, in __call__
res = self._callback(*self._args, **self._kwargs)
File "/home/buildbot/buildarea/3.x.cstratak-fedora-rawhide-ppc64le.refleak/build/Lib/multiprocessing/synchronize.py", line 87, in _cleanup
sem_unlink(name)
FileNotFoundError: [Errno 2] No such file or directory
Traceback (most recent call last):
File "/home/buildbot/buildarea/3.x.cstratak-fedora-rawhide-ppc64le.refleak/build/Lib/multiprocessing/util.py", line 300, in _run_finalizers
finalizer()
File "/home/buildbot/buildarea/3.x.cstratak-fedora-rawhide-ppc64le.refleak/build/Lib/multiprocessing/util.py", line 224, in __call__
res = self._callback(*self._args, **self._kwargs)
File "/home/buildbot/buildarea/3.x.cstratak-fedora-rawhide-ppc64le.refleak/build/Lib/multiprocessing/synchronize.py", line 87, in _cleanup
sem_unlink(name)
FileNotFoundError: [Errno 2] No such file or directory
Traceback (most recent call last):
File "/home/buildbot/buildarea/3.x.cstratak-fedora-rawhide-ppc64le.refleak/build/Lib/multiprocessing/util.py", line 300, in _run_finalizers
finalizer()
File "/home/buildbot/buildarea/3.x.cstratak-fedora-rawhide-ppc64le.refleak/build/Lib/multiprocessing/util.py", line 224, in __call__
res = self._callback(*self._args, **self._kwargs)
File "/home/buildbot/buildarea/3.x.cstratak-fedora-rawhide-ppc64le.refleak/build/Lib/multiprocessing/synchronize.py", line 87, in _cleanup
sem_unlink(name)
FileNotFoundError: [Errno 2] No such file or directory
.
Test report
===========
Failed tests:
- test_socketserver
- test_logging
Test leaking resources:
- test_logging: references
- test_socketserver: references
- test_logging: memory blocks
- test_socketserver: memory blocks
Sincerely,
-The Buildbot
1
0
Nov. 2, 2020
The Buildbot has detected a new failure on builder PPC64LE RHEL8 Refleaks 3.x while building Python.
Full details are available at:
https://buildbot.python.org/all/#builders/384/builds/89
Buildbot URL: https://buildbot.python.org/all/
Worker for this Build: cstratak-RHEL8-ppc64le
Build Reason: <unknown>
Blamelist:
BUILD FAILED: failed test (failure)
Summary of the results of the build (if available):
===================================================
== Tests result: FAILURE then FAILURE ==
409 tests OK.
10 slowest tests:
- test_signal: 31 min 5 sec
- test_pydoc: 29 min 44 sec
- test_concurrent_futures: 23 min 58 sec
- test_asyncio: 22 min 7 sec
- test_gdb: 19 min 22 sec
- test_peg_generator: 16 min 12 sec
- test_multiprocessing_spawn: 13 min 9 sec
- test_multiprocessing_forkserver: 8 min 27 sec
- test_lib2to3: 8 min 7 sec
- test_subprocess: 6 min 12 sec
2 tests failed:
test_logging test_socketserver
13 tests skipped:
test_devpoll test_ioctl test_kqueue test_msilib test_ossaudiodev
test_startfile test_tix test_tk test_ttk_guionly test_winconsoleio
test_winreg test_winsound test_zipfile64
2 re-run tests:
test_logging test_socketserver
Total duration: 51 min 48 sec
Captured traceback
==================
Traceback (most recent call last):
File "/home/buildbot/buildarea/3.x.cstratak-RHEL8-ppc64le.refleak/build/Lib/multiprocessing/util.py", line 300, in _run_finalizers
finalizer()
File "/home/buildbot/buildarea/3.x.cstratak-RHEL8-ppc64le.refleak/build/Lib/multiprocessing/util.py", line 224, in __call__
res = self._callback(*self._args, **self._kwargs)
File "/home/buildbot/buildarea/3.x.cstratak-RHEL8-ppc64le.refleak/build/Lib/multiprocessing/synchronize.py", line 87, in _cleanup
sem_unlink(name)
FileNotFoundError: [Errno 2] No such file or directory
Traceback (most recent call last):
File "/home/buildbot/buildarea/3.x.cstratak-RHEL8-ppc64le.refleak/build/Lib/multiprocessing/util.py", line 300, in _run_finalizers
finalizer()
File "/home/buildbot/buildarea/3.x.cstratak-RHEL8-ppc64le.refleak/build/Lib/multiprocessing/util.py", line 224, in __call__
res = self._callback(*self._args, **self._kwargs)
File "/home/buildbot/buildarea/3.x.cstratak-RHEL8-ppc64le.refleak/build/Lib/multiprocessing/synchronize.py", line 87, in _cleanup
sem_unlink(name)
FileNotFoundError: [Errno 2] No such file or directory
Traceback (most recent call last):
File "/home/buildbot/buildarea/3.x.cstratak-RHEL8-ppc64le.refleak/build/Lib/multiprocessing/util.py", line 300, in _run_finalizers
finalizer()
File "/home/buildbot/buildarea/3.x.cstratak-RHEL8-ppc64le.refleak/build/Lib/multiprocessing/util.py", line 224, in __call__
res = self._callback(*self._args, **self._kwargs)
File "/home/buildbot/buildarea/3.x.cstratak-RHEL8-ppc64le.refleak/build/Lib/multiprocessing/synchronize.py", line 87, in _cleanup
sem_unlink(name)
FileNotFoundError: [Errno 2] No such file or directory
Traceback (most recent call last):
File "/home/buildbot/buildarea/3.x.cstratak-RHEL8-ppc64le.refleak/build/Lib/multiprocessing/util.py", line 300, in _run_finalizers
finalizer()
File "/home/buildbot/buildarea/3.x.cstratak-RHEL8-ppc64le.refleak/build/Lib/multiprocessing/util.py", line 224, in __call__
res = self._callback(*self._args, **self._kwargs)
File "/home/buildbot/buildarea/3.x.cstratak-RHEL8-ppc64le.refleak/build/Lib/multiprocessing/synchronize.py", line 87, in _cleanup
sem_unlink(name)
FileNotFoundError: [Errno 2] No such file or directory
Traceback (most recent call last):
File "/home/buildbot/buildarea/3.x.cstratak-RHEL8-ppc64le.refleak/build/Lib/multiprocessing/util.py", line 300, in _run_finalizers
finalizer()
File "/home/buildbot/buildarea/3.x.cstratak-RHEL8-ppc64le.refleak/build/Lib/multiprocessing/util.py", line 224, in __call__
res = self._callback(*self._args, **self._kwargs)
File "/home/buildbot/buildarea/3.x.cstratak-RHEL8-ppc64le.refleak/build/Lib/multiprocessing/synchronize.py", line 87, in _cleanup
sem_unlink(name)
FileNotFoundError: [Errno 2] No such file or directory
Traceback (most recent call last):
File "/home/buildbot/buildarea/3.x.cstratak-RHEL8-ppc64le.refleak/build/Lib/multiprocessing/util.py", line 300, in _run_finalizers
finalizer()
File "/home/buildbot/buildarea/3.x.cstratak-RHEL8-ppc64le.refleak/build/Lib/multiprocessing/util.py", line 224, in __call__
res = self._callback(*self._args, **self._kwargs)
File "/home/buildbot/buildarea/3.x.cstratak-RHEL8-ppc64le.refleak/build/Lib/multiprocessing/synchronize.py", line 87, in _cleanup
sem_unlink(name)
FileNotFoundError: [Errno 2] No such file or directory
./home/buildbot/buildarea/3.x.cstratak-RHEL8-ppc64le.refleak/build/Lib/multiprocessing/resource_tracker.py:216: UserWarning: resource_tracker: There appear to be 6 leaked semaphore objects to clean up at shutdown
warnings.warn('resource_tracker: There appear to be %d '
Traceback (most recent call last):
File "/home/buildbot/buildarea/3.x.cstratak-RHEL8-ppc64le.refleak/build/Lib/multiprocessing/util.py", line 300, in _run_finalizers
finalizer()
File "/home/buildbot/buildarea/3.x.cstratak-RHEL8-ppc64le.refleak/build/Lib/multiprocessing/util.py", line 224, in __call__
res = self._callback(*self._args, **self._kwargs)
File "/home/buildbot/buildarea/3.x.cstratak-RHEL8-ppc64le.refleak/build/Lib/multiprocessing/synchronize.py", line 87, in _cleanup
sem_unlink(name)
FileNotFoundError: [Errno 2] No such file or directory
Traceback (most recent call last):
File "/home/buildbot/buildarea/3.x.cstratak-RHEL8-ppc64le.refleak/build/Lib/multiprocessing/util.py", line 300, in _run_finalizers
finalizer()
File "/home/buildbot/buildarea/3.x.cstratak-RHEL8-ppc64le.refleak/build/Lib/multiprocessing/util.py", line 224, in __call__
res = self._callback(*self._args, **self._kwargs)
File "/home/buildbot/buildarea/3.x.cstratak-RHEL8-ppc64le.refleak/build/Lib/multiprocessing/synchronize.py", line 87, in _cleanup
sem_unlink(name)
FileNotFoundError: [Errno 2] No such file or directory
Traceback (most recent call last):
File "/home/buildbot/buildarea/3.x.cstratak-RHEL8-ppc64le.refleak/build/Lib/multiprocessing/util.py", line 300, in _run_finalizers
finalizer()
File "/home/buildbot/buildarea/3.x.cstratak-RHEL8-ppc64le.refleak/build/Lib/multiprocessing/util.py", line 224, in __call__
res = self._callback(*self._args, **self._kwargs)
File "/home/buildbot/buildarea/3.x.cstratak-RHEL8-ppc64le.refleak/build/Lib/multiprocessing/synchronize.py", line 87, in _cleanup
sem_unlink(name)
FileNotFoundError: [Errno 2] No such file or directory
Traceback (most recent call last):
File "/home/buildbot/buildarea/3.x.cstratak-RHEL8-ppc64le.refleak/build/Lib/multiprocessing/util.py", line 300, in _run_finalizers
finalizer()
File "/home/buildbot/buildarea/3.x.cstratak-RHEL8-ppc64le.refleak/build/Lib/multiprocessing/util.py", line 224, in __call__
res = self._callback(*self._args, **self._kwargs)
File "/home/buildbot/buildarea/3.x.cstratak-RHEL8-ppc64le.refleak/build/Lib/multiprocessing/synchronize.py", line 87, in _cleanup
sem_unlink(name)
FileNotFoundError: [Errno 2] No such file or directory
Traceback (most recent call last):
File "/home/buildbot/buildarea/3.x.cstratak-RHEL8-ppc64le.refleak/build/Lib/multiprocessing/util.py", line 300, in _run_finalizers
finalizer()
File "/home/buildbot/buildarea/3.x.cstratak-RHEL8-ppc64le.refleak/build/Lib/multiprocessing/util.py", line 224, in __call__
res = self._callback(*self._args, **self._kwargs)
File "/home/buildbot/buildarea/3.x.cstratak-RHEL8-ppc64le.refleak/build/Lib/multiprocessing/synchronize.py", line 87, in _cleanup
sem_unlink(name)
FileNotFoundError: [Errno 2] No such file or directory
Traceback (most recent call last):
File "/home/buildbot/buildarea/3.x.cstratak-RHEL8-ppc64le.refleak/build/Lib/multiprocessing/util.py", line 300, in _run_finalizers
finalizer()
File "/home/buildbot/buildarea/3.x.cstratak-RHEL8-ppc64le.refleak/build/Lib/multiprocessing/util.py", line 224, in __call__
res = self._callback(*self._args, **self._kwargs)
File "/home/buildbot/buildarea/3.x.cstratak-RHEL8-ppc64le.refleak/build/Lib/multiprocessing/synchronize.py", line 87, in _cleanup
sem_unlink(name)
FileNotFoundError: [Errno 2] No such file or directory
./home/buildbot/buildarea/3.x.cstratak-RHEL8-ppc64le.refleak/build/Lib/multiprocessing/resource_tracker.py:216: UserWarning: resource_tracker: There appear to be 6 leaked semaphore objects to clean up at shutdown
warnings.warn('resource_tracker: There appear to be %d '
Traceback (most recent call last):
File "/home/buildbot/buildarea/3.x.cstratak-RHEL8-ppc64le.refleak/build/Lib/multiprocessing/util.py", line 300, in _run_finalizers
finalizer()
File "/home/buildbot/buildarea/3.x.cstratak-RHEL8-ppc64le.refleak/build/Lib/multiprocessing/util.py", line 224, in __call__
res = self._callback(*self._args, **self._kwargs)
File "/home/buildbot/buildarea/3.x.cstratak-RHEL8-ppc64le.refleak/build/Lib/multiprocessing/synchronize.py", line 87, in _cleanup
sem_unlink(name)
FileNotFoundError: [Errno 2] No such file or directory
Traceback (most recent call last):
File "/home/buildbot/buildarea/3.x.cstratak-RHEL8-ppc64le.refleak/build/Lib/multiprocessing/util.py", line 300, in _run_finalizers
finalizer()
File "/home/buildbot/buildarea/3.x.cstratak-RHEL8-ppc64le.refleak/build/Lib/multiprocessing/util.py", line 224, in __call__
res = self._callback(*self._args, **self._kwargs)
File "/home/buildbot/buildarea/3.x.cstratak-RHEL8-ppc64le.refleak/build/Lib/multiprocessing/synchronize.py", line 87, in _cleanup
sem_unlink(name)
FileNotFoundError: [Errno 2] No such file or directory
Traceback (most recent call last):
File "/home/buildbot/buildarea/3.x.cstratak-RHEL8-ppc64le.refleak/build/Lib/multiprocessing/util.py", line 300, in _run_finalizers
finalizer()
File "/home/buildbot/buildarea/3.x.cstratak-RHEL8-ppc64le.refleak/build/Lib/multiprocessing/util.py", line 224, in __call__
res = self._callback(*self._args, **self._kwargs)
File "/home/buildbot/buildarea/3.x.cstratak-RHEL8-ppc64le.refleak/build/Lib/multiprocessing/synchronize.py", line 87, in _cleanup
sem_unlink(name)
FileNotFoundError: [Errno 2] No such file or directory
Traceback (most recent call last):
File "/home/buildbot/buildarea/3.x.cstratak-RHEL8-ppc64le.refleak/build/Lib/multiprocessing/util.py", line 300, in _run_finalizers
finalizer()
File "/home/buildbot/buildarea/3.x.cstratak-RHEL8-ppc64le.refleak/build/Lib/multiprocessing/util.py", line 224, in __call__
res = self._callback(*self._args, **self._kwargs)
File "/home/buildbot/buildarea/3.x.cstratak-RHEL8-ppc64le.refleak/build/Lib/multiprocessing/synchronize.py", line 87, in _cleanup
sem_unlink(name)
FileNotFoundError: [Errno 2] No such file or directory
Traceback (most recent call last):
File "/home/buildbot/buildarea/3.x.cstratak-RHEL8-ppc64le.refleak/build/Lib/multiprocessing/util.py", line 300, in _run_finalizers
finalizer()
File "/home/buildbot/buildarea/3.x.cstratak-RHEL8-ppc64le.refleak/build/Lib/multiprocessing/util.py", line 224, in __call__
res = self._callback(*self._args, **self._kwargs)
File "/home/buildbot/buildarea/3.x.cstratak-RHEL8-ppc64le.refleak/build/Lib/multiprocessing/synchronize.py", line 87, in _cleanup
sem_unlink(name)
FileNotFoundError: [Errno 2] No such file or directory
Traceback (most recent call last):
File "/home/buildbot/buildarea/3.x.cstratak-RHEL8-ppc64le.refleak/build/Lib/multiprocessing/util.py", line 300, in _run_finalizers
finalizer()
File "/home/buildbot/buildarea/3.x.cstratak-RHEL8-ppc64le.refleak/build/Lib/multiprocessing/util.py", line 224, in __call__
res = self._callback(*self._args, **self._kwargs)
File "/home/buildbot/buildarea/3.x.cstratak-RHEL8-ppc64le.refleak/build/Lib/multiprocessing/synchronize.py", line 87, in _cleanup
sem_unlink(name)
FileNotFoundError: [Errno 2] No such file or directory
./home/buildbot/buildarea/3.x.cstratak-RHEL8-ppc64le.refleak/build/Lib/multiprocessing/resource_tracker.py:216: UserWarning: resource_tracker: There appear to be 6 leaked semaphore objects to clean up at shutdown
warnings.warn('resource_tracker: There appear to be %d '
Traceback (most recent call last):
File "/home/buildbot/buildarea/3.x.cstratak-RHEL8-ppc64le.refleak/build/Lib/multiprocessing/util.py", line 300, in _run_finalizers
finalizer()
File "/home/buildbot/buildarea/3.x.cstratak-RHEL8-ppc64le.refleak/build/Lib/multiprocessing/util.py", line 224, in __call__
res = self._callback(*self._args, **self._kwargs)
File "/home/buildbot/buildarea/3.x.cstratak-RHEL8-ppc64le.refleak/build/Lib/multiprocessing/synchronize.py", line 87, in _cleanup
sem_unlink(name)
FileNotFoundError: [Errno 2] No such file or directory
Traceback (most recent call last):
File "/home/buildbot/buildarea/3.x.cstratak-RHEL8-ppc64le.refleak/build/Lib/multiprocessing/util.py", line 300, in _run_finalizers
finalizer()
File "/home/buildbot/buildarea/3.x.cstratak-RHEL8-ppc64le.refleak/build/Lib/multiprocessing/util.py", line 224, in __call__
res = self._callback(*self._args, **self._kwargs)
File "/home/buildbot/buildarea/3.x.cstratak-RHEL8-ppc64le.refleak/build/Lib/multiprocessing/synchronize.py", line 87, in _cleanup
sem_unlink(name)
FileNotFoundError: [Errno 2] No such file or directory
Traceback (most recent call last):
File "/home/buildbot/buildarea/3.x.cstratak-RHEL8-ppc64le.refleak/build/Lib/multiprocessing/util.py", line 300, in _run_finalizers
finalizer()
File "/home/buildbot/buildarea/3.x.cstratak-RHEL8-ppc64le.refleak/build/Lib/multiprocessing/util.py", line 224, in __call__
res = self._callback(*self._args, **self._kwargs)
File "/home/buildbot/buildarea/3.x.cstratak-RHEL8-ppc64le.refleak/build/Lib/multiprocessing/synchronize.py", line 87, in _cleanup
sem_unlink(name)
FileNotFoundError: [Errno 2] No such file or directory
Traceback (most recent call last):
File "/home/buildbot/buildarea/3.x.cstratak-RHEL8-ppc64le.refleak/build/Lib/multiprocessing/util.py", line 300, in _run_finalizers
finalizer()
File "/home/buildbot/buildarea/3.x.cstratak-RHEL8-ppc64le.refleak/build/Lib/multiprocessing/util.py", line 224, in __call__
res = self._callback(*self._args, **self._kwargs)
File "/home/buildbot/buildarea/3.x.cstratak-RHEL8-ppc64le.refleak/build/Lib/multiprocessing/synchronize.py", line 87, in _cleanup
sem_unlink(name)
FileNotFoundError: [Errno 2] No such file or directory
Traceback (most recent call last):
File "/home/buildbot/buildarea/3.x.cstratak-RHEL8-ppc64le.refleak/build/Lib/multiprocessing/util.py", line 300, in _run_finalizers
finalizer()
File "/home/buildbot/buildarea/3.x.cstratak-RHEL8-ppc64le.refleak/build/Lib/multiprocessing/util.py", line 224, in __call__
res = self._callback(*self._args, **self._kwargs)
File "/home/buildbot/buildarea/3.x.cstratak-RHEL8-ppc64le.refleak/build/Lib/multiprocessing/synchronize.py", line 87, in _cleanup
sem_unlink(name)
FileNotFoundError: [Errno 2] No such file or directory
Traceback (most recent call last):
File "/home/buildbot/buildarea/3.x.cstratak-RHEL8-ppc64le.refleak/build/Lib/multiprocessing/util.py", line 300, in _run_finalizers
finalizer()
File "/home/buildbot/buildarea/3.x.cstratak-RHEL8-ppc64le.refleak/build/Lib/multiprocessing/util.py", line 224, in __call__
res = self._callback(*self._args, **self._kwargs)
File "/home/buildbot/buildarea/3.x.cstratak-RHEL8-ppc64le.refleak/build/Lib/multiprocessing/synchronize.py", line 87, in _cleanup
sem_unlink(name)
FileNotFoundError: [Errno 2] No such file or directory
./home/buildbot/buildarea/3.x.cstratak-RHEL8-ppc64le.refleak/build/Lib/multiprocessing/resource_tracker.py:216: UserWarning: resource_tracker: There appear to be 6 leaked semaphore objects to clean up at shutdown
warnings.warn('resource_tracker: There appear to be %d '
Traceback (most recent call last):
File "/home/buildbot/buildarea/3.x.cstratak-RHEL8-ppc64le.refleak/build/Lib/multiprocessing/util.py", line 300, in _run_finalizers
finalizer()
File "/home/buildbot/buildarea/3.x.cstratak-RHEL8-ppc64le.refleak/build/Lib/multiprocessing/util.py", line 224, in __call__
res = self._callback(*self._args, **self._kwargs)
File "/home/buildbot/buildarea/3.x.cstratak-RHEL8-ppc64le.refleak/build/Lib/multiprocessing/synchronize.py", line 87, in _cleanup
sem_unlink(name)
FileNotFoundError: [Errno 2] No such file or directory
Traceback (most recent call last):
File "/home/buildbot/buildarea/3.x.cstratak-RHEL8-ppc64le.refleak/build/Lib/multiprocessing/util.py", line 300, in _run_finalizers
finalizer()
File "/home/buildbot/buildarea/3.x.cstratak-RHEL8-ppc64le.refleak/build/Lib/multiprocessing/util.py", line 224, in __call__
res = self._callback(*self._args, **self._kwargs)
File "/home/buildbot/buildarea/3.x.cstratak-RHEL8-ppc64le.refleak/build/Lib/multiprocessing/synchronize.py", line 87, in _cleanup
sem_unlink(name)
FileNotFoundError: [Errno 2] No such file or directory
Traceback (most recent call last):
File "/home/buildbot/buildarea/3.x.cstratak-RHEL8-ppc64le.refleak/build/Lib/multiprocessing/util.py", line 300, in _run_finalizers
finalizer()
File "/home/buildbot/buildarea/3.x.cstratak-RHEL8-ppc64le.refleak/build/Lib/multiprocessing/util.py", line 224, in __call__
res = self._callback(*self._args, **self._kwargs)
File "/home/buildbot/buildarea/3.x.cstratak-RHEL8-ppc64le.refleak/build/Lib/multiprocessing/synchronize.py", line 87, in _cleanup
sem_unlink(name)
FileNotFoundError: [Errno 2] No such file or directory
Traceback (most recent call last):
File "/home/buildbot/buildarea/3.x.cstratak-RHEL8-ppc64le.refleak/build/Lib/multiprocessing/util.py", line 300, in _run_finalizers
finalizer()
File "/home/buildbot/buildarea/3.x.cstratak-RHEL8-ppc64le.refleak/build/Lib/multiprocessing/util.py", line 224, in __call__
res = self._callback(*self._args, **self._kwargs)
File "/home/buildbot/buildarea/3.x.cstratak-RHEL8-ppc64le.refleak/build/Lib/multiprocessing/synchronize.py", line 87, in _cleanup
sem_unlink(name)
FileNotFoundError: [Errno 2] No such file or directory
Traceback (most recent call last):
File "/home/buildbot/buildarea/3.x.cstratak-RHEL8-ppc64le.refleak/build/Lib/multiprocessing/util.py", line 300, in _run_finalizers
finalizer()
File "/home/buildbot/buildarea/3.x.cstratak-RHEL8-ppc64le.refleak/build/Lib/multiprocessing/util.py", line 224, in __call__
res = self._callback(*self._args, **self._kwargs)
File "/home/buildbot/buildarea/3.x.cstratak-RHEL8-ppc64le.refleak/build/Lib/multiprocessing/synchronize.py", line 87, in _cleanup
sem_unlink(name)
FileNotFoundError: [Errno 2] No such file or directory
Traceback (most recent call last):
File "/home/buildbot/buildarea/3.x.cstratak-RHEL8-ppc64le.refleak/build/Lib/multiprocessing/util.py", line 300, in _run_finalizers
finalizer()
File "/home/buildbot/buildarea/3.x.cstratak-RHEL8-ppc64le.refleak/build/Lib/multiprocessing/util.py", line 224, in __call__
res = self._callback(*self._args, **self._kwargs)
File "/home/buildbot/buildarea/3.x.cstratak-RHEL8-ppc64le.refleak/build/Lib/multiprocessing/synchronize.py", line 87, in _cleanup
sem_unlink(name)
FileNotFoundError: [Errno 2] No such file or directory
./home/buildbot/buildarea/3.x.cstratak-RHEL8-ppc64le.refleak/build/Lib/multiprocessing/resource_tracker.py:216: UserWarning: resource_tracker: There appear to be 6 leaked semaphore objects to clean up at shutdown
warnings.warn('resource_tracker: There appear to be %d '
Traceback (most recent call last):
File "/home/buildbot/buildarea/3.x.cstratak-RHEL8-ppc64le.refleak/build/Lib/multiprocessing/util.py", line 300, in _run_finalizers
finalizer()
File "/home/buildbot/buildarea/3.x.cstratak-RHEL8-ppc64le.refleak/build/Lib/multiprocessing/util.py", line 224, in __call__
res = self._callback(*self._args, **self._kwargs)
File "/home/buildbot/buildarea/3.x.cstratak-RHEL8-ppc64le.refleak/build/Lib/multiprocessing/synchronize.py", line 87, in _cleanup
sem_unlink(name)
FileNotFoundError: [Errno 2] No such file or directory
Traceback (most recent call last):
File "/home/buildbot/buildarea/3.x.cstratak-RHEL8-ppc64le.refleak/build/Lib/multiprocessing/util.py", line 300, in _run_finalizers
finalizer()
File "/home/buildbot/buildarea/3.x.cstratak-RHEL8-ppc64le.refleak/build/Lib/multiprocessing/util.py", line 224, in __call__
res = self._callback(*self._args, **self._kwargs)
File "/home/buildbot/buildarea/3.x.cstratak-RHEL8-ppc64le.refleak/build/Lib/multiprocessing/synchronize.py", line 87, in _cleanup
sem_unlink(name)
FileNotFoundError: [Errno 2] No such file or directory
Traceback (most recent call last):
File "/home/buildbot/buildarea/3.x.cstratak-RHEL8-ppc64le.refleak/build/Lib/multiprocessing/util.py", line 300, in _run_finalizers
finalizer()
File "/home/buildbot/buildarea/3.x.cstratak-RHEL8-ppc64le.refleak/build/Lib/multiprocessing/util.py", line 224, in __call__
res = self._callback(*self._args, **self._kwargs)
File "/home/buildbot/buildarea/3.x.cstratak-RHEL8-ppc64le.refleak/build/Lib/multiprocessing/synchronize.py", line 87, in _cleanup
sem_unlink(name)
FileNotFoundError: [Errno 2] No such file or directory
Traceback (most recent call last):
File "/home/buildbot/buildarea/3.x.cstratak-RHEL8-ppc64le.refleak/build/Lib/multiprocessing/util.py", line 300, in _run_finalizers
finalizer()
File "/home/buildbot/buildarea/3.x.cstratak-RHEL8-ppc64le.refleak/build/Lib/multiprocessing/util.py", line 224, in __call__
res = self._callback(*self._args, **self._kwargs)
File "/home/buildbot/buildarea/3.x.cstratak-RHEL8-ppc64le.refleak/build/Lib/multiprocessing/synchronize.py", line 87, in _cleanup
sem_unlink(name)
FileNotFoundError: [Errno 2] No such file or directory
Traceback (most recent call last):
File "/home/buildbot/buildarea/3.x.cstratak-RHEL8-ppc64le.refleak/build/Lib/multiprocessing/util.py", line 300, in _run_finalizers
finalizer()
File "/home/buildbot/buildarea/3.x.cstratak-RHEL8-ppc64le.refleak/build/Lib/multiprocessing/util.py", line 224, in __call__
res = self._callback(*self._args, **self._kwargs)
File "/home/buildbot/buildarea/3.x.cstratak-RHEL8-ppc64le.refleak/build/Lib/multiprocessing/synchronize.py", line 87, in _cleanup
sem_unlink(name)
FileNotFoundError: [Errno 2] No such file or directory
Traceback (most recent call last):
File "/home/buildbot/buildarea/3.x.cstratak-RHEL8-ppc64le.refleak/build/Lib/multiprocessing/util.py", line 300, in _run_finalizers
finalizer()
File "/home/buildbot/buildarea/3.x.cstratak-RHEL8-ppc64le.refleak/build/Lib/multiprocessing/util.py", line 224, in __call__
res = self._callback(*self._args, **self._kwargs)
File "/home/buildbot/buildarea/3.x.cstratak-RHEL8-ppc64le.refleak/build/Lib/multiprocessing/synchronize.py", line 87, in _cleanup
sem_unlink(name)
FileNotFoundError: [Errno 2] No such file or directory
.
Test report
===========
Failed tests:
- test_socketserver
- test_logging
Test leaking resources:
- test_logging: references
- test_socketserver: references
- test_logging: memory blocks
- test_socketserver: memory blocks
Sincerely,
-The Buildbot
1
0