Buildbot-status
Threads by month
- ----- 2026 -----
- October
- September
- August
- July
- June
- May
- April
- March
- February
- January
- ----- 2025 -----
- December
- November
- October
- September
- August
- July
- June
- May
- April
- March
- February
- January
- ----- 2024 -----
- December
- November
- October
- September
- August
- July
- June
- May
- April
- March
- February
- January
- ----- 2023 -----
- December
- November
- October
- September
- August
- July
- June
- May
- April
- March
- February
- January
- ----- 2022 -----
- December
- November
- October
- September
- August
- July
- June
- May
- April
- March
- February
- January
- ----- 2021 -----
- December
- November
- October
- September
- August
- July
- June
- May
- April
- March
- February
- January
- ----- 2020 -----
- December
- November
- October
- September
- August
- July
- June
- May
- April
- March
- February
- January
- ----- 2019 -----
- December
- November
- October
- September
- August
- July
- June
- May
- April
- March
- February
- January
- ----- 2018 -----
- December
- November
- October
- September
- August
- July
- June
- May
- April
- March
- February
- January
- ----- 2017 -----
- December
- November
- October
- September
- August
- July
- June
- May
August 2023
- 1 participants
- 294 discussions
☠ Buildbot (Python): python/cpython - failed test (failure) (main)
by buildbot@python.org Aug. 9, 2023
by buildbot@python.org Aug. 9, 2023
Aug. 9, 2023
The Buildbot has detected a new failure on builder s390x RHEL8 LTO + PGO 3.x while building python/cpython.
Full details are available at:
https://buildbot.python.org/all/#/builders/442/builds/4744
Buildbot URL: https://buildbot.python.org/all/
Worker for this Build: edelsohn-rhel8-z
Build Reason: <unknown>
Blamelist: Adam Turner <9087854+AA-Turner(a)users.noreply.github.com>, Alex Waygood <Alex.Waygood(a)Gmail.com>, Alexandru Mărășteanu <alexei(a)users.noreply.github.com>, Anders Kaseorg <andersk(a)mit.edu>, Barney Gale <barney.gale(a)gmail.com>, Brandt Bucher <brandtbucher(a)microsoft.com>, Charlie Zhao <zhaoyu_hit(a)qq.com>, Christopher Chavez <chrischavez(a)gmx.us>, Daniele Procida <daniele(a)vurt.org>, Dong-hee Na <donghee.na(a)python.org>, Eric Snow <ericsnowcurrently(a)gmail.com>, Erlend E. Aasland <erlend(a)python.org>, Fatih <77548106+fatihkabakk(a)users.noreply.github.com>, Felipe A. Hernandez <ergoithz(a)gmail.com>, Furkan Onder <furkanonder(a)protonmail.com>, Georg Brandl <georg(a)python.org>, Gertjan van Zwieten <git(a)gjvz.nl>, Guido van Rossum <guido(a)python.org>, Hugo van Kemenade <hugovk(a)users.noreply.github.com>, Illia Volochii <illia.volochii(a)gmail.com>, Inada Naoki <songofacandy(a)gmail.com>, Irit Katriel <1055913+iritkatriel(a)users.noreply.github.com>, Ivin Lee <62840497+rdrf2838(a)users.noreply.github
.com>, Jacob Walls <jacobtylerwalls(a)gmail.com>, James Cave <jcave137(a)gmail.com>, James Hilton-Balfe <gobot1234yt(a)gmail.com>, Kamil Turek <kamil.turek(a)hotmail.com>, Konstantin <kpp.live+github(a)gmail.com>, Kumar Aditya <kumaraditya(a)python.org>, Mark Shannon <mark(a)hotpy.org>, Michael The <michael-the1(a)users.noreply.github.com>, Ned Deily <nad(a)python.org>, Nikita Sobolev <mail(a)sobolevn.me>, Pablo Galindo Salgado <Pablogsal(a)gmail.com>, Pieter Eendebak <pieter.eendebak(a)gmail.com>, Rakesh Sabale <102187286+ghubrakesh(a)users.noreply.github.com>, Raymond Hettinger <rhettinger(a)users.noreply.github.com>, Serhiy Storchaka <storchaka(a)gmail.com>, Terry Jan Reedy <tjreedy(a)udel.edu>, Tian Gao <gaogaotiantian(a)hotmail.com>, Tom Niget <zippedfire(a)free.fr>, Tomas R <tomas.roun8(a)gmail.com>, Victor Stinner <vstinner(a)python.org>, cocoatomo <cocoatomo77(a)gmail.com>, da-woods <dw-git(a)d-woods.co.uk>, justdan6 <134341009+justdan6(a)users.noreply.github.com>, opavliuk <40970635+opavlyuk(a)users.noreply.github.com>,
shailshouryya <42100758+shailshouryya(a)users.noreply.github.com>
BUILD FAILED: failed test (failure)
Summary of the results of the build (if available):
===================================================
== Tests result: FAILURE then FAILURE ==
1 test omitted:
test_tools
430 tests OK.
10 slowest tests:
- test_concurrent_futures: 2 min 23 sec
- test_multiprocessing_spawn: 1 min 34 sec
- test_signal: 1 min 21 sec
- test_multiprocessing_fork: 1 min 5 sec
- test_io: 34.5 sec
- test_socket: 33.8 sec
- test_imaplib: 32.5 sec
- test_faulthandler: 28.9 sec
- test_math: 28.0 sec
- test_subprocess: 27.6 sec
1 test failed:
<regrtest worker>
16 tests skipped:
test.test_asyncio.test_windows_events
test.test_asyncio.test_windows_utils test_devpoll test_gdb
test_ioctl test_kqueue test_launcher test_perf_profiler
test_startfile test_tkinter test_ttk test_winconsoleio test_winreg
test_winsound test_wmi test_zipfile64
2 re-run tests:
<regrtest worker> test_multiprocessing_forkserver
Total duration: 18 min 10 sec
Captured traceback
==================
Traceback (most recent call last):
Warning -- File "/home/dje/cpython-buildarea/3.x.edelsohn-rhel8-z.lto-pgo/build/Lib/test/support/__init__.py", line 208, in _force_run
Warning -- return func(*args)
Warning -- ^^^^^^^^^^^
Warning -- OSError: [Errno 39] Directory not empty: '/tmp/test_python_wd77t1ho/tmp1dzwk5r8'
Warning --
Warning -- During handling of the above exception, another exception occurred:
Warning --
Warning -- Traceback (most recent call last):
Warning -- File "/home/dje/cpython-buildarea/3.x.edelsohn-rhel8-z.lto-pgo/build/Lib/test/libregrtest/runtest_mp.py", line 350, in run
Warning -- mp_result = self._runtest(test_name)
Warning -- ^^^^^^^^^^^^^^^^^^^^^^^^
Warning -- File "/home/dje/cpython-buildarea/3.x.edelsohn-rhel8-z.lto-pgo/build/Lib/test/libregrtest/runtest_mp.py", line 297, in _runtest
Warning -- os_helper.rmtree(tmp_dir)
Warning -- File "/home/dje/cpython-buildarea/3.x.edelsohn-rhel8-z.lto-pgo/build/Lib/test/support/os_helper.py", line 442, in rmtree
Warning -- _rmtree(path)
Warning -- File "/home/dje/cpython-buildarea/3.x.edelsohn-rhel8-z.lto-pgo/build/Lib/test/support/os_helper.py", line 426, in _rmtree
Warning -- _rmtree_inner(path)
Warning -- File "/home/dje/cpython-buildarea/3.x.edelsohn-rhel8-z.lto-pgo/build/Lib/test/support/os_helper.py", line 423, in _rmtree_inner
Warning -- _force_run(path, os.rmdir, fullname)
Warning -- File "/home/dje/cpython-buildarea/3.x.edelsohn-rhel8-z.lto-pgo/build/Lib/test/support/__init__.py", line 219, in _force_run
Warning -- return func(*args)
Warning -- ^^^^^^^^^^^
Warning -- OSError: [Errno 39] Directory not empty: '/tmp/test_python_wd77t1ho/tmp1dzwk5r8'
Traceback (most recent call last):
File "/home/dje/cpython-buildarea/3.x.edelsohn-rhel8-z.lto-pgo/build/Lib/test/libregrtest/runtest.py", line 373, in _runtest_inner
refleak = _runtest_inner2(ns, test_name)
^^^^^^^^^^^^^^^^^^^^^^^^^^^^^^
File "/home/dje/cpython-buildarea/3.x.edelsohn-rhel8-z.lto-pgo/build/Lib/test/libregrtest/runtest.py", line 313, in _runtest_inner2
the_module = importlib.import_module(abstest)
^^^^^^^^^^^^^^^^^^^^^^^^^^^^^^^^
File "/home/dje/cpython-buildarea/3.x.edelsohn-rhel8-z.lto-pgo/build/Lib/importlib/__init__.py", line 88, in import_module
return _bootstrap._gcd_import(name[level:], package, level)
^^^^^^^^^^^^^^^^^^^^^^^^^^^^^^^^^^^^^^^^^^^^^^^^^^^^
File "<frozen importlib._bootstrap>", line 1293, in _gcd_import
File "<frozen importlib._bootstrap>", line 1266, in _find_and_load
File "<frozen importlib._bootstrap>", line 1230, in _find_and_load_unlocked
ModuleNotFoundError: No module named 'test.<regrtest worker>'
Test report
===========
Failed tests:
- <regrtest
- worker>
- test_multiprocessing_forkserver
Sincerely,
-The Buildbot
1
0
☠ Buildbot (Python): python/cpython - failed test (failure) uploading test-results.xml (failure) (main)
by buildbot@python.org Aug. 9, 2023
by buildbot@python.org Aug. 9, 2023
Aug. 9, 2023
The Buildbot has detected a new failure on builder s390x Fedora Rawhide LTO + PGO 3.x while building python/cpython.
Full details are available at:
https://buildbot.python.org/all/#/builders/341/builds/3554
Buildbot URL: https://buildbot.python.org/all/
Worker for this Build: edelsohn-fedora-rawhide-z
Build Reason: <unknown>
Blamelist: Adam Turner <9087854+AA-Turner(a)users.noreply.github.com>, Alex Waygood <Alex.Waygood(a)Gmail.com>, Alexandru Mărășteanu <alexei(a)users.noreply.github.com>, Anders Kaseorg <andersk(a)mit.edu>, Barney Gale <barney.gale(a)gmail.com>, Brandt Bucher <brandtbucher(a)microsoft.com>, Charlie Zhao <zhaoyu_hit(a)qq.com>, Christopher Chavez <chrischavez(a)gmx.us>, Daniele Procida <daniele(a)vurt.org>, Dong-hee Na <donghee.na(a)python.org>, Eric Snow <ericsnowcurrently(a)gmail.com>, Erlend E. Aasland <erlend(a)python.org>, Fatih <77548106+fatihkabakk(a)users.noreply.github.com>, Felipe A. Hernandez <ergoithz(a)gmail.com>, Furkan Onder <furkanonder(a)protonmail.com>, Georg Brandl <georg(a)python.org>, Gertjan van Zwieten <git(a)gjvz.nl>, Guido van Rossum <guido(a)python.org>, Hugo van Kemenade <hugovk(a)users.noreply.github.com>, Illia Volochii <illia.volochii(a)gmail.com>, Inada Naoki <songofacandy(a)gmail.com>, Irit Katriel <1055913+iritkatriel(a)users.noreply.github.com>, Ivin Lee <62840497+rdrf2838(a)users.noreply.github
.com>, Jacob Walls <jacobtylerwalls(a)gmail.com>, James Cave <jcave137(a)gmail.com>, James Hilton-Balfe <gobot1234yt(a)gmail.com>, Kamil Turek <kamil.turek(a)hotmail.com>, Konstantin <kpp.live+github(a)gmail.com>, Kumar Aditya <kumaraditya(a)python.org>, Mark Shannon <mark(a)hotpy.org>, Michael The <michael-the1(a)users.noreply.github.com>, Ned Deily <nad(a)python.org>, Nikita Sobolev <mail(a)sobolevn.me>, Pablo Galindo Salgado <Pablogsal(a)gmail.com>, Pieter Eendebak <pieter.eendebak(a)gmail.com>, Rakesh Sabale <102187286+ghubrakesh(a)users.noreply.github.com>, Raymond Hettinger <rhettinger(a)users.noreply.github.com>, Serhiy Storchaka <storchaka(a)gmail.com>, Terry Jan Reedy <tjreedy(a)udel.edu>, Tian Gao <gaogaotiantian(a)hotmail.com>, Tom Niget <zippedfire(a)free.fr>, Tomas R <tomas.roun8(a)gmail.com>, Victor Stinner <vstinner(a)python.org>, cocoatomo <cocoatomo77(a)gmail.com>, da-woods <dw-git(a)d-woods.co.uk>, justdan6 <134341009+justdan6(a)users.noreply.github.com>, opavliuk <40970635+opavlyuk(a)users.noreply.github.com>,
shailshouryya <42100758+shailshouryya(a)users.noreply.github.com>
BUILD FAILED: failed test (failure) uploading test-results.xml (failure)
Summary of the results of the build (if available):
===================================================
==
Captured traceback
==================
Traceback (most recent call last):
File "/home/dje/cpython-buildarea/3.x.edelsohn-fedora-rawhide-z.lto-pgo/build/Lib/test/test_tools/test_freeze.py", line 27, in test_freeze_simple_script
outdir, scriptfile, python = helper.prepare(script, outdir)
^^^^^^^^^^^^^^^^^^^^^^^^^^^^^^
File "/home/dje/cpython-buildarea/3.x.edelsohn-fedora-rawhide-z.lto-pgo/build/Tools/freeze/test/freeze.py", line 146, in prepare
copy_source_tree(srcdir, SRCDIR)
File "/home/dje/cpython-buildarea/3.x.edelsohn-fedora-rawhide-z.lto-pgo/build/Tools/freeze/test/freeze.py", line 95, in copy_source_tree
shutil.copytree(oldroot, newroot, ignore=ignore_non_src)
File "/home/dje/cpython-buildarea/3.x.edelsohn-fedora-rawhide-z.lto-pgo/build/Lib/shutil.py", line 588, in copytree
return _copytree(entries=entries, src=src, dst=dst, symlinks=symlinks,
^^^^^^^^^^^^^^^^^^^^^^^^^^^^^^^^^^^^^^^^^^^^^^^^^^^^^^^^^^^^^^^
File "/home/dje/cpython-buildarea/3.x.edelsohn-fedora-rawhide-z.lto-pgo/build/Lib/shutil.py", line 542, in _copytree
raise Error(errors)
shutil.Error: [('/home/dje/cpython-buildarea/3.x.edelsohn-fedora-rawhide-z.lto-pgo/build/build/test_python_1898538æ/test_python_worker_1905139æ/@test_1905139_tmpæ/TEST1/SUB2/broken_link3', '/tmp/test_python_xr_07539/tmpkoa8tl5d/cpython/build/test_python_1898538æ/test_python_worker_1905139æ/@test_1905139_tmpæ/TEST1/SUB2/broken_link3', "[Errno 2] No such file or directory: '/home/dje/cpython-buildarea/3.x.edelsohn-fedora-rawhide-z.lto-pgo/build/build/test_python_1898538æ/test_python_worker_1905139æ/@test_1905139_tmpæ/TEST1/SUB2/broken_link3'"), (<DirEntry 'SUB2'>, '/tmp/test_python_xr_07539/tmpkoa8tl5d/cpython/build/test_python_1898538æ/test_python_worker_1905139æ/@test_1905139_tmpæ/TEST1/SUB2', "[Errno 2] No such file or directory: '/home/dje/cpython-buildarea/3.x.edelsohn-fedora-rawhide-z.lto-pgo/build/build/test_python_1898538æ/test_python_worker_1905139æ/@test_1905139_tmpæ/TEST1/SUB2'"), ('/home/dje/cpython-buildarea/3.x.edelsohn-fedora-rawhide-z.lto-pgo/build/build/
test_python_1898538æ/test_python_worker_1905139æ/@test_1905139_tmpæ/TEST1/tmp1', '/tmp/test_python_xr_07539/tmpkoa8tl5d/cpython/build/test_python_1898538æ/test_python_worker_1905139æ/@test_1905139_tmpæ/TEST1/tmp1', "[Errno 2] No such file or directory: '/home/dje/cpython-buildarea/3.x.edelsohn-fedora-rawhide-z.lto-pgo/build/build/test_python_1898538æ/test_python_worker_1905139æ/@test_1905139_tmpæ/TEST1/tmp1'"), (<DirEntry 'TEST1'>, '/tmp/test_python_xr_07539/tmpkoa8tl5d/cpython/build/test_python_1898538æ/test_python_worker_1905139æ/@test_1905139_tmpæ/TEST1', "[Errno 2] No such file or directory: '/home/dje/cpython-buildarea/3.x.edelsohn-fedora-rawhide-z.lto-pgo/build/build/test_python_1898538æ/test_python_worker_1905139æ/@test_1905139_tmpæ/TEST1'"), (<DirEntry 'TEST2'>, '/tmp/test_python_xr_07539/tmpkoa8tl5d/cpython/build/test_python_1898538æ/test_python_worker_1905139æ/@test_1905139_tmpæ/TEST2', "[Errno 2] No such file or directory: '/home/dje/cpython-buildarea/3.
x.edelsohn-fedora-rawhide-z.lto-pgo/build/build/test_python_1898538æ/test_python_worker_1905139æ/@test_1905139_tmpæ/TEST2'")]
Test report
===========
Failed tests:
- test_tools
Failed subtests:
- test_freeze_simple_script - test.test_tools.test_freeze.TestFreeze.test_freeze_simple_script
Sincerely,
-The Buildbot
1
0
☠ Buildbot (Python): python/cpython - failed test (failure) uploading test-results.xml (failure) (3.11)
by buildbot@python.org Aug. 9, 2023
by buildbot@python.org Aug. 9, 2023
Aug. 9, 2023
The Buildbot has detected a new failure on builder s390x Fedora LTO + PGO 3.11 while building python/cpython.
Full details are available at:
https://buildbot.python.org/all/#/builders/1023/builds/860
Buildbot URL: https://buildbot.python.org/all/
Worker for this Build: edelsohn-fedora-z
Build Reason: <unknown>
Blamelist: Hugo van Kemenade <hugovk(a)users.noreply.github.com>, Miss Islington (bot) <31488909+miss-islington(a)users.noreply.github.com>, Serhiy Storchaka <storchaka(a)gmail.com>, Tomas R <tomas.roun8(a)gmail.com>
BUILD FAILED: failed test (failure) uploading test-results.xml (failure)
Summary of the results of the build (if available):
===================================================
==
Captured traceback
==================
Traceback (most recent call last):
File "/home/dje/cpython-buildarea/3.11.edelsohn-fedora-z.lto-pgo/build/Lib/multiprocessing/resource_tracker.py", line 209, in main
cache[rtype].remove(name)
KeyError: '/psm_78c7cdbf'
Traceback (most recent call last):
File "/home/dje/cpython-buildarea/3.11.edelsohn-fedora-z.lto-pgo/build/Lib/test/test_tools/test_freeze.py", line 27, in test_freeze_simple_script
outdir, scriptfile, python = helper.prepare(script, outdir)
^^^^^^^^^^^^^^^^^^^^^^^^^^^^^^
File "/home/dje/cpython-buildarea/3.11.edelsohn-fedora-z.lto-pgo/build/Tools/freeze/test/freeze.py", line 146, in prepare
copy_source_tree(srcdir, SRCDIR)
File "/home/dje/cpython-buildarea/3.11.edelsohn-fedora-z.lto-pgo/build/Tools/freeze/test/freeze.py", line 95, in copy_source_tree
shutil.copytree(oldroot, newroot, ignore=ignore_non_src)
File "/home/dje/cpython-buildarea/3.11.edelsohn-fedora-z.lto-pgo/build/Lib/shutil.py", line 561, in copytree
return _copytree(entries=entries, src=src, dst=dst, symlinks=symlinks,
^^^^^^^^^^^^^^^^^^^^^^^^^^^^^^^^^^^^^^^^^^^^^^^^^^^^^^^^^^^^^^^
File "/home/dje/cpython-buildarea/3.11.edelsohn-fedora-z.lto-pgo/build/Lib/shutil.py", line 515, in _copytree
raise Error(errors)
shutil.Error: [('/home/dje/cpython-buildarea/3.11.edelsohn-fedora-z.lto-pgo/build/build/test_python_2139529æ/test_python_worker_2140268æ/@test_2140268_tmpæ-tardir/extractall_ctrl/ustar/fifotype', '/tmp/tmpv3svwr5n/cpython/build/test_python_2139529æ/test_python_worker_2140268æ/@test_2140268_tmpæ-tardir/extractall_ctrl/ustar/fifotype', '`/home/dje/cpython-buildarea/3.11.edelsohn-fedora-z.lto-pgo/build/build/test_python_2139529æ/test_python_worker_2140268æ/@test_2140268_tmpæ-tardir/extractall_ctrl/ustar/fifotype` is a named pipe'), ('/home/dje/cpython-buildarea/3.11.edelsohn-fedora-z.lto-pgo/build/build/test_python_2139529æ/test_python_worker_2140268æ/@test_2140268_tmpæ-tardir/extractall_none', '/tmp/tmpv3svwr5n/cpython/build/test_python_2139529æ/test_python_worker_2140268æ/@test_2140268_tmpæ-tardir/extractall_none', "[Errno 2] No such file or directory: '/home/dje/cpython-buildarea/3.11.edelsohn-fedora-z.lto-pgo/build/build/test_python_2139529æ/test_python_worker_214026
8æ/@test_2140268_tmpæ-tardir/extractall_none'")]
Traceback (most recent call last):
File "/home/dje/cpython-buildarea/3.11.edelsohn-fedora-z.lto-pgo/build/Lib/multiprocessing/resource_tracker.py", line 209, in main
cache[rtype].remove(name)
KeyError: '/psm_dbfa3d44'
Traceback (most recent call last):
File "/home/dje/cpython-buildarea/3.11.edelsohn-fedora-z.lto-pgo/build/Lib/test/test___all__.py", line 129, in test_all
self.check_all(modname)
File "/home/dje/cpython-buildarea/3.11.edelsohn-fedora-z.lto-pgo/build/Lib/test/test___all__.py", line 43, in check_all
with warnings_helper.check_warnings(
File "/home/dje/cpython-buildarea/3.11.edelsohn-fedora-z.lto-pgo/build/Lib/contextlib.py", line 144, in __exit__
next(self.gen)
File "/home/dje/cpython-buildarea/3.11.edelsohn-fedora-z.lto-pgo/build/Lib/test/support/warnings_helper.py", line 185, in _filterwarnings
raise AssertionError("unhandled warning %s" % reraise[0])
AssertionError: unhandled warning {message : DeprecationWarning("invalid escape sequence '\\?'"), category : 'DeprecationWarning', filename : '/home/dje/cpython-buildarea/3.11.edelsohn-fedora-z.lto-pgo/build/Lib/test/test_httpservers.py', lineno : 445, line : None}
Traceback (most recent call last):
File "/home/dje/cpython-buildarea/3.11.edelsohn-fedora-z.lto-pgo/build/Lib/multiprocessing/resource_tracker.py", line 209, in main
cache[rtype].remove(name)
KeyError: '/psm_df0b8744'
Test report
===========
Failed tests:
- test_tools
- test___all__
Failed subtests:
- test_all - test.test___all__.AllTest.test_all
- test_freeze_simple_script - test.test_tools.test_freeze.TestFreeze.test_freeze_simple_script
Sincerely,
-The BuildbotThe Buildbot has detected a new failure on builder s390x Fedora Rawhide Clang 3.11 while building python/cpython.
Full details are available at:
https://buildbot.python.org/all/#/builders/982/builds/876
Buildbot URL: https://buildbot.python.org/all/
Worker for this Build: edelsohn-fedora-rawhide-z
Build Reason: <unknown>
Blamelist: Serhiy Storchaka <storchaka(a)gmail.com>
BUILD FAILED: failed test (failure)
Summary of the results of the build (if available):
===================================================
== Tests result: FAILURE then FAILURE ==
418 tests OK.
10 slowest tests:
- test_tools: 2 min 45 sec
- test_concurrent_futures: 2 min 20 sec
- test_multiprocessing_spawn: 1 min 38 sec
- test_multiprocessing_forkserver: 1 min 19 sec
- test_asyncio: 1 min 14 sec
- test_multiprocessing_fork: 1 min 7 sec
- test_signal: 48.0 sec
- test_tokenize: 47.4 sec
- test_capi: 43.0 sec
- test_socket: 42.0 sec
1 test failed:
test_tools
15 tests skipped:
test_devpoll test_gdb test_ioctl test_kqueue test_launcher
test_msilib test_nis test_startfile test_tix test_tk
test_ttk_guionly test_winconsoleio test_winreg test_winsound
test_zipfile64
1 re-run test:
test_tools
Total duration: 7 min 55 sec
Captured traceback
==================
Traceback (most recent call last):
File "/home/dje/cpython-buildarea/3.11.edelsohn-fedora-rawhide-z.clang/build/Lib/test/test_tools/test_freeze.py", line 27, in test_freeze_simple_script
outdir, scriptfile, python = helper.prepare(script, outdir)
^^^^^^^^^^^^^^^^^^^^^^^^^^^^^^
File "/home/dje/cpython-buildarea/3.11.edelsohn-fedora-rawhide-z.clang/build/Tools/freeze/test/freeze.py", line 184, in prepare
_run_quiet([MAKE, '-C', builddir, 'install'])
File "/home/dje/cpython-buildarea/3.11.edelsohn-fedora-rawhide-z.clang/build/Tools/freeze/test/freeze.py", line 25, in _run_quiet
return subprocess.run(
^^^^^^^^^^^^^^^
File "/home/dje/cpython-buildarea/3.11.edelsohn-fedora-rawhide-z.clang/build/Lib/subprocess.py", line 571, in run
raise CalledProcessError(retcode, process.args,
subprocess.CalledProcessError: Command '['/usr/bin/make', '-C', '/tmp/tmp359ou6gu/python-build', 'install']' returned non-zero exit status 2.
Traceback (most recent call last):
File "<string>", line 1, in <module>
File "/tmp/tmp359ou6gu/cpython/Lib/sysconfig.py", line 715, in get_config_var
return get_config_vars().get(name)
^^^^^^^^^^^^^^^^^
File "/tmp/tmp359ou6gu/cpython/Lib/sysconfig.py", line 670, in get_config_vars
_init_posix(_CONFIG_VARS)
File "/tmp/tmp359ou6gu/cpython/Lib/sysconfig.py", line 531, in _init_posix
_temp = __import__(name, globals(), locals(), ['build_time_vars'], 0)
^^^^^^^^^^^^^^^^^^^^^^^^^^^^^^^^^^^^^^^^^^^^^^^^^^^^^^^^^^^^^
ModuleNotFoundError: No module named '_sysconfigdata_d_linux_s390x-linux-gnu'
Traceback (most recent call last):
File "<string>", line 1, in <module>
File "/tmp/tmpm6mkmho7/cpython/Lib/sysconfig.py", line 715, in get_config_var
return get_config_vars().get(name)
^^^^^^^^^^^^^^^^^
File "/tmp/tmpm6mkmho7/cpython/Lib/sysconfig.py", line 670, in get_config_vars
_init_posix(_CONFIG_VARS)
File "/tmp/tmpm6mkmho7/cpython/Lib/sysconfig.py", line 531, in _init_posix
_temp = __import__(name, globals(), locals(), ['build_time_vars'], 0)
^^^^^^^^^^^^^^^^^^^^^^^^^^^^^^^^^^^^^^^^^^^^^^^^^^^^^^^^^^^^^
ModuleNotFoundError: No module named '_sysconfigdata_d_linux_s390x-linux-gnu'
Traceback (most recent call last):
File "/home/dje/cpython-buildarea/3.11.edelsohn-fedora-rawhide-z.clang/build/Lib/multiprocessing/resource_tracker.py", line 209, in main
cache[rtype].remove(name)
KeyError: '/psm_7070306a'
Traceback (most recent call last):
File "/home/dje/cpython-buildarea/3.11.edelsohn-fedora-rawhide-z.clang/build/Lib/multiprocessing/resource_tracker.py", line 209, in main
cache[rtype].remove(name)
KeyError: '/psm_36f2421d'
Traceback (most recent call last):
File "/home/dje/cpython-buildarea/3.11.edelsohn-fedora-rawhide-z.clang/build/Lib/test/test_tools/test_freeze.py", line 27, in test_freeze_simple_script
outdir, scriptfile, python = helper.prepare(script, outdir)
^^^^^^^^^^^^^^^^^^^^^^^^^^^^^^
File "/home/dje/cpython-buildarea/3.11.edelsohn-fedora-rawhide-z.clang/build/Tools/freeze/test/freeze.py", line 184, in prepare
_run_quiet([MAKE, '-C', builddir, 'install'])
File "/home/dje/cpython-buildarea/3.11.edelsohn-fedora-rawhide-z.clang/build/Tools/freeze/test/freeze.py", line 25, in _run_quiet
return subprocess.run(
^^^^^^^^^^^^^^^
File "/home/dje/cpython-buildarea/3.11.edelsohn-fedora-rawhide-z.clang/build/Lib/subprocess.py", line 571, in run
raise CalledProcessError(retcode, process.args,
subprocess.CalledProcessError: Command '['/usr/bin/make', '-C', '/tmp/tmpm6mkmho7/python-build', 'install']' returned non-zero exit status 2.
Traceback (most recent call last):
File "/home/dje/cpython-buildarea/3.11.edelsohn-fedora-rawhide-z.clang/build/Lib/multiprocessing/resource_tracker.py", line 209, in main
cache[rtype].remove(name)
KeyError: '/psm_e04481fe'
Test report
===========
Failed tests:
- test_tools
Failed subtests:
- test_freeze_simple_script - test.test_tools.test_freeze.TestFreeze.test_freeze_simple_script
Sincerely,
-The BuildbotThe Buildbot has detected a new failure on builder s390x Fedora Rawhide 3.11 while building python/cpython.
Full details are available at:
https://buildbot.python.org/all/#/builders/999/builds/874
Buildbot URL: https://buildbot.python.org/all/
Worker for this Build: edelsohn-fedora-rawhide-z
Build Reason: <unknown>
Blamelist: Serhiy Storchaka <storchaka(a)gmail.com>
BUILD FAILED: failed test (failure)
Summary of the results of the build (if available):
===================================================
== Tests result: FAILURE then FAILURE ==
418 tests OK.
10 slowest tests:
- test_tools: 2 min 26 sec
- test_concurrent_futures: 2 min 25 sec
- test_multiprocessing_spawn: 2 min 17 sec
- test_multiprocessing_forkserver: 1 min 22 sec
- test_asyncio: 1 min 18 sec
- test_multiprocessing_fork: 1 min 12 sec
- test_tokenize: 1 min 10 sec
- test_capi: 50.1 sec
- test_signal: 48.3 sec
- test_unparse: 44.2 sec
1 test failed:
test_tools
15 tests skipped:
test_devpoll test_gdb test_ioctl test_kqueue test_launcher
test_msilib test_nis test_startfile test_tix test_tk
test_ttk_guionly test_winconsoleio test_winreg test_winsound
test_zipfile64
1 re-run test:
test_tools
Total duration: 8 min 50 sec
Captured traceback
==================
Traceback (most recent call last):
File "/home/dje/cpython-buildarea/3.11.edelsohn-fedora-rawhide-z/build/Lib/test/test_tools/test_freeze.py", line 27, in test_freeze_simple_script
outdir, scriptfile, python = helper.prepare(script, outdir)
^^^^^^^^^^^^^^^^^^^^^^^^^^^^^^
File "/home/dje/cpython-buildarea/3.11.edelsohn-fedora-rawhide-z/build/Tools/freeze/test/freeze.py", line 184, in prepare
_run_quiet([MAKE, '-C', builddir, 'install'])
File "/home/dje/cpython-buildarea/3.11.edelsohn-fedora-rawhide-z/build/Tools/freeze/test/freeze.py", line 25, in _run_quiet
return subprocess.run(
^^^^^^^^^^^^^^^
File "/home/dje/cpython-buildarea/3.11.edelsohn-fedora-rawhide-z/build/Lib/subprocess.py", line 571, in run
raise CalledProcessError(retcode, process.args,
subprocess.CalledProcessError: Command '['/usr/bin/make', '-C', '/tmp/tmpkx257t4s/python-build', 'install']' returned non-zero exit status 2.
Traceback (most recent call last):
File "/home/dje/cpython-buildarea/3.11.edelsohn-fedora-rawhide-z/build/Lib/multiprocessing/resource_tracker.py", line 209, in main
cache[rtype].remove(name)
KeyError: '/psm_4a6e77a9'
Traceback (most recent call last):
File "/home/dje/cpython-buildarea/3.11.edelsohn-fedora-rawhide-z/build/Lib/multiprocessing/resource_tracker.py", line 209, in main
cache[rtype].remove(name)
KeyError: '/psm_1ba70d57'
Traceback (most recent call last):
File "/home/dje/cpython-buildarea/3.11.edelsohn-fedora-rawhide-z/build/Lib/test/test_tools/test_freeze.py", line 27, in test_freeze_simple_script
outdir, scriptfile, python = helper.prepare(script, outdir)
^^^^^^^^^^^^^^^^^^^^^^^^^^^^^^
File "/home/dje/cpython-buildarea/3.11.edelsohn-fedora-rawhide-z/build/Tools/freeze/test/freeze.py", line 184, in prepare
_run_quiet([MAKE, '-C', builddir, 'install'])
File "/home/dje/cpython-buildarea/3.11.edelsohn-fedora-rawhide-z/build/Tools/freeze/test/freeze.py", line 25, in _run_quiet
return subprocess.run(
^^^^^^^^^^^^^^^
File "/home/dje/cpython-buildarea/3.11.edelsohn-fedora-rawhide-z/build/Lib/subprocess.py", line 571, in run
raise CalledProcessError(retcode, process.args,
subprocess.CalledProcessError: Command '['/usr/bin/make', '-C', '/tmp/tmpapnemza5/python-build', 'install']' returned non-zero exit status 2.
Traceback (most recent call last):
File "/tmp/tmpapnemza5/cpython/Lib/runpy.py", line 198, in _run_module_as_main
return _run_code(code, main_globals, None,
^^^^^^^^^^^^^^^^^^^^^^^^^^^^^^^^^^^
File "/tmp/tmpapnemza5/cpython/Lib/runpy.py", line 88, in _run_code
exec(code, run_globals)
File "/tmp/tmpapnemza5/cpython/Lib/ensurepip/__main__.py", line 5, in <module>
sys.exit(ensurepip._main())
^^^^^^^^^^^^^^^^^
File "/tmp/tmpapnemza5/cpython/Lib/ensurepip/__init__.py", line 286, in _main
return _bootstrap(
^^^^^^^^^^^
File "/tmp/tmpapnemza5/cpython/Lib/ensurepip/__init__.py", line 202, in _bootstrap
return _run_pip([*args, *_PACKAGE_NAMES], additional_paths)
^^^^^^^^^^^^^^^^^^^^^^^^^^^^^^^^^^^^^^^^^^^^^^^^^^^^
File "/tmp/tmpapnemza5/cpython/Lib/ensurepip/__init__.py", line 103, in _run_pip
return subprocess.run(cmd, check=True).returncode
^^^^^^^^^^^^^^^^^^^^^^^^^^^^^^^
File "/tmp/tmpapnemza5/cpython/Lib/subprocess.py", line 571, in run
raise CalledProcessError(retcode, process.args,
subprocess.CalledProcessError: Command '['/tmp/tmpapnemza5/python-build/python', '-W', 'ignore::DeprecationWarning', '-c', '\nimport runpy\nimport sys\nsys.path = [\'/tmp/tmpa0fdmufv/setuptools-65.5.0-py3-none-any.whl\', \'/tmp/tmpa0fdmufv/pip-23.2.1-py3-none-any.whl\'] + sys.path\nsys.argv[1:] = [\'install\', \'--no-cache-dir\', \'--no-index\', \'--find-links\', \'/tmp/tmpa0fdmufv\', \'--root\', \'/\', \'--upgrade\', \'setuptools\', \'pip\']\nrunpy.run_module("pip", run_name="__main__", alter_sys=True)\n']' returned non-zero exit status 1.
make[1]: *** [Makefile:1876: install] Error 1
Traceback (most recent call last):
File "<string>", line 1, in <module>
File "/tmp/tmpapnemza5/cpython/Lib/sysconfig.py", line 715, in get_config_var
return get_config_vars().get(name)
^^^^^^^^^^^^^^^^^
File "/tmp/tmpapnemza5/cpython/Lib/sysconfig.py", line 670, in get_config_vars
_init_posix(_CONFIG_VARS)
File "/tmp/tmpapnemza5/cpython/Lib/sysconfig.py", line 531, in _init_posix
_temp = __import__(name, globals(), locals(), ['build_time_vars'], 0)
^^^^^^^^^^^^^^^^^^^^^^^^^^^^^^^^^^^^^^^^^^^^^^^^^^^^^^^^^^^^^
ModuleNotFoundError: No module named '_sysconfigdata_d_linux_s390x-linux-gnu'
Traceback (most recent call last):
File "/home/dje/cpython-buildarea/3.11.edelsohn-fedora-rawhide-z/build/Lib/multiprocessing/resource_tracker.py", line 209, in main
cache[rtype].remove(name)
KeyError: '/psm_88f32566'
Traceback (most recent call last):
File "<string>", line 1, in <module>
File "/tmp/tmpkx257t4s/cpython/Lib/sysconfig.py", line 715, in get_config_var
return get_config_vars().get(name)
^^^^^^^^^^^^^^^^^
File "/tmp/tmpkx257t4s/cpython/Lib/sysconfig.py", line 670, in get_config_vars
_init_posix(_CONFIG_VARS)
File "/tmp/tmpkx257t4s/cpython/Lib/sysconfig.py", line 531, in _init_posix
_temp = __import__(name, globals(), locals(), ['build_time_vars'], 0)
^^^^^^^^^^^^^^^^^^^^^^^^^^^^^^^^^^^^^^^^^^^^^^^^^^^^^^^^^^^^^
ModuleNotFoundError: No module named '_sysconfigdata_d_linux_s390x-linux-gnu'
Test report
===========
Failed tests:
- test_tools
Failed subtests:
- test_freeze_simple_script - test.test_tools.test_freeze.TestFreeze.test_freeze_simple_script
Sincerely,
-The Buildbot
1
0
☠ Buildbot (Python): python/cpython - failed test (failure) uploading test-results.xml (failure) (main)
by buildbot@python.org Aug. 9, 2023
by buildbot@python.org Aug. 9, 2023
Aug. 9, 2023
The Buildbot has detected a new failure on builder PPC64LE RHEL8 3.x while building python/cpython.
Full details are available at:
https://buildbot.python.org/all/#/builders/559/builds/3771
Buildbot URL: https://buildbot.python.org/all/
Worker for this Build: cstratak-RHEL8-ppc64le
Build Reason: <unknown>
Blamelist: Adam Turner <9087854+AA-Turner(a)users.noreply.github.com>, Alex Waygood <Alex.Waygood(a)Gmail.com>, Alexandru Mărășteanu <alexei(a)users.noreply.github.com>, Anders Kaseorg <andersk(a)mit.edu>, Barney Gale <barney.gale(a)gmail.com>, Brandt Bucher <brandtbucher(a)microsoft.com>, Charlie Zhao <zhaoyu_hit(a)qq.com>, Christopher Chavez <chrischavez(a)gmx.us>, Daniele Procida <daniele(a)vurt.org>, Dong-hee Na <donghee.na(a)python.org>, Eric Snow <ericsnowcurrently(a)gmail.com>, Erlend E. Aasland <erlend(a)python.org>, Fatih <77548106+fatihkabakk(a)users.noreply.github.com>, Felipe A. Hernandez <ergoithz(a)gmail.com>, Furkan Onder <furkanonder(a)protonmail.com>, Georg Brandl <georg(a)python.org>, Gertjan van Zwieten <git(a)gjvz.nl>, Guido van Rossum <guido(a)python.org>, Hugo van Kemenade <hugovk(a)users.noreply.github.com>, Illia Volochii <illia.volochii(a)gmail.com>, Inada Naoki <songofacandy(a)gmail.com>, Irit Katriel <1055913+iritkatriel(a)users.noreply.github.com>, Ivin Lee <62840497+rdrf2838(a)users.noreply.github
.com>, Jacob Walls <jacobtylerwalls(a)gmail.com>, James Cave <jcave137(a)gmail.com>, James Hilton-Balfe <gobot1234yt(a)gmail.com>, Kamil Turek <kamil.turek(a)hotmail.com>, Konstantin <kpp.live+github(a)gmail.com>, Kumar Aditya <kumaraditya(a)python.org>, Mark Shannon <mark(a)hotpy.org>, Michael The <michael-the1(a)users.noreply.github.com>, Ned Deily <nad(a)python.org>, Nikita Sobolev <mail(a)sobolevn.me>, Pablo Galindo Salgado <Pablogsal(a)gmail.com>, Pieter Eendebak <pieter.eendebak(a)gmail.com>, Rakesh Sabale <102187286+ghubrakesh(a)users.noreply.github.com>, Raymond Hettinger <rhettinger(a)users.noreply.github.com>, Serhiy Storchaka <storchaka(a)gmail.com>, Terry Jan Reedy <tjreedy(a)udel.edu>, Tian Gao <gaogaotiantian(a)hotmail.com>, Tom Niget <zippedfire(a)free.fr>, Tomas R <tomas.roun8(a)gmail.com>, Victor Stinner <vstinner(a)python.org>, cocoatomo <cocoatomo77(a)gmail.com>, da-woods <dw-git(a)d-woods.co.uk>, justdan6 <134341009+justdan6(a)users.noreply.github.com>, opavliuk <40970635+opavlyuk(a)users.noreply.github.com>,
shailshouryya <42100758+shailshouryya(a)users.noreply.github.com>
BUILD FAILED: failed test (failure) uploading test-results.xml (failure)
Summary of the results of the build (if available):
===================================================
==
Captured traceback
==================
remote: Enumerating objects: 49, done.
remote: Counting objects: 2% (1/43)
remote: Counting objects: 4% (2/43)
remote: Counting objects: 6% (3/43)
remote: Counting objects: 9% (4/43)
remote: Counting objects: 11% (5/43)
remote: Counting objects: 13% (6/43)
remote: Counting objects: 16% (7/43)
remote: Counting objects: 18% (8/43)
remote: Counting objects: 20% (9/43)
remote: Counting objects: 23% (10/43)
remote: Counting objects: 25% (11/43)
remote: Counting objects: 27% (12/43)
remote: Counting objects: 30% (13/43)
remote: Counting objects: 32% (14/43)
remote: Counting objects: 34% (15/43)
remote: Counting objects: 37% (16/43)
remote: Counting objects: 39% (17/43)
remote: Counting objects: 41% (18/43)
remote: Counting objects: 44% (19/43)
remote: Counting objects: 46% (20/43)
remote: Counting objects: 48% (21/43)
remote: Counting objects: 51% (22/43)
remote: Counting objects: 53% (23/43)
remote: Counting objects: 55% (24/43)
remote: Counting objects: 58% (25/43)
remote: Counting objects: 60% (26/43)
remote: Counting objects: 62% (27/43)
remote: Counting objects: 65% (28/43)
remote: Counting objects: 67% (29/43)
remote: Counting objects: 69% (30/43)
remote: Counting objects: 72% (31/43)
remote: Counting objects: 74% (32/43)
remote: Counting objects: 76% (33/43)
remote: Counting objects: 79% (34/43)
remote: Counting objects: 81% (35/43)
remote: Counting objects: 83% (36/43)
remote: Counting objects: 86% (37/43)
remote: Counting objects: 88% (38/43)
remote: Counting objects: 90% (39/43)
remote: Counting objects: 93% (40/43)
remote: Counting objects: 95% (41/43)
remote: Counting objects: 97% (42/43)
remote: Counting objects: 100% (43/43)
remote: Counting objects: 100% (43/43), done.
remote: Compressing objects: 3% (1/28)
remote: Compressing objects: 7% (2/28)
remote: Compressing objects: 10% (3/28)
remote: Compressing objects: 14% (4/28)
remote: Compressing objects: 17% (5/28)
remote: Compressing objects: 21% (6/28)
remote: Compressing objects: 25% (7/28)
remote: Compressing objects: 28% (8/28)
remote: Compressing objects: 32% (9/28)
remote: Compressing objects: 35% (10/28)
remote: Compressing objects: 39% (11/28)
remote: Compressing objects: 42% (12/28)
remote: Compressing objects: 46% (13/28)
remote: Compressing objects: 50% (14/28)
remote: Compressing objects: 53% (15/28)
remote: Compressing objects: 57% (16/28)
remote: Compressing objects: 60% (17/28)
remote: Compressing objects: 64% (18/28)
remote: Compressing objects: 67% (19/28)
remote: Compressing objects: 71% (20/28)
remote: Compressing objects: 75% (21/28)
remote: Compressing objects: 78% (22/28)
remote: Compressing objects: 82% (23/28)
remote: Compressing objects: 85% (24/28)
remote: Compressing objects: 89% (25/28)
remote: Compressing objects: 92% (26/28)
remote: Compressing objects: 96% (27/28)
remote: Compressing objects: 100% (28/28)
remote: Compressing objects: 100% (28/28), done.
remote: Total 49 (delta 19), reused 23 (delta 15), pack-reused 6
From https://github.com/python/cpython
* branch main -> FETCH_HEAD
Note: switching to '73507382ac184a72b59ebb0c2f85e8b1d2dfa58e'.
You are in 'detached HEAD' state. You can look around, make experimental
changes and commit them, and you can discard any commits you make in this
state without impacting any branches by switching back to a branch.
If you want to create a new branch to retain commits you create, you may
do so (now or later) by using -c with the switch command. Example:
git switch -c <new-branch-name>
Or undo this operation with:
git switch -
Turn off this advice by setting config variable advice.detachedHead to false
HEAD is now at 73507382ac gh-104683: Argument Clinic: refactor format_docstring() (#107623)
Switched to and reset branch 'main'
Timeout (0:15:00)!
Thread 0x00007fff96904d70 (most recent call first):
File "/home/buildbot/buildarea/3.x.cstratak-RHEL8-ppc64le/build/Lib/selectors.py", line 398 in select
File "/home/buildbot/buildarea/3.x.cstratak-RHEL8-ppc64le/build/Lib/subprocess.py", line 2108 in _communicate
File "/home/buildbot/buildarea/3.x.cstratak-RHEL8-ppc64le/build/Lib/subprocess.py", line 1209 in communicate
File "/home/buildbot/buildarea/3.x.cstratak-RHEL8-ppc64le/build/Lib/test/test_gdb.py", line 112 in run_gdb
File "/home/buildbot/buildarea/3.x.cstratak-RHEL8-ppc64le/build/Lib/test/test_gdb.py", line 229 in get_stack_trace
File "/home/buildbot/buildarea/3.x.cstratak-RHEL8-ppc64le/build/Lib/test/test_gdb.py", line 859 in test_threads
File "/home/buildbot/buildarea/3.x.cstratak-RHEL8-ppc64le/build/Lib/unittest/case.py", line 589 in _callTestMethod
File "/home/buildbot/buildarea/3.x.cstratak-RHEL8-ppc64le/build/Lib/unittest/case.py", line 634 in run
File "/home/buildbot/buildarea/3.x.cstratak-RHEL8-ppc64le/build/Lib/unittest/case.py", line 690 in __call__
File "/home/buildbot/buildarea/3.x.cstratak-RHEL8-ppc64le/build/Lib/unittest/suite.py", line 122 in run
File "/home/buildbot/buildarea/3.x.cstratak-RHEL8-ppc64le/build/Lib/unittest/suite.py", line 84 in __call__
File "/home/buildbot/buildarea/3.x.cstratak-RHEL8-ppc64le/build/Lib/unittest/suite.py", line 122 in run
File "/home/buildbot/buildarea/3.x.cstratak-RHEL8-ppc64le/build/Lib/unittest/suite.py", line 84 in __call__
File "/home/buildbot/buildarea/3.x.cstratak-RHEL8-ppc64le/build/Lib/unittest/suite.py", line 122 in run
File "/home/buildbot/buildarea/3.x.cstratak-RHEL8-ppc64le/build/Lib/unittest/suite.py", line 84 in __call__
File "/home/buildbot/buildarea/3.x.cstratak-RHEL8-ppc64le/build/Lib/unittest/runner.py", line 240 in run
File "/home/buildbot/buildarea/3.x.cstratak-RHEL8-ppc64le/build/Lib/test/support/__init__.py", line 1116 in _run_suite
File "/home/buildbot/buildarea/3.x.cstratak-RHEL8-ppc64le/build/Lib/test/support/__init__.py", line 1242 in run_unittest
File "/home/buildbot/buildarea/3.x.cstratak-RHEL8-ppc64le/build/Lib/test/libregrtest/runtest.py", line 294 in _test_module
File "/home/buildbot/buildarea/3.x.cstratak-RHEL8-ppc64le/build/Lib/test/libregrtest/runtest.py", line 330 in _runtest_inner2
File "/home/buildbot/buildarea/3.x.cstratak-RHEL8-ppc64le/build/Lib/test/libregrtest/runtest.py", line 373 in _runtest_inner
File "/home/buildbot/buildarea/3.x.cstratak-RHEL8-ppc64le/build/Lib/test/libregrtest/runtest.py", line 248 in _runtest
File "/home/buildbot/buildarea/3.x.cstratak-RHEL8-ppc64le/build/Lib/test/libregrtest/runtest.py", line 278 in runtest
File "/home/buildbot/buildarea/3.x.cstratak-RHEL8-ppc64le/build/Lib/test/libregrtest/main.py", line 365 in rerun_failed_tests
File "/home/buildbot/buildarea/3.x.cstratak-RHEL8-ppc64le/build/Lib/test/libregrtest/main.py", line 803 in _main
File "/home/buildbot/buildarea/3.x.cstratak-RHEL8-ppc64le/build/Lib/test/libregrtest/main.py", line 758 in main
File "/home/buildbot/buildarea/3.x.cstratak-RHEL8-ppc64le/build/Lib/test/libregrtest/main.py", line 822 in main
File "/home/buildbot/buildarea/3.x.cstratak-RHEL8-ppc64le/build/Lib/test/__main__.py", line 2 in <module>
File "/home/buildbot/buildarea/3.x.cstratak-RHEL8-ppc64le/build/Lib/runpy.py", line 88 in _run_code
File "/home/buildbot/buildarea/3.x.cstratak-RHEL8-ppc64le/build/Lib/runpy.py", line 198 in _run_module_as_main
make: *** [Makefile:2025: buildbottest] Error 1
Cannot open file '/home/buildbot/buildarea/3.x.cstratak-RHEL8-ppc64le/build/build_oot/test-results.xml' for upload
Test report
===========
Failed tests:
- test_gdb
Sincerely,
-The BuildbotThe Buildbot has detected a new failure on builder aarch64 RHEL8 LTO 3.x while building python/cpython.
Full details are available at:
https://buildbot.python.org/all/#/builders/338/builds/4775
Buildbot URL: https://buildbot.python.org/all/
Worker for this Build: cstratak-RHEL8-aarch64
Build Reason: <unknown>
Blamelist: Erlend E. Aasland <erlend(a)python.org>
BUILD FAILED: failed test (failure)
Summary of the results of the build (if available):
===================================================
== Tests result: FAILURE then ENV CHANGED ==
432 tests OK.
10 slowest tests:
- test_gdb: 2 min 35 sec
- test_concurrent_futures: 2 min 21 sec
- test_multiprocessing_spawn: 1 min 40 sec
- test_multiprocessing_forkserver: 1 min 11 sec
- test_signal: 1 min 11 sec
- test_multiprocessing_fork: 1 min 5 sec
- test_socket: 39.8 sec
- test_io: 38.3 sec
- test_math: 33.2 sec
- test_imaplib: 32.1 sec
1 test altered the execution environment:
test_interpreters
14 tests skipped:
test.test_asyncio.test_windows_events
test.test_asyncio.test_windows_utils test_devpoll test_ioctl
test_kqueue test_launcher test_startfile test_tkinter test_ttk
test_winconsoleio test_winreg test_winsound test_wmi
test_zipfile64
1 re-run test:
test.test_asyncio.test_unix_events
Total duration: 2 min 36 sec
Captured traceback
==================
Traceback (most recent call last):
File "/home/buildbot/buildarea/3.x.cstratak-RHEL8-aarch64.lto/build/Lib/unittest/async_case.py", line 90, in _callTestMethod
if self._callMaybeAsync(method) is not None:
^^^^^^^^^^^^^^^^^^^^^^^^^^^^
File "/home/buildbot/buildarea/3.x.cstratak-RHEL8-aarch64.lto/build/Lib/unittest/async_case.py", line 117, in _callMaybeAsync
return self._asyncioTestContext.run(func, *args, **kwargs)
^^^^^^^^^^^^^^^^^^^^^^^^^^^^^^^^^^^^^^^^^^^^^^^^^^^
File "/home/buildbot/buildarea/3.x.cstratak-RHEL8-aarch64.lto/build/Lib/test/support/hashlib_helper.py", line 49, in wrapper
return func_or_class(*args, **kwargs)
^^^^^^^^^^^^^^^^^^^^^^^^^^^^^^
File "/home/buildbot/buildarea/3.x.cstratak-RHEL8-aarch64.lto/build/Lib/test/test_asyncio/test_unix_events.py", line 1937, in test_fork_signal_handling
self.assertTrue(child_handled.is_set())
AssertionError: False is not true
Traceback (most recent call last):
File "<frozen importlib._bootstrap>", line 1266, in _find_and_load
File "<frozen importlib._bootstrap>", line 1237, in _find_and_load_unlocked
File "<frozen importlib._bootstrap>", line 841, in _load_unlocked
File "<frozen importlib._bootstrap_external>", line 998, in exec_module
File "<frozen importlib._bootstrap_external>", line 1094, in get_code
File "<frozen importlib._bootstrap_external>", line 1193, in get_data
TypeError: descriptor 'close' for '_io.BufferedReader' objects doesn't apply to a '_io.FileIO' object
Traceback (most recent call last):
File "/home/buildbot/buildarea/3.x.cstratak-RHEL8-aarch64.lto/build/Lib/threading.py", line 1052, in _bootstrap_inner
self.run()
File "/home/buildbot/buildarea/3.x.cstratak-RHEL8-aarch64.lto/build/Lib/threading.py", line 989, in run
self._target(*self._args, **self._kwargs)
File "/home/buildbot/buildarea/3.x.cstratak-RHEL8-aarch64.lto/build/Lib/test/test_interpreters.py", line 481, in task
interp = interpreters.create()
^^^^^^^^^^^^^^^^^^^^^
File "/home/buildbot/buildarea/3.x.cstratak-RHEL8-aarch64.lto/build/Lib/test/support/interpreters.py", line 25, in create
id = _interpreters.create(isolated=isolated)
^^^^^^^^^^^^^^^^^^^^^^^^^^^^^^^^^^^^^^^
RuntimeError: interpreter creation failed
k
Test report
===========
Failed tests:
- test.test_asyncio.test_unix_events
Failed subtests:
- test_fork_signal_handling - test.test_asyncio.test_unix_events.TestFork.test_fork_signal_handling
Sincerely,
-The Buildbot
1
0
☠ Buildbot (Python): python/cpython - failed test (failure) uploading test-results.xml (failure) (main)
by buildbot@python.org Aug. 8, 2023
by buildbot@python.org Aug. 8, 2023
Aug. 8, 2023
The Buildbot has detected a new failure on builder AMD64 Windows11 Non-Debug 3.x while building python/cpython.
Full details are available at:
https://buildbot.python.org/all/#/builders/914/builds/2705
Buildbot URL: https://buildbot.python.org/all/
Worker for this Build: ware-win11
Build Reason: <unknown>
Blamelist: Alex Waygood <Alex.Waygood(a)Gmail.com>, Brandt Bucher <brandtbucher(a)microsoft.com>, Eric Snow <ericsnowcurrently(a)gmail.com>, Erlend E. Aasland <erlend(a)python.org>, Fatih <77548106+fatihkabakk(a)users.noreply.github.com>, Guido van Rossum <guido(a)python.org>, Inada Naoki <songofacandy(a)gmail.com>, Raymond Hettinger <rhettinger(a)users.noreply.github.com>, Tomas R <tomas.roun8(a)gmail.com>
BUILD FAILED: failed test (failure) uploading test-results.xml (failure)
Summary of the results of the build (if available):
===================================================
==
Captured traceback
==================
remote: Enumerating objects: 32, done.
remote: Counting objects: 3% (1/32)
remote: Counting objects: 6% (2/32)
remote: Counting objects: 9% (3/32)
remote: Counting objects: 12% (4/32)
remote: Counting objects: 15% (5/32)
remote: Counting objects: 18% (6/32)
remote: Counting objects: 21% (7/32)
remote: Counting objects: 25% (8/32)
remote: Counting objects: 28% (9/32)
remote: Counting objects: 31% (10/32)
remote: Counting objects: 34% (11/32)
remote: Counting objects: 37% (12/32)
remote: Counting objects: 40% (13/32)
remote: Counting objects: 43% (14/32)
remote: Counting objects: 46% (15/32)
remote: Counting objects: 50% (16/32)
remote: Counting objects: 53% (17/32)
remote: Counting objects: 56% (18/32)
remote: Counting objects: 59% (19/32)
remote: Counting objects: 62% (20/32)
remote: Counting objects: 65% (21/32)
remote: Counting objects: 68% (22/32)
remote: Counting objects: 71% (23/32)
remote: Counting objects: 75% (24/32)
remote: Counting objects: 78% (25/32)
remote: Counting objects: 81% (26/32)
remote: Counting objects: 84% (27/32)
remote: Counting objects: 87% (28/32)
remote: Counting objects: 90% (29/32)
remote: Counting objects: 93% (30/32)
remote: Counting objects: 96% (31/32)
remote: Counting objects: 100% (32/32)
remote: Counting objects: 100% (32/32), done.
remote: Compressing objects: 7% (1/13)
remote: Compressing objects: 15% (2/13)
remote: Compressing objects: 23% (3/13)
remote: Compressing objects: 30% (4/13)
remote: Compressing objects: 38% (5/13)
remote: Compressing objects: 46% (6/13)
remote: Compressing objects: 53% (7/13)
remote: Compressing objects: 61% (8/13)
remote: Compressing objects: 69% (9/13)
remote: Compressing objects: 76% (10/13)
remote: Compressing objects: 84% (11/13)
remote: Compressing objects: 92% (12/13)
remote: Compressing objects: 100% (13/13)
remote: Compressing objects: 100% (13/13), done.
remote: Total 17 (delta 14), reused 5 (delta 3), pack-reused 0
From https://github.com/python/cpython
* branch main -> FETCH_HEAD
Note: switching to '0be3743f54569475c40e00c8dcdded928d429d58'.
You are in 'detached HEAD' state. You can look around, make experimental
changes and commit them, and you can discard any commits you make in this
state without impacting any branches by switching back to a branch.
If you want to create a new branch to retain commits you create, you may
do so (now or later) by using -c with the switch command. Example:
git switch -c <new-branch-name>
Or undo this operation with:
git switch -
Turn off this advice by setting config variable advice.detachedHead to false
HEAD is now at 0be3743f54 gh-104683: Add --exclude option to Argument Clinic CLI (#107770)
Switched to and reset branch 'main'
Could Not Find b:\uildarea\3.x.ware-win11.nondebug\build\Lib\*.pyc
The system cannot find the file specified.
Could Not Find b:\uildarea\3.x.ware-win11.nondebug\build\PCbuild\python*.zip
Timeout (0:15:00)!
Thread 0x00003b68 (most recent call first):
File "b:\uildarea\3.x.ware-win11.nondebug\build\Lib\subprocess.py", line 1597 in _readerthread
File "b:\uildarea\3.x.ware-win11.nondebug\build\Lib\threading.py", line 989 in run
File "b:\uildarea\3.x.ware-win11.nondebug\build\Lib\threading.py", line 1052 in _bootstrap_inner
File "b:\uildarea\3.x.ware-win11.nondebug\build\Lib\threading.py", line 1009 in _bootstrap
Thread 0x00001fa4 (most recent call first):
File "b:\uildarea\3.x.ware-win11.nondebug\build\Lib\subprocess.py", line 1597 in _readerthread
File "b:\uildarea\3.x.ware-win11.nondebug\build\Lib\threading.py", line 989 in run
File "b:\uildarea\3.x.ware-win11.nondebug\build\Lib\threading.py", line 1052 in _bootstrap_inner
File "b:\uildarea\3.x.ware-win11.nondebug\build\Lib\threading.py", line 1009 in _bootstrap
Thread 0x0000012c (most recent call first):
File "b:\uildarea\3.x.ware-win11.nondebug\build\Lib\threading.py", line 1146 in _wait_for_tstate_lock
File "b:\uildarea\3.x.ware-win11.nondebug\build\Lib\threading.py", line 1126 in join
File "b:\uildarea\3.x.ware-win11.nondebug\build\Lib\subprocess.py", line 1626 in _communicate
File "b:\uildarea\3.x.ware-win11.nondebug\build\Lib\subprocess.py", line 1209 in communicate
File "b:\uildarea\3.x.ware-win11.nondebug\build\Lib\test\support\script_helper.py", line 139 in run_python_until_end
File "b:\uildarea\3.x.ware-win11.nondebug\build\Lib\test\support\script_helper.py", line 149 in _assert_python
File "b:\uildarea\3.x.ware-win11.nondebug\build\Lib\test\support\script_helper.py", line 166 in assert_python_ok
File "b:\uildarea\3.x.ware-win11.nondebug\build\Lib\test\test_concurrent_futures.py", line 302 in test_interpreter_shutdown
File "b:\uildarea\3.x.ware-win11.nondebug\build\Lib\unittest\case.py", line 589 in _callTestMethod
File "b:\uildarea\3.x.ware-win11.nondebug\build\Lib\unittest\case.py", line 634 in run
File "b:\uildarea\3.x.ware-win11.nondebug\build\Lib\unittest\case.py", line 690 in __call__
File "b:\uildarea\3.x.ware-win11.nondebug\build\Lib\unittest\suite.py", line 122 in run
File "b:\uildarea\3.x.ware-win11.nondebug\build\Lib\unittest\suite.py", line 84 in __call__
File "b:\uildarea\3.x.ware-win11.nondebug\build\Lib\unittest\suite.py", line 122 in run
File "b:\uildarea\3.x.ware-win11.nondebug\build\Lib\unittest\suite.py", line 84 in __call__
File "b:\uildarea\3.x.ware-win11.nondebug\build\Lib\unittest\suite.py", line 122 in run
File "b:\uildarea\3.x.ware-win11.nondebug\build\Lib\unittest\suite.py", line 84 in __call__
File "b:\uildarea\3.x.ware-win11.nondebug\build\Lib\unittest\runner.py", line 240 in run
File "b:\uildarea\3.x.ware-win11.nondebug\build\Lib\test\support\__init__.py", line 1116 in _run_suite
File "b:\uildarea\3.x.ware-win11.nondebug\build\Lib\test\support\__init__.py", line 1242 in run_unittest
File "b:\uildarea\3.x.ware-win11.nondebug\build\Lib\test\libregrtest\runtest.py", line 294 in _test_module
File "b:\uildarea\3.x.ware-win11.nondebug\build\Lib\test\libregrtest\runtest.py", line 330 in _runtest_inner2
File "b:\uildarea\3.x.ware-win11.nondebug\build\Lib\test\libregrtest\runtest.py", line 373 in _runtest_inner
File "b:\uildarea\3.x.ware-win11.nondebug\build\Lib\test\libregrtest\runtest.py", line 248 in _runtest
File "b:\uildarea\3.x.ware-win11.nondebug\build\Lib\test\libregrtest\runtest.py", line 278 in runtest
File "b:\uildarea\3.x.ware-win11.nondebug\build\Lib\test\libregrtest\main.py", line 365 in rerun_failed_tests
File "b:\uildarea\3.x.ware-win11.nondebug\build\Lib\test\libregrtest\main.py", line 803 in _main
File "b:\uildarea\3.x.ware-win11.nondebug\build\Lib\test\libregrtest\main.py", line 758 in main
File "b:\uildarea\3.x.ware-win11.nondebug\build\Lib\test\libregrtest\main.py", line 822 in main
File "b:\uildarea\3.x.ware-win11.nondebug\build\Lib\test\__main__.py", line 2 in <module>
File "<frozen runpy>", line 88 in _run_code
File "<frozen runpy>", line 198 in _run_module_as_main
Cannot open file 'b:\uildarea\3.x.ware-win11.nondebug\build\test-results.xml' for upload
Could Not Find b:\uildarea\3.x.ware-win11.nondebug\build\PCbuild\python*.zip
Test report
===========
Failed tests:
- test_concurrent_futures
Sincerely,
-The Buildbot
1
0
☠ Buildbot (Python): python/cpython - failed test (failure) uploading test-results.xml (failure) (main)
by buildbot@python.org Aug. 8, 2023
by buildbot@python.org Aug. 8, 2023
Aug. 8, 2023
The Buildbot has detected a new failure on builder s390x Fedora Rawhide LTO + PGO 3.x while building python/cpython.
Full details are available at:
https://buildbot.python.org/all/#/builders/341/builds/3552
Buildbot URL: https://buildbot.python.org/all/
Worker for this Build: edelsohn-fedora-rawhide-z
Build Reason: <unknown>
Blamelist: Adam Turner <9087854+AA-Turner(a)users.noreply.github.com>, Alex Waygood <Alex.Waygood(a)Gmail.com>, Alexandru Mărășteanu <alexei(a)users.noreply.github.com>, Anders Kaseorg <andersk(a)mit.edu>, Barney Gale <barney.gale(a)gmail.com>, Brandt Bucher <brandtbucher(a)microsoft.com>, Charlie Zhao <zhaoyu_hit(a)qq.com>, Christopher Chavez <chrischavez(a)gmx.us>, Daniele Procida <daniele(a)vurt.org>, Dong-hee Na <donghee.na(a)python.org>, Eric Snow <ericsnowcurrently(a)gmail.com>, Erlend E. Aasland <erlend(a)python.org>, Fatih <77548106+fatihkabakk(a)users.noreply.github.com>, Felipe A. Hernandez <ergoithz(a)gmail.com>, Furkan Onder <furkanonder(a)protonmail.com>, Georg Brandl <georg(a)python.org>, Gertjan van Zwieten <git(a)gjvz.nl>, Guido van Rossum <guido(a)python.org>, Hugo van Kemenade <hugovk(a)users.noreply.github.com>, Illia Volochii <illia.volochii(a)gmail.com>, Inada Naoki <songofacandy(a)gmail.com>, Irit Katriel <1055913+iritkatriel(a)users.noreply.github.com>, Ivin Lee <62840497+rdrf2838(a)users.noreply.github
.com>, Jacob Walls <jacobtylerwalls(a)gmail.com>, James Cave <jcave137(a)gmail.com>, James Hilton-Balfe <gobot1234yt(a)gmail.com>, Kamil Turek <kamil.turek(a)hotmail.com>, Konstantin <kpp.live+github(a)gmail.com>, Kumar Aditya <kumaraditya(a)python.org>, Mark Shannon <mark(a)hotpy.org>, Michael The <michael-the1(a)users.noreply.github.com>, Ned Deily <nad(a)python.org>, Nikita Sobolev <mail(a)sobolevn.me>, Pablo Galindo Salgado <Pablogsal(a)gmail.com>, Pieter Eendebak <pieter.eendebak(a)gmail.com>, Rakesh Sabale <102187286+ghubrakesh(a)users.noreply.github.com>, Raymond Hettinger <rhettinger(a)users.noreply.github.com>, Serhiy Storchaka <storchaka(a)gmail.com>, Terry Jan Reedy <tjreedy(a)udel.edu>, Tian Gao <gaogaotiantian(a)hotmail.com>, Tom Niget <zippedfire(a)free.fr>, Tomas R <tomas.roun8(a)gmail.com>, Victor Stinner <vstinner(a)python.org>, cocoatomo <cocoatomo77(a)gmail.com>, da-woods <dw-git(a)d-woods.co.uk>, justdan6 <134341009+justdan6(a)users.noreply.github.com>, opavliuk <40970635+opavlyuk(a)users.noreply.github.com>,
shailshouryya <42100758+shailshouryya(a)users.noreply.github.com>
BUILD FAILED: failed test (failure) uploading test-results.xml (failure)
Summary of the results of the build (if available):
===================================================
==
Captured traceback
==================
remote: Enumerating objects: 27, done.
remote: Counting objects: 4% (1/22)
remote: Counting objects: 9% (2/22)
remote: Counting objects: 13% (3/22)
remote: Counting objects: 18% (4/22)
remote: Counting objects: 22% (5/22)
remote: Counting objects: 27% (6/22)
remote: Counting objects: 31% (7/22)
remote: Counting objects: 36% (8/22)
remote: Counting objects: 40% (9/22)
remote: Counting objects: 45% (10/22)
remote: Counting objects: 50% (11/22)
remote: Counting objects: 54% (12/22)
remote: Counting objects: 59% (13/22)
remote: Counting objects: 63% (14/22)
remote: Counting objects: 68% (15/22)
remote: Counting objects: 72% (16/22)
remote: Counting objects: 77% (17/22)
remote: Counting objects: 81% (18/22)
remote: Counting objects: 86% (19/22)
remote: Counting objects: 90% (20/22)
remote: Counting objects: 95% (21/22)
remote: Counting objects: 100% (22/22)
remote: Counting objects: 100% (22/22), done.
remote: Compressing objects: 6% (1/15)
remote: Compressing objects: 13% (2/15)
remote: Compressing objects: 20% (3/15)
remote: Compressing objects: 26% (4/15)
remote: Compressing objects: 33% (5/15)
remote: Compressing objects: 40% (6/15)
remote: Compressing objects: 46% (7/15)
remote: Compressing objects: 53% (8/15)
remote: Compressing objects: 60% (9/15)
remote: Compressing objects: 66% (10/15)
remote: Compressing objects: 73% (11/15)
remote: Compressing objects: 80% (12/15)
remote: Compressing objects: 86% (13/15)
remote: Compressing objects: 93% (14/15)
remote: Compressing objects: 100% (15/15)
remote: Compressing objects: 100% (15/15), done.
remote: Total 27 (delta 8), reused 11 (delta 7), pack-reused 5
From https://github.com/python/cpython
* branch main -> FETCH_HEAD
Note: switching to 'ea72c6fe3b6db5f4e8ce3d3405c0ea65dc002faf'.
You are in 'detached HEAD' state. You can look around, make experimental
changes and commit them, and you can discard any commits you make in this
state without impacting any branches by switching back to a branch.
If you want to create a new branch to retain commits you create, you may
do so (now or later) by using -c with the switch command. Example:
git switch -c <new-branch-name>
Or undo this operation with:
git switch -
Turn off this advice by setting config variable advice.detachedHead to false
HEAD is now at ea72c6fe3b GH-107596: Specialize str[int] (GH-107597)
Switched to and reset branch 'main'
find: ‘build’: No such file or directory
find: ‘build’: No such file or directory
find: ‘build’: No such file or directory
find: ‘build’: No such file or directory
make[2]: [Makefile:2792: clean-retain-profile] Error 1 (ignored)
In function ‘_io_FileIO_close_impl’,
inlined from ‘_io_FileIO_close’ at ./Modules/_io/clinic/fileio.c.h:33:12:
./Modules/_io/fileio.c:170:9: warning: ‘exc’ may be used uninitialized [-Wmaybe-uninitialized]
170 | _PyErr_ChainExceptions1(exc);
| ^~~~~~~~~~~~~~~~~~~~~~~~~~~~
./Modules/_io/fileio.c: In function ‘_io_FileIO_close’:
./Modules/_io/fileio.c:155:15: note: ‘exc’ was declared here
155 | PyObject *exc;
| ^~~
./Modules/_decimal/libmpdec/context.c:56: warning: mpd_setminalloc: ignoring request to set MPD_MINALLOC a second time
./Modules/_decimal/libmpdec/context.c:56: warning: mpd_setminalloc: ignoring request to set MPD_MINALLOC a second time
In function ‘_io_FileIO_close_impl’,
inlined from ‘_io_FileIO_close’ at ./Modules/_io/clinic/fileio.c.h:33:12:
./Modules/_io/fileio.c:170:9: warning: ‘exc’ may be used uninitialized [-Wmaybe-uninitialized]
170 | _PyErr_ChainExceptions1(exc);
| ^~~~~~~~~~~~~~~~~~~~~~~~~~~~
./Modules/_io/fileio.c: In function ‘_io_FileIO_close’:
./Modules/_io/fileio.c:155:15: note: ‘exc’ was declared here
155 | PyObject *exc;
| ^~~
In function ‘word_to_string’,
inlined from ‘coeff_to_string’ at ./Modules/_decimal/libmpdec/io.c:410:13,
inlined from ‘_mpd_to_string’ at ./Modules/_decimal/libmpdec/io.c:611:18:
./Modules/_decimal/libmpdec/io.c:348:40: warning: writing 1 byte into a region of size 0 [-Wstringop-overflow=]
348 | if (s == dot) *s++ = '.'; *s++ = '0' + (char)(x / d); x %= d
| ~~~~~^~~~~~~~~~~~~~~~~~~~~
In function ‘_mpd_to_string’:
cc1: note: destination object is likely at address zero
In function ‘word_to_string’,
inlined from ‘coeff_to_string’ at ./Modules/_decimal/libmpdec/io.c:410:13,
inlined from ‘_mpd_to_string’ at ./Modules/_decimal/libmpdec/io.c:611:18:
./Modules/_decimal/libmpdec/io.c:348:40: warning: writing 1 byte into a region of size 0 [-Wstringop-overflow=]
348 | if (s == dot) *s++ = '.'; *s++ = '0' + (char)(x / d); x %= d
| ~~~~~^~~~~~~~~~~~~~~~~~~~~
In function ‘_mpd_to_string’:
cc1: note: destination object is likely at address zero
In function ‘word_to_string’,
inlined from ‘coeff_to_string’ at ./Modules/_decimal/libmpdec/io.c:410:13,
inlined from ‘_mpd_to_string’ at ./Modules/_decimal/libmpdec/io.c:611:18:
./Modules/_decimal/libmpdec/io.c:348:40: warning: writing 1 byte into a region of size 0 [-Wstringop-overflow=]
348 | if (s == dot) *s++ = '.'; *s++ = '0' + (char)(x / d); x %= d
| ~~~~~^~~~~~~~~~~~~~~~~~~~~
In function ‘_mpd_to_string’:
cc1: note: destination object is likely at address zero
In function ‘word_to_string’,
inlined from ‘coeff_to_string’ at ./Modules/_decimal/libmpdec/io.c:410:13,
inlined from ‘_mpd_to_string’ at ./Modules/_decimal/libmpdec/io.c:611:18:
./Modules/_decimal/libmpdec/io.c:348:40: warning: writing 1 byte into a region of size 0 [-Wstringop-overflow=]
348 | if (s == dot) *s++ = '.'; *s++ = '0' + (char)(x / d); x %= d
| ~~~~~^~~~~~~~~~~~~~~~~~~~~
In function ‘_mpd_to_string’:
cc1: note: destination object is likely at address zero
cc1: note: destination object is likely at address zero
In function ‘word_to_string’,
inlined from ‘coeff_to_string’ at ./Modules/_decimal/libmpdec/io.c:410:13,
inlined from ‘_mpd_to_string’ at ./Modules/_decimal/libmpdec/io.c:611:18:
./Modules/_decimal/libmpdec/io.c:348:40: warning: writing 1 byte into a region of size 0 [-Wstringop-overflow=]
348 | if (s == dot) *s++ = '.'; *s++ = '0' + (char)(x / d); x %= d
| ~~~~~^~~~~~~~~~~~~~~~~~~~~
In function ‘_mpd_to_string’:
cc1: note: destination object is likely at address zero
In function ‘word_to_string’,
inlined from ‘coeff_to_string’ at ./Modules/_decimal/libmpdec/io.c:410:13,
inlined from ‘_mpd_to_string’ at ./Modules/_decimal/libmpdec/io.c:611:18:
./Modules/_decimal/libmpdec/io.c:348:40: warning: writing 1 byte into a region of size 0 [-Wstringop-overflow=]
348 | if (s == dot) *s++ = '.'; *s++ = '0' + (char)(x / d); x %= d
| ~~~~~^~~~~~~~~~~~~~~~~~~~~
In function ‘_mpd_to_string’:
cc1: note: destination object is likely at address zero
In function ‘word_to_string’,
inlined from ‘coeff_to_string’ at ./Modules/_decimal/libmpdec/io.c:410:13,
inlined from ‘_mpd_to_string’ at ./Modules/_decimal/libmpdec/io.c:611:18:
./Modules/_decimal/libmpdec/io.c:348:40: warning: writing 1 byte into a region of size 0 [-Wstringop-overflow=]
348 | if (s == dot) *s++ = '.'; *s++ = '0' + (char)(x / d); x %= d
| ~~~~~^~~~~~~~~~~~~~~~~~~~~
In function ‘_mpd_to_string’:
cc1: note: destination object is likely at address zero
In function ‘word_to_string’,
inlined from ‘coeff_to_string’ at ./Modules/_decimal/libmpdec/io.c:410:13,
inlined from ‘_mpd_to_string’ at ./Modules/_decimal/libmpdec/io.c:611:18:
./Modules/_decimal/libmpdec/io.c:348:40: warning: writing 1 byte into a region of size 0 [-Wstringop-overflow=]
348 | if (s == dot) *s++ = '.'; *s++ = '0' + (char)(x / d); x %= d
| ~~~~~^~~~~~~~~~~~~~~~~~~~~
In function ‘_mpd_to_string’:
cc1: note: destination object is likely at address zero
cc1: note: destination object is likely at address zero
In function ‘word_to_string’,
inlined from ‘coeff_to_string’ at ./Modules/_decimal/libmpdec/io.c:410:13,
inlined from ‘_mpd_to_string’ at ./Modules/_decimal/libmpdec/io.c:611:18:
./Modules/_decimal/libmpdec/io.c:348:40: warning: writing 1 byte into a region of size 0 [-Wstringop-overflow=]
348 | if (s == dot) *s++ = '.'; *s++ = '0' + (char)(x / d); x %= d
| ~~~~~^~~~~~~~~~~~~~~~~~~~~
In function ‘_mpd_to_string’:
cc1: note: destination object is likely at address zero
In function ‘word_to_string’,
inlined from ‘coeff_to_string’ at ./Modules/_decimal/libmpdec/io.c:410:13,
inlined from ‘_mpd_to_string’ at ./Modules/_decimal/libmpdec/io.c:611:18:
./Modules/_decimal/libmpdec/io.c:348:40: warning: writing 1 byte into a region of size 0 [-Wstringop-overflow=]
348 | if (s == dot) *s++ = '.'; *s++ = '0' + (char)(x / d); x %= d
| ~~~~~^~~~~~~~~~~~~~~~~~~~~
In function ‘_mpd_to_string’:
cc1: note: destination object is likely at address zero
In function ‘word_to_string’,
inlined from ‘coeff_to_string’ at ./Modules/_decimal/libmpdec/io.c:410:13,
inlined from ‘_mpd_to_string’ at ./Modules/_decimal/libmpdec/io.c:611:18:
./Modules/_decimal/libmpdec/io.c:348:40: warning: writing 1 byte into a region of size 0 [-Wstringop-overflow=]
348 | if (s == dot) *s++ = '.'; *s++ = '0' + (char)(x / d); x %= d
| ~~~~~^~~~~~~~~~~~~~~~~~~~~
In function ‘_mpd_to_string’:
cc1: note: destination object is likely at address zero
In function ‘word_to_string’,
inlined from ‘coeff_to_string’ at ./Modules/_decimal/libmpdec/io.c:410:13,
inlined from ‘_mpd_to_string’ at ./Modules/_decimal/libmpdec/io.c:611:18:
./Modules/_decimal/libmpdec/io.c:348:40: warning: writing 1 byte into a region of size 0 [-Wstringop-overflow=]
348 | if (s == dot) *s++ = '.'; *s++ = '0' + (char)(x / d); x %= d
| ~~~~~^~~~~~~~~~~~~~~~~~~~~
In function ‘_mpd_to_string’:
cc1: note: destination object is likely at address zero
cc1: note: destination object is likely at address zero
In function ‘word_to_string’,
inlined from ‘coeff_to_string’ at ./Modules/_decimal/libmpdec/io.c:410:13,
inlined from ‘_mpd_to_string’ at ./Modules/_decimal/libmpdec/io.c:611:18:
./Modules/_decimal/libmpdec/io.c:348:40: warning: writing 1 byte into a region of size 0 [-Wstringop-overflow=]
348 | if (s == dot) *s++ = '.'; *s++ = '0' + (char)(x / d); x %= d
| ~~~~~^~~~~~~~~~~~~~~~~~~~~
In function ‘_mpd_to_string’:
cc1: note: destination object is likely at address zero
In function ‘word_to_string’,
inlined from ‘coeff_to_string’ at ./Modules/_decimal/libmpdec/io.c:410:13,
inlined from ‘_mpd_to_string’ at ./Modules/_decimal/libmpdec/io.c:611:18:
./Modules/_decimal/libmpdec/io.c:348:40: warning: writing 1 byte into a region of size 0 [-Wstringop-overflow=]
348 | if (s == dot) *s++ = '.'; *s++ = '0' + (char)(x / d); x %= d
| ~~~~~^~~~~~~~~~~~~~~~~~~~~
In function ‘_mpd_to_string’:
cc1: note: destination object is likely at address zero
In function ‘word_to_string’,
inlined from ‘coeff_to_string’ at ./Modules/_decimal/libmpdec/io.c:410:13,
inlined from ‘_mpd_to_string’ at ./Modules/_decimal/libmpdec/io.c:611:18:
./Modules/_decimal/libmpdec/io.c:348:40: warning: writing 1 byte into a region of size 0 [-Wstringop-overflow=]
348 | if (s == dot) *s++ = '.'; *s++ = '0' + (char)(x / d); x %= d
| ~~~~~^~~~~~~~~~~~~~~~~~~~~
In function ‘_mpd_to_string’:
cc1: note: destination object is likely at address zero
In function ‘word_to_string’,
inlined from ‘coeff_to_string’ at ./Modules/_decimal/libmpdec/io.c:410:13,
inlined from ‘_mpd_to_string’ at ./Modules/_decimal/libmpdec/io.c:611:18:
./Modules/_decimal/libmpdec/io.c:348:40: warning: writing 1 byte into a region of size 0 [-Wstringop-overflow=]
348 | if (s == dot) *s++ = '.'; *s++ = '0' + (char)(x / d); x %= d
| ~~~~~^~~~~~~~~~~~~~~~~~~~~
In function ‘_mpd_to_string’:
cc1: note: destination object is likely at address zero
cc1: note: destination object is likely at address zero
In function ‘word_to_string’,
inlined from ‘coeff_to_string’ at ./Modules/_decimal/libmpdec/io.c:410:13,
inlined from ‘_mpd_to_string’ at ./Modules/_decimal/libmpdec/io.c:611:18:
./Modules/_decimal/libmpdec/io.c:348:40: warning: writing 1 byte into a region of size 0 [-Wstringop-overflow=]
348 | if (s == dot) *s++ = '.'; *s++ = '0' + (char)(x / d); x %= d
| ~~~~~^~~~~~~~~~~~~~~~~~~~~
In function ‘_mpd_to_string’:
cc1: note: destination object is likely at address zero
In function ‘word_to_string’,
inlined from ‘coeff_to_string’ at ./Modules/_decimal/libmpdec/io.c:410:13,
inlined from ‘_mpd_to_string’ at ./Modules/_decimal/libmpdec/io.c:611:18:
./Modules/_decimal/libmpdec/io.c:348:40: warning: writing 1 byte into a region of size 0 [-Wstringop-overflow=]
348 | if (s == dot) *s++ = '.'; *s++ = '0' + (char)(x / d); x %= d
| ~~~~~^~~~~~~~~~~~~~~~~~~~~
In function ‘_mpd_to_string’:
cc1: note: destination object is likely at address zero
In function ‘word_to_string’,
inlined from ‘coeff_to_string’ at ./Modules/_decimal/libmpdec/io.c:410:13,
inlined from ‘_mpd_to_string’ at ./Modules/_decimal/libmpdec/io.c:611:18:
./Modules/_decimal/libmpdec/io.c:348:40: warning: writing 1 byte into a region of size 0 [-Wstringop-overflow=]
348 | if (s == dot) *s++ = '.'; *s++ = '0' + (char)(x / d); x %= d
| ~~~~~^~~~~~~~~~~~~~~~~~~~~
In function ‘_mpd_to_string’:
cc1: note: destination object is likely at address zero
In function ‘word_to_string’,
inlined from ‘coeff_to_string’ at ./Modules/_decimal/libmpdec/io.c:410:13,
inlined from ‘_mpd_to_string’ at ./Modules/_decimal/libmpdec/io.c:611:18:
./Modules/_decimal/libmpdec/io.c:348:40: warning: writing 1 byte into a region of size 0 [-Wstringop-overflow=]
348 | if (s == dot) *s++ = '.'; *s++ = '0' + (char)(x / d); x %= d
| ~~~~~^~~~~~~~~~~~~~~~~~~~~
In function ‘_mpd_to_string’:
cc1: note: destination object is likely at address zero
cc1: note: destination object is likely at address zero
In function ‘word_to_string’,
inlined from ‘coeff_to_string’ at ./Modules/_decimal/libmpdec/io.c:410:13,
inlined from ‘_mpd_to_string’ at ./Modules/_decimal/libmpdec/io.c:611:18:
./Modules/_decimal/libmpdec/io.c:348:40: warning: writing 1 byte into a region of size 0 [-Wstringop-overflow=]
348 | if (s == dot) *s++ = '.'; *s++ = '0' + (char)(x / d); x %= d
| ~~~~~^~~~~~~~~~~~~~~~~~~~~
In function ‘_mpd_to_string’:
cc1: note: destination object is likely at address zero
In function ‘word_to_string’,
inlined from ‘coeff_to_string’ at ./Modules/_decimal/libmpdec/io.c:410:13,
inlined from ‘_mpd_to_string’ at ./Modules/_decimal/libmpdec/io.c:611:18:
./Modules/_decimal/libmpdec/io.c:348:40: warning: writing 1 byte into a region of size 0 [-Wstringop-overflow=]
348 | if (s == dot) *s++ = '.'; *s++ = '0' + (char)(x / d); x %= d
| ~~~~~^~~~~~~~~~~~~~~~~~~~~
In function ‘_mpd_to_string’:
cc1: note: destination object is likely at address zero
In function ‘word_to_string’,
inlined from ‘coeff_to_string’ at ./Modules/_decimal/libmpdec/io.c:410:13,
inlined from ‘_mpd_to_string’ at ./Modules/_decimal/libmpdec/io.c:611:18:
./Modules/_decimal/libmpdec/io.c:348:40: warning: writing 1 byte into a region of size 0 [-Wstringop-overflow=]
348 | if (s == dot) *s++ = '.'; *s++ = '0' + (char)(x / d); x %= d
| ~~~~~^~~~~~~~~~~~~~~~~~~~~
In function ‘_mpd_to_string’:
cc1: note: destination object is likely at address zero
In function ‘word_to_string’,
inlined from ‘coeff_to_string’ at ./Modules/_decimal/libmpdec/io.c:410:13,
inlined from ‘_mpd_to_string’ at ./Modules/_decimal/libmpdec/io.c:611:18:
./Modules/_decimal/libmpdec/io.c:348:40: warning: writing 1 byte into a region of size 0 [-Wstringop-overflow=]
348 | if (s == dot) *s++ = '.'; *s++ = '0' + (char)(x / d); x %= d
| ~~~~~^~~~~~~~~~~~~~~~~~~~~
In function ‘_mpd_to_string’:
cc1: note: destination object is likely at address zero
cc1: note: destination object is likely at address zero
In function ‘word_to_string’,
inlined from ‘coeff_to_string’ at ./Modules/_decimal/libmpdec/io.c:410:13,
inlined from ‘_mpd_to_string’ at ./Modules/_decimal/libmpdec/io.c:611:18:
./Modules/_decimal/libmpdec/io.c:348:40: warning: writing 1 byte into a region of size 0 [-Wstringop-overflow=]
348 | if (s == dot) *s++ = '.'; *s++ = '0' + (char)(x / d); x %= d
| ~~~~~^~~~~~~~~~~~~~~~~~~~~
In function ‘_mpd_to_string’:
cc1: note: destination object is likely at address zero
In function ‘word_to_string’,
inlined from ‘coeff_to_string’ at ./Modules/_decimal/libmpdec/io.c:410:13,
inlined from ‘_mpd_to_string’ at ./Modules/_decimal/libmpdec/io.c:611:18:
./Modules/_decimal/libmpdec/io.c:348:40: warning: writing 1 byte into a region of size 0 [-Wstringop-overflow=]
348 | if (s == dot) *s++ = '.'; *s++ = '0' + (char)(x / d); x %= d
| ~~~~~^~~~~~~~~~~~~~~~~~~~~
In function ‘_mpd_to_string’:
cc1: note: destination object is likely at address zero
In function ‘word_to_string’,
inlined from ‘coeff_to_string’ at ./Modules/_decimal/libmpdec/io.c:410:13,
inlined from ‘_mpd_to_string’ at ./Modules/_decimal/libmpdec/io.c:611:18:
./Modules/_decimal/libmpdec/io.c:348:40: warning: writing 1 byte into a region of size 0 [-Wstringop-overflow=]
348 | if (s == dot) *s++ = '.'; *s++ = '0' + (char)(x / d); x %= d
| ~~~~~^~~~~~~~~~~~~~~~~~~~~
In function ‘_mpd_to_string’:
cc1: note: destination object is likely at address zero
In function ‘word_to_string’,
inlined from ‘coeff_to_string’ at ./Modules/_decimal/libmpdec/io.c:410:13,
inlined from ‘_mpd_to_string’ at ./Modules/_decimal/libmpdec/io.c:611:18:
./Modules/_decimal/libmpdec/io.c:348:40: warning: writing 1 byte into a region of size 0 [-Wstringop-overflow=]
348 | if (s == dot) *s++ = '.'; *s++ = '0' + (char)(x / d); x %= d
| ~~~~~^~~~~~~~~~~~~~~~~~~~~
In function ‘_mpd_to_string’:
cc1: note: destination object is likely at address zero
cc1: note: destination object is likely at address zero
In function ‘word_to_string’,
inlined from ‘coeff_to_string’ at ./Modules/_decimal/libmpdec/io.c:410:13,
inlined from ‘_mpd_to_string’ at ./Modules/_decimal/libmpdec/io.c:611:18:
./Modules/_decimal/libmpdec/io.c:348:40: warning: writing 1 byte into a region of size 0 [-Wstringop-overflow=]
348 | if (s == dot) *s++ = '.'; *s++ = '0' + (char)(x / d); x %= d
| ~~~~~^~~~~~~~~~~~~~~~~~~~~
In function ‘_mpd_to_string’:
cc1: note: destination object is likely at address zero
In function ‘word_to_string’,
inlined from ‘coeff_to_string’ at ./Modules/_decimal/libmpdec/io.c:410:13,
inlined from ‘_mpd_to_string’ at ./Modules/_decimal/libmpdec/io.c:611:18:
./Modules/_decimal/libmpdec/io.c:348:40: warning: writing 1 byte into a region of size 0 [-Wstringop-overflow=]
348 | if (s == dot) *s++ = '.'; *s++ = '0' + (char)(x / d); x %= d
| ~~~~~^~~~~~~~~~~~~~~~~~~~~
In function ‘_mpd_to_string’:
cc1: note: destination object is likely at address zero
In function ‘word_to_string’,
inlined from ‘coeff_to_string’ at ./Modules/_decimal/libmpdec/io.c:410:13,
inlined from ‘_mpd_to_string’ at ./Modules/_decimal/libmpdec/io.c:611:18:
./Modules/_decimal/libmpdec/io.c:348:40: warning: writing 1 byte into a region of size 0 [-Wstringop-overflow=]
348 | if (s == dot) *s++ = '.'; *s++ = '0' + (char)(x / d); x %= d
| ~~~~~^~~~~~~~~~~~~~~~~~~~~
In function ‘_mpd_to_string’:
cc1: note: destination object is likely at address zero
In function ‘word_to_string’,
inlined from ‘coeff_to_string’ at ./Modules/_decimal/libmpdec/io.c:410:13,
inlined from ‘_mpd_to_string’ at ./Modules/_decimal/libmpdec/io.c:611:18:
./Modules/_decimal/libmpdec/io.c:348:40: warning: writing 1 byte into a region of size 0 [-Wstringop-overflow=]
348 | if (s == dot) *s++ = '.'; *s++ = '0' + (char)(x / d); x %= d
| ~~~~~^~~~~~~~~~~~~~~~~~~~~
In function ‘_mpd_to_string’:
cc1: note: destination object is likely at address zero
In function ‘word_to_string’,
inlined from ‘coeff_to_string’ at ./Modules/_decimal/libmpdec/io.c:410:13,
inlined from ‘_mpd_to_string’ at ./Modules/_decimal/libmpdec/io.c:611:18:
./Modules/_decimal/libmpdec/io.c:348:40: warning: writing 1 byte into a region of size 0 [-Wstringop-overflow=]
348 | if (s == dot) *s++ = '.'; *s++ = '0' + (char)(x / d); x %= d
| ~~~~~^~~~~~~~~~~~~~~~~~~~~
In function ‘_mpd_to_string’:
cc1: note: destination object is likely at address zero
In function ‘word_to_string’,
inlined from ‘coeff_to_string’ at ./Modules/_decimal/libmpdec/io.c:410:13:
./Modules/_decimal/libmpdec/io.c:348:40: warning: writing 1 byte into a region of size 0 [-Wstringop-overflow=]
348 | if (s == dot) *s++ = '.'; *s++ = '0' + (char)(x / d); x %= d
| ~~~~~^~~~~~~~~~~~~~~~~~~~~
In function ‘coeff_to_string’:
cc1: note: destination object is likely at address zero
In function ‘word_to_string’,
inlined from ‘coeff_to_string’ at ./Modules/_decimal/libmpdec/io.c:410:13:
./Modules/_decimal/libmpdec/io.c:348:40: warning: writing 1 byte into a region of size 0 [-Wstringop-overflow=]
348 | if (s == dot) *s++ = '.'; *s++ = '0' + (char)(x / d); x %= d
| ~~~~~^~~~~~~~~~~~~~~~~~~~~
In function ‘coeff_to_string’:
cc1: note: destination object is likely at address zero
In function ‘word_to_string’,
inlined from ‘coeff_to_string’ at ./Modules/_decimal/libmpdec/io.c:410:13:
./Modules/_decimal/libmpdec/io.c:348:40: warning: writing 1 byte into a region of size 0 [-Wstringop-overflow=]
348 | if (s == dot) *s++ = '.'; *s++ = '0' + (char)(x / d); x %= d
| ~~~~~^~~~~~~~~~~~~~~~~~~~~
In function ‘coeff_to_string’:
cc1: note: destination object is likely at address zero
In function ‘word_to_string’,
inlined from ‘coeff_to_string’ at ./Modules/_decimal/libmpdec/io.c:410:13:
./Modules/_decimal/libmpdec/io.c:348:40: warning: writing 1 byte into a region of size 0 [-Wstringop-overflow=]
348 | if (s == dot) *s++ = '.'; *s++ = '0' + (char)(x / d); x %= d
| ~~~~~^~~~~~~~~~~~~~~~~~~~~
In function ‘coeff_to_string’:
cc1: note: destination object is likely at address zero
cc1: note: destination object is likely at address zero
In function ‘word_to_string’,
inlined from ‘coeff_to_string’ at ./Modules/_decimal/libmpdec/io.c:410:13:
./Modules/_decimal/libmpdec/io.c:348:40: warning: writing 1 byte into a region of size 0 [-Wstringop-overflow=]
348 | if (s == dot) *s++ = '.'; *s++ = '0' + (char)(x / d); x %= d
| ~~~~~^~~~~~~~~~~~~~~~~~~~~
In function ‘coeff_to_string’:
cc1: note: destination object is likely at address zero
In function ‘word_to_string’,
inlined from ‘coeff_to_string’ at ./Modules/_decimal/libmpdec/io.c:410:13:
./Modules/_decimal/libmpdec/io.c:348:40: warning: writing 1 byte into a region of size 0 [-Wstringop-overflow=]
348 | if (s == dot) *s++ = '.'; *s++ = '0' + (char)(x / d); x %= d
| ~~~~~^~~~~~~~~~~~~~~~~~~~~
In function ‘coeff_to_string’:
cc1: note: destination object is likely at address zero
In function ‘word_to_string’,
inlined from ‘coeff_to_string’ at ./Modules/_decimal/libmpdec/io.c:410:13:
./Modules/_decimal/libmpdec/io.c:348:40: warning: writing 1 byte into a region of size 0 [-Wstringop-overflow=]
348 | if (s == dot) *s++ = '.'; *s++ = '0' + (char)(x / d); x %= d
| ~~~~~^~~~~~~~~~~~~~~~~~~~~
In function ‘coeff_to_string’:
cc1: note: destination object is likely at address zero
In function ‘word_to_string’,
inlined from ‘coeff_to_string’ at ./Modules/_decimal/libmpdec/io.c:410:13:
./Modules/_decimal/libmpdec/io.c:348:40: warning: writing 1 byte into a region of size 0 [-Wstringop-overflow=]
348 | if (s == dot) *s++ = '.'; *s++ = '0' + (char)(x / d); x %= d
| ~~~~~^~~~~~~~~~~~~~~~~~~~~
In function ‘coeff_to_string’:
cc1: note: destination object is likely at address zero
cc1: note: destination object is likely at address zero
In function ‘word_to_string’,
inlined from ‘coeff_to_string’ at ./Modules/_decimal/libmpdec/io.c:410:13:
./Modules/_decimal/libmpdec/io.c:348:40: warning: writing 1 byte into a region of size 0 [-Wstringop-overflow=]
348 | if (s == dot) *s++ = '.'; *s++ = '0' + (char)(x / d); x %= d
| ~~~~~^~~~~~~~~~~~~~~~~~~~~
In function ‘coeff_to_string’:
cc1: note: destination object is likely at address zero
In function ‘word_to_string’,
inlined from ‘coeff_to_string’ at ./Modules/_decimal/libmpdec/io.c:410:13:
./Modules/_decimal/libmpdec/io.c:348:40: warning: writing 1 byte into a region of size 0 [-Wstringop-overflow=]
348 | if (s == dot) *s++ = '.'; *s++ = '0' + (char)(x / d); x %= d
| ~~~~~^~~~~~~~~~~~~~~~~~~~~
In function ‘coeff_to_string’:
cc1: note: destination object is likely at address zero
In function ‘word_to_string’,
inlined from ‘coeff_to_string’ at ./Modules/_decimal/libmpdec/io.c:410:13:
./Modules/_decimal/libmpdec/io.c:348:40: warning: writing 1 byte into a region of size 0 [-Wstringop-overflow=]
348 | if (s == dot) *s++ = '.'; *s++ = '0' + (char)(x / d); x %= d
| ~~~~~^~~~~~~~~~~~~~~~~~~~~
In function ‘coeff_to_string’:
cc1: note: destination object is likely at address zero
In function ‘word_to_string’,
inlined from ‘coeff_to_string’ at ./Modules/_decimal/libmpdec/io.c:410:13:
./Modules/_decimal/libmpdec/io.c:348:40: warning: writing 1 byte into a region of size 0 [-Wstringop-overflow=]
348 | if (s == dot) *s++ = '.'; *s++ = '0' + (char)(x / d); x %= d
| ~~~~~^~~~~~~~~~~~~~~~~~~~~
In function ‘coeff_to_string’:
cc1: note: destination object is likely at address zero
cc1: note: destination object is likely at address zero
In function ‘word_to_string’,
inlined from ‘coeff_to_string’ at ./Modules/_decimal/libmpdec/io.c:410:13:
./Modules/_decimal/libmpdec/io.c:348:40: warning: writing 1 byte into a region of size 0 [-Wstringop-overflow=]
348 | if (s == dot) *s++ = '.'; *s++ = '0' + (char)(x / d); x %= d
| ~~~~~^~~~~~~~~~~~~~~~~~~~~
In function ‘coeff_to_string’:
cc1: note: destination object is likely at address zero
In function ‘word_to_string’,
inlined from ‘coeff_to_string’ at ./Modules/_decimal/libmpdec/io.c:410:13:
./Modules/_decimal/libmpdec/io.c:348:40: warning: writing 1 byte into a region of size 0 [-Wstringop-overflow=]
348 | if (s == dot) *s++ = '.'; *s++ = '0' + (char)(x / d); x %= d
| ~~~~~^~~~~~~~~~~~~~~~~~~~~
In function ‘coeff_to_string’:
cc1: note: destination object is likely at address zero
In function ‘word_to_string’,
inlined from ‘coeff_to_string’ at ./Modules/_decimal/libmpdec/io.c:410:13:
./Modules/_decimal/libmpdec/io.c:348:40: warning: writing 1 byte into a region of size 0 [-Wstringop-overflow=]
348 | if (s == dot) *s++ = '.'; *s++ = '0' + (char)(x / d); x %= d
| ~~~~~^~~~~~~~~~~~~~~~~~~~~
In function ‘coeff_to_string’:
cc1: note: destination object is likely at address zero
In function ‘word_to_string’,
inlined from ‘coeff_to_string’ at ./Modules/_decimal/libmpdec/io.c:410:13:
./Modules/_decimal/libmpdec/io.c:348:40: warning: writing 1 byte into a region of size 0 [-Wstringop-overflow=]
348 | if (s == dot) *s++ = '.'; *s++ = '0' + (char)(x / d); x %= d
| ~~~~~^~~~~~~~~~~~~~~~~~~~~
In function ‘coeff_to_string’:
cc1: note: destination object is likely at address zero
cc1: note: destination object is likely at address zero
In function ‘word_to_string’,
inlined from ‘coeff_to_string’ at ./Modules/_decimal/libmpdec/io.c:410:13:
./Modules/_decimal/libmpdec/io.c:348:40: warning: writing 1 byte into a region of size 0 [-Wstringop-overflow=]
348 | if (s == dot) *s++ = '.'; *s++ = '0' + (char)(x / d); x %= d
| ~~~~~^~~~~~~~~~~~~~~~~~~~~
In function ‘coeff_to_string’:
cc1: note: destination object is likely at address zero
In function ‘word_to_string’,
inlined from ‘coeff_to_string’ at ./Modules/_decimal/libmpdec/io.c:410:13:
./Modules/_decimal/libmpdec/io.c:348:40: warning: writing 1 byte into a region of size 0 [-Wstringop-overflow=]
348 | if (s == dot) *s++ = '.'; *s++ = '0' + (char)(x / d); x %= d
| ~~~~~^~~~~~~~~~~~~~~~~~~~~
In function ‘coeff_to_string’:
cc1: note: destination object is likely at address zero
In function ‘word_to_string’,
inlined from ‘coeff_to_string’ at ./Modules/_decimal/libmpdec/io.c:410:13:
./Modules/_decimal/libmpdec/io.c:348:40: warning: writing 1 byte into a region of size 0 [-Wstringop-overflow=]
348 | if (s == dot) *s++ = '.'; *s++ = '0' + (char)(x / d); x %= d
| ~~~~~^~~~~~~~~~~~~~~~~~~~~
In function ‘coeff_to_string’:
cc1: note: destination object is likely at address zero
In function ‘word_to_string’,
inlined from ‘coeff_to_string’ at ./Modules/_decimal/libmpdec/io.c:410:13:
./Modules/_decimal/libmpdec/io.c:348:40: warning: writing 1 byte into a region of size 0 [-Wstringop-overflow=]
348 | if (s == dot) *s++ = '.'; *s++ = '0' + (char)(x / d); x %= d
| ~~~~~^~~~~~~~~~~~~~~~~~~~~
In function ‘coeff_to_string’:
cc1: note: destination object is likely at address zero
cc1: note: destination object is likely at address zero
In function ‘word_to_string’,
inlined from ‘coeff_to_string’ at ./Modules/_decimal/libmpdec/io.c:410:13:
./Modules/_decimal/libmpdec/io.c:348:40: warning: writing 1 byte into a region of size 0 [-Wstringop-overflow=]
348 | if (s == dot) *s++ = '.'; *s++ = '0' + (char)(x / d); x %= d
| ~~~~~^~~~~~~~~~~~~~~~~~~~~
In function ‘coeff_to_string’:
cc1: note: destination object is likely at address zero
In function ‘word_to_string’,
inlined from ‘coeff_to_string’ at ./Modules/_decimal/libmpdec/io.c:410:13:
./Modules/_decimal/libmpdec/io.c:348:40: warning: writing 1 byte into a region of size 0 [-Wstringop-overflow=]
348 | if (s == dot) *s++ = '.'; *s++ = '0' + (char)(x / d); x %= d
| ~~~~~^~~~~~~~~~~~~~~~~~~~~
In function ‘coeff_to_string’:
cc1: note: destination object is likely at address zero
In function ‘word_to_string’,
inlined from ‘coeff_to_string’ at ./Modules/_decimal/libmpdec/io.c:410:13:
./Modules/_decimal/libmpdec/io.c:348:40: warning: writing 1 byte into a region of size 0 [-Wstringop-overflow=]
348 | if (s == dot) *s++ = '.'; *s++ = '0' + (char)(x / d); x %= d
| ~~~~~^~~~~~~~~~~~~~~~~~~~~
In function ‘coeff_to_string’:
cc1: note: destination object is likely at address zero
In function ‘word_to_string’,
inlined from ‘coeff_to_string’ at ./Modules/_decimal/libmpdec/io.c:410:13:
./Modules/_decimal/libmpdec/io.c:348:40: warning: writing 1 byte into a region of size 0 [-Wstringop-overflow=]
348 | if (s == dot) *s++ = '.'; *s++ = '0' + (char)(x / d); x %= d
| ~~~~~^~~~~~~~~~~~~~~~~~~~~
In function ‘coeff_to_string’:
cc1: note: destination object is likely at address zero
cc1: note: destination object is likely at address zero
In function ‘word_to_string’,
inlined from ‘coeff_to_string’ at ./Modules/_decimal/libmpdec/io.c:410:13:
./Modules/_decimal/libmpdec/io.c:348:40: warning: writing 1 byte into a region of size 0 [-Wstringop-overflow=]
348 | if (s == dot) *s++ = '.'; *s++ = '0' + (char)(x / d); x %= d
| ~~~~~^~~~~~~~~~~~~~~~~~~~~
In function ‘coeff_to_string’:
cc1: note: destination object is likely at address zero
In function ‘word_to_string’,
inlined from ‘coeff_to_string’ at ./Modules/_decimal/libmpdec/io.c:410:13:
./Modules/_decimal/libmpdec/io.c:348:40: warning: writing 1 byte into a region of size 0 [-Wstringop-overflow=]
348 | if (s == dot) *s++ = '.'; *s++ = '0' + (char)(x / d); x %= d
| ~~~~~^~~~~~~~~~~~~~~~~~~~~
In function ‘coeff_to_string’:
cc1: note: destination object is likely at address zero
In function ‘word_to_string’,
inlined from ‘coeff_to_string’ at ./Modules/_decimal/libmpdec/io.c:410:13:
./Modules/_decimal/libmpdec/io.c:348:40: warning: writing 1 byte into a region of size 0 [-Wstringop-overflow=]
348 | if (s == dot) *s++ = '.'; *s++ = '0' + (char)(x / d); x %= d
| ~~~~~^~~~~~~~~~~~~~~~~~~~~
In function ‘coeff_to_string’:
cc1: note: destination object is likely at address zero
In function ‘word_to_string’,
inlined from ‘coeff_to_string’ at ./Modules/_decimal/libmpdec/io.c:410:13:
./Modules/_decimal/libmpdec/io.c:348:40: warning: writing 1 byte into a region of size 0 [-Wstringop-overflow=]
348 | if (s == dot) *s++ = '.'; *s++ = '0' + (char)(x / d); x %= d
| ~~~~~^~~~~~~~~~~~~~~~~~~~~
In function ‘coeff_to_string’:
cc1: note: destination object is likely at address zero
cc1: note: destination object is likely at address zero
In function ‘word_to_string’,
inlined from ‘coeff_to_string’ at ./Modules/_decimal/libmpdec/io.c:410:13:
./Modules/_decimal/libmpdec/io.c:348:40: warning: writing 1 byte into a region of size 0 [-Wstringop-overflow=]
348 | if (s == dot) *s++ = '.'; *s++ = '0' + (char)(x / d); x %= d
| ~~~~~^~~~~~~~~~~~~~~~~~~~~
In function ‘coeff_to_string’:
cc1: note: destination object is likely at address zero
In function ‘word_to_string’,
inlined from ‘coeff_to_string’ at ./Modules/_decimal/libmpdec/io.c:410:13:
./Modules/_decimal/libmpdec/io.c:348:40: warning: writing 1 byte into a region of size 0 [-Wstringop-overflow=]
348 | if (s == dot) *s++ = '.'; *s++ = '0' + (char)(x / d); x %= d
| ~~~~~^~~~~~~~~~~~~~~~~~~~~
In function ‘coeff_to_string’:
cc1: note: destination object is likely at address zero
In function ‘word_to_string’,
inlined from ‘coeff_to_string’ at ./Modules/_decimal/libmpdec/io.c:410:13:
./Modules/_decimal/libmpdec/io.c:348:40: warning: writing 1 byte into a region of size 0 [-Wstringop-overflow=]
348 | if (s == dot) *s++ = '.'; *s++ = '0' + (char)(x / d); x %= d
| ~~~~~^~~~~~~~~~~~~~~~~~~~~
In function ‘coeff_to_string’:
cc1: note: destination object is likely at address zero
In function ‘word_to_string’,
inlined from ‘coeff_to_string’ at ./Modules/_decimal/libmpdec/io.c:410:13:
./Modules/_decimal/libmpdec/io.c:348:40: warning: writing 1 byte into a region of size 0 [-Wstringop-overflow=]
348 | if (s == dot) *s++ = '.'; *s++ = '0' + (char)(x / d); x %= d
| ~~~~~^~~~~~~~~~~~~~~~~~~~~
In function ‘coeff_to_string’:
cc1: note: destination object is likely at address zero
In function ‘word_to_string’,
inlined from ‘coeff_to_string’ at ./Modules/_decimal/libmpdec/io.c:410:13:
./Modules/_decimal/libmpdec/io.c:348:40: warning: writing 1 byte into a region of size 0 [-Wstringop-overflow=]
348 | if (s == dot) *s++ = '.'; *s++ = '0' + (char)(x / d); x %= d
| ~~~~~^~~~~~~~~~~~~~~~~~~~~
In function ‘coeff_to_string’:
cc1: note: destination object is likely at address zero
In function ‘utf8_toUtf8’,
inlined from ‘toAscii’ at ./Modules/expat/xmltok.c:1043:3,
inlined from ‘doParseXmlDecl’ at ./Modules/expat/xmltok.c:1197:13:
./Modules/expat/xmltok.c:390:5: warning: ‘memcpy’ writing 2 or more bytes into a region of size 1 overflows the destination [-Wstringop-overflow=]
390 | memcpy(*toP, *fromP, bytesToCopy);
| ^~~~~~~~~~~~~~~~~~~~~~~~~~~~~~~~~
./Modules/expat/xmltok.c: In function ‘doParseXmlDecl’:
./Modules/expat/xmltok.c:1041:8: note: destination object ‘buf’ of size 1
1041 | char buf[1];
| ^~~
In function ‘utf8_toUtf8’,
inlined from ‘toAscii’ at ./Modules/expat/xmltok.c:1043:3,
inlined from ‘parsePseudoAttribute’ at ./Modules/expat/xmltok.c:1075:9:
./Modules/expat/xmltok.c:390:5: warning: ‘memcpy’ writing 2 or more bytes into a region of size 1 overflows the destination [-Wstringop-overflow=]
390 | memcpy(*toP, *fromP, bytesToCopy);
| ^~~~~~~~~~~~~~~~~~~~~~~~~~~~~~~~~
./Modules/expat/xmltok.c: In function ‘parsePseudoAttribute’:
./Modules/expat/xmltok.c:1041:8: note: destination object ‘buf’ of size 1
1041 | char buf[1];
| ^~~
In function ‘utf8_toUtf8’,
inlined from ‘toAscii’ at ./Modules/expat/xmltok.c:1043:3,
inlined from ‘parsePseudoAttribute’ at ./Modules/expat/xmltok.c:1081:12:
./Modules/expat/xmltok.c:390:5: warning: ‘memcpy’ writing 2 or more bytes into a region of size 1 overflows the destination [-Wstringop-overflow=]
390 | memcpy(*toP, *fromP, bytesToCopy);
| ^~~~~~~~~~~~~~~~~~~~~~~~~~~~~~~~~
./Modules/expat/xmltok.c: In function ‘parsePseudoAttribute’:
./Modules/expat/xmltok.c:1041:8: note: destination object ‘buf’ of size 1
1041 | char buf[1];
| ^~~
In function ‘utf8_toUtf8’,
inlined from ‘toAscii’ at ./Modules/expat/xmltok.c:1043:3,
inlined from ‘parsePseudoAttribute’ at ./Modules/expat/xmltok.c:1081:12:
./Modules/expat/xmltok.c:390:5: warning: ‘memcpy’ writing 2 or more bytes into a region of size 1 overflows the destination [-Wstringop-overflow=]
390 | memcpy(*toP, *fromP, bytesToCopy);
| ^~~~~~~~~~~~~~~~~~~~~~~~~~~~~~~~~
./Modules/expat/xmltok.c: In function ‘parsePseudoAttribute’:
./Modules/expat/xmltok.c:1041:8: note: destination object ‘buf’ of size 1
1041 | char buf[1];
| ^~~
In function ‘utf8_toUtf8’,
inlined from ‘toAscii’ at ./Modules/expat/xmltok.c:1043:3,
inlined from ‘parsePseudoAttribute’ at ./Modules/expat/xmltok.c:1088:9:
./Modules/expat/xmltok.c:390:5: warning: ‘memcpy’ writing 2 or more bytes into a region of size 1 overflows the destination [-Wstringop-overflow=]
390 | memcpy(*toP, *fromP, bytesToCopy);
| ^~~~~~~~~~~~~~~~~~~~~~~~~~~~~~~~~
./Modules/expat/xmltok.c: In function ‘parsePseudoAttribute’:
./Modules/expat/xmltok.c:1041:8: note: destination object ‘buf’ of size 1
1041 | char buf[1];
| ^~~
In function ‘utf8_toUtf8’,
inlined from ‘toAscii’ at ./Modules/expat/xmltok.c:1043:3,
inlined from ‘parsePseudoAttribute’ at ./Modules/expat/xmltok.c:1088:9:
./Modules/expat/xmltok.c:390:5: warning: ‘memcpy’ writing 2 or more bytes into a region of size 1 overflows the destination [-Wstringop-overflow=]
390 | memcpy(*toP, *fromP, bytesToCopy);
| ^~~~~~~~~~~~~~~~~~~~~~~~~~~~~~~~~
./Modules/expat/xmltok.c: In function ‘parsePseudoAttribute’:
./Modules/expat/xmltok.c:1041:8: note: destination object ‘buf’ of size 1
1041 | char buf[1];
| ^~~
In function ‘utf8_toUtf8’,
inlined from ‘toAscii’ at ./Modules/expat/xmltok.c:1043:3,
inlined from ‘parsePseudoAttribute’ at ./Modules/expat/xmltok.c:1115:7:
./Modules/expat/xmltok.c:390:5: warning: ‘memcpy’ writing 2 or more bytes into a region of size 1 overflows the destination [-Wstringop-overflow=]
390 | memcpy(*toP, *fromP, bytesToCopy);
| ^~~~~~~~~~~~~~~~~~~~~~~~~~~~~~~~~
./Modules/expat/xmltok.c: In function ‘parsePseudoAttribute’:
./Modules/expat/xmltok.c:1041:8: note: destination object ‘buf’ of size 1
1041 | char buf[1];
| ^~~
In function ‘utf8_toUtf8’,
inlined from ‘toAscii’ at ./Modules/expat/xmltok.c:1043:3,
inlined from ‘parsePseudoAttribute’ at ./Modules/expat/xmltok.c:1128:9:
./Modules/expat/xmltok.c:390:5: warning: ‘memcpy’ writing 2 or more bytes into a region of size 1 overflows the destination [-Wstringop-overflow=]
390 | memcpy(*toP, *fromP, bytesToCopy);
| ^~~~~~~~~~~~~~~~~~~~~~~~~~~~~~~~~
./Modules/expat/xmltok.c: In function ‘parsePseudoAttribute’:
./Modules/expat/xmltok.c:1041:8: note: destination object ‘buf’ of size 1
1041 | char buf[1];
| ^~~
In function ‘utf8_toUtf8’,
inlined from ‘toAscii’ at ./Modules/expat/xmltok.c:1043:3,
inlined from ‘parsePseudoAttribute’ at ./Modules/expat/xmltok.c:1128:9:
./Modules/expat/xmltok.c:390:5: warning: ‘memcpy’ writing 2 or more bytes into a region of size 1 overflows the destination [-Wstringop-overflow=]
390 | memcpy(*toP, *fromP, bytesToCopy);
| ^~~~~~~~~~~~~~~~~~~~~~~~~~~~~~~~~
./Modules/expat/xmltok.c: In function ‘parsePseudoAttribute’:
./Modules/expat/xmltok.c:1041:8: note: destination object ‘buf’ of size 1
1041 | char buf[1];
| ^~~
In function ‘utf8_toUtf8’,
inlined from ‘toAscii’ at ./Modules/expat/xmltok.c:1043:3,
inlined from ‘doParseXmlDecl’ at ./Modules/expat/xmltok.c:1197:13:
./Modules/expat/xmltok.c:390:5: warning: ‘memcpy’ writing 2 or more bytes into a region of size 1 overflows the destination [-Wstringop-overflow=]
390 | memcpy(*toP, *fromP, bytesToCopy);
| ^
./Modules/expat/xmltok.c: In function ‘doParseXmlDecl’:
./Modules/expat/xmltok.c:1041:8: note: destination object ‘buf’ of size 1
1041 | char buf[1];
| ^
In function ‘utf8_toUtf8’,
inlined from ‘toAscii’ at ./Modules/expat/xmltok.c:1043:3,
inlined from ‘parsePseudoAttribute’ at ./Modules/expat/xmltok.c:1075:9:
./Modules/expat/xmltok.c:390:5: warning: ‘memcpy’ writing 2 or more bytes into a region of size 1 overflows the destination [-Wstringop-overflow=]
390 | memcpy(*toP, *fromP, bytesToCopy);
| ^
./Modules/expat/xmltok.c: In function ‘parsePseudoAttribute’:
./Modules/expat/xmltok.c:1041:8: note: destination object ‘buf’ of size 1
1041 | char buf[1];
| ^
In function ‘utf8_toUtf8’,
inlined from ‘toAscii’ at ./Modules/expat/xmltok.c:1043:3,
inlined from ‘parsePseudoAttribute’ at ./Modules/expat/xmltok.c:1081:12:
./Modules/expat/xmltok.c:390:5: warning: ‘memcpy’ writing 2 or more bytes into a region of size 1 overflows the destination [-Wstringop-overflow=]
390 | memcpy(*toP, *fromP, bytesToCopy);
| ^
./Modules/expat/xmltok.c: In function ‘parsePseudoAttribute’:
./Modules/expat/xmltok.c:1041:8: note: destination object ‘buf’ of size 1
1041 | char buf[1];
| ^
In function ‘utf8_toUtf8’,
inlined from ‘toAscii’ at ./Modules/expat/xmltok.c:1043:3,
inlined from ‘parsePseudoAttribute’ at ./Modules/expat/xmltok.c:1081:12:
./Modules/expat/xmltok.c:390:5: warning: ‘memcpy’ writing 2 or more bytes into a region of size 1 overflows the destination [-Wstringop-overflow=]
390 | memcpy(*toP, *fromP, bytesToCopy);
| ^
./Modules/expat/xmltok.c: In function ‘parsePseudoAttribute’:
./Modules/expat/xmltok.c:1041:8: note: destination object ‘buf’ of size 1
1041 | char buf[1];
| ^
In function ‘utf8_toUtf8’,
inlined from ‘toAscii’ at ./Modules/expat/xmltok.c:1043:3,
inlined from ‘parsePseudoAttribute’ at ./Modules/expat/xmltok.c:1088:9:
./Modules/expat/xmltok.c:390:5: warning: ‘memcpy’ writing 2 or more bytes into a region of size 1 overflows the destination [-Wstringop-overflow=]
390 | memcpy(*toP, *fromP, bytesToCopy);
| ^
./Modules/expat/xmltok.c: In function ‘parsePseudoAttribute’:
./Modules/expat/xmltok.c:1041:8: note: destination object ‘buf’ of size 1
1041 | char buf[1];
| ^
In function ‘utf8_toUtf8’,
inlined from ‘toAscii’ at ./Modules/expat/xmltok.c:1043:3,
inlined from ‘parsePseudoAttribute’ at ./Modules/expat/xmltok.c:1088:9:
./Modules/expat/xmltok.c:390:5: warning: ‘memcpy’ writing 2 or more bytes into a region of size 1 overflows the destination [-Wstringop-overflow=]
390 | memcpy(*toP, *fromP, bytesToCopy);
| ^
./Modules/expat/xmltok.c: In function ‘parsePseudoAttribute’:
./Modules/expat/xmltok.c:1041:8: note: destination object ‘buf’ of size 1
1041 | char buf[1];
| ^
In function ‘utf8_toUtf8’,
inlined from ‘toAscii’ at ./Modules/expat/xmltok.c:1043:3,
inlined from ‘parsePseudoAttribute’ at ./Modules/expat/xmltok.c:1115:7:
./Modules/expat/xmltok.c:390:5: warning: ‘memcpy’ writing 2 or more bytes into a region of size 1 overflows the destination [-Wstringop-overflow=]
390 | memcpy(*toP, *fromP, bytesToCopy);
| ^
./Modules/expat/xmltok.c: In function ‘parsePseudoAttribute’:
./Modules/expat/xmltok.c:1041:8: note: destination object ‘buf’ of size 1
1041 | char buf[1];
| ^
In function ‘utf8_toUtf8’,
inlined from ‘toAscii’ at ./Modules/expat/xmltok.c:1043:3,
inlined from ‘parsePseudoAttribute’ at ./Modules/expat/xmltok.c:1128:9:
./Modules/expat/xmltok.c:390:5: warning: ‘memcpy’ writing 2 or more bytes into a region of size 1 overflows the destination [-Wstringop-overflow=]
390 | memcpy(*toP, *fromP, bytesToCopy);
| ^
./Modules/expat/xmltok.c: In function ‘parsePseudoAttribute’:
./Modules/expat/xmltok.c:1041:8: note: destination object ‘buf’ of size 1
1041 | char buf[1];
| ^
In function ‘utf8_toUtf8’,
inlined from ‘toAscii’ at ./Modules/expat/xmltok.c:1043:3,
inlined from ‘parsePseudoAttribute’ at ./Modules/expat/xmltok.c:1128:9:
./Modules/expat/xmltok.c:390:5: warning: ‘memcpy’ writing 2 or more bytes into a region of size 1 overflows the destination [-Wstringop-overflow=]
390 | memcpy(*toP, *fromP, bytesToCopy);
| ^
./Modules/expat/xmltok.c: In function ‘parsePseudoAttribute’:
./Modules/expat/xmltok.c:1041:8: note: destination object ‘buf’ of size 1
1041 | char buf[1];
| ^
In function ‘word_to_string’,
inlined from ‘coeff_to_string’ at ./Modules/_decimal/libmpdec/io.c:410:13:
./Modules/_decimal/libmpdec/io.c:359:14: warning: writing 1 byte into a region of size 0 [-Wstringop-overflow=]
359 | case 15: EXTRACT_DIGIT(s, x, 100000000000000ULL, dot);
| ^
In function ‘coeff_to_string’:
lto1: note: destination object is likely at address zero
In function ‘word_to_string’,
inlined from ‘coeff_to_string’ at ./Modules/_decimal/libmpdec/io.c:410:13:
./Modules/_decimal/libmpdec/io.c:358:14: warning: writing 1 byte into a region of size 0 [-Wstringop-overflow=]
358 | case 16: EXTRACT_DIGIT(s, x, 1000000000000000ULL, dot);
| ^
In function ‘coeff_to_string’:
lto1: note: destination object is likely at address zero
In function ‘word_to_string’,
inlined from ‘coeff_to_string’ at ./Modules/_decimal/libmpdec/io.c:410:13:
./Modules/_decimal/libmpdec/io.c:359:14: warning: writing 1 byte into a region of size 0 [-Wstringop-overflow=]
359 | case 15: EXTRACT_DIGIT(s, x, 100000000000000ULL, dot);
| ^
In function ‘coeff_to_string’:
lto1: note: destination object is likely at address zero
In function ‘word_to_string’,
inlined from ‘coeff_to_string’ at ./Modules/_decimal/libmpdec/io.c:410:13:
./Modules/_decimal/libmpdec/io.c:360:14: warning: writing 1 byte into a region of size 0 [-Wstringop-overflow=]
360 | case 14: EXTRACT_DIGIT(s, x, 10000000000000ULL, dot);
| ^
In function ‘coeff_to_string’:
lto1: note: destination object is likely at address zero
lto1: note: destination object is likely at address zero
In function ‘word_to_string’,
inlined from ‘coeff_to_string’ at ./Modules/_decimal/libmpdec/io.c:410:13:
./Modules/_decimal/libmpdec/io.c:357:14: warning: writing 1 byte into a region of size 0 [-Wstringop-overflow=]
357 | case 17: EXTRACT_DIGIT(s, x, 10000000000000000ULL, dot);
| ^
In function ‘coeff_to_string’:
lto1: note: destination object is likely at address zero
In function ‘word_to_string’,
inlined from ‘coeff_to_string’ at ./Modules/_decimal/libmpdec/io.c:410:13:
./Modules/_decimal/libmpdec/io.c:356:14: warning: writing 1 byte into a region of size 0 [-Wstringop-overflow=]
356 | case 18: EXTRACT_DIGIT(s, x, 100000000000000000ULL, dot);
| ^
In function ‘coeff_to_string’:
lto1: note: destination object is likely at address zero
In function ‘word_to_string’,
inlined from ‘coeff_to_string’ at ./Modules/_decimal/libmpdec/io.c:410:13:
./Modules/_decimal/libmpdec/io.c:357:14: warning: writing 1 byte into a region of size 0 [-Wstringop-overflow=]
357 | case 17: EXTRACT_DIGIT(s, x, 10000000000000000ULL, dot);
| ^
In function ‘coeff_to_string’:
lto1: note: destination object is likely at address zero
In function ‘word_to_string’,
inlined from ‘coeff_to_string’ at ./Modules/_decimal/libmpdec/io.c:410:13:
./Modules/_decimal/libmpdec/io.c:358:14: warning: writing 1 byte into a region of size 0 [-Wstringop-overflow=]
358 | case 16: EXTRACT_DIGIT(s, x, 1000000000000000ULL, dot);
| ^
In function ‘coeff_to_string’:
lto1: note: destination object is likely at address zero
lto1: note: destination object is likely at address zero
In function ‘word_to_string’,
inlined from ‘coeff_to_string’ at ./Modules/_decimal/libmpdec/io.c:410:13:
./Modules/_decimal/libmpdec/io.c:361:14: warning: writing 1 byte into a region of size 0 [-Wstringop-overflow=]
361 | case 13: EXTRACT_DIGIT(s, x, 1000000000000ULL, dot);
| ^
In function ‘coeff_to_string’:
lto1: note: destination object is likely at address zero
In function ‘word_to_string’,
inlined from ‘coeff_to_string’ at ./Modules/_decimal/libmpdec/io.c:410:13:
./Modules/_decimal/libmpdec/io.c:360:14: warning: writing 1 byte into a region of size 0 [-Wstringop-overflow=]
360 | case 14: EXTRACT_DIGIT(s, x, 10000000000000ULL, dot);
| ^
In function ‘coeff_to_string’:
lto1: note: destination object is likely at address zero
In function ‘word_to_string’,
inlined from ‘coeff_to_string’ at ./Modules/_decimal/libmpdec/io.c:410:13:
./Modules/_decimal/libmpdec/io.c:361:14: warning: writing 1 byte into a region of size 0 [-Wstringop-overflow=]
361 | case 13: EXTRACT_DIGIT(s, x, 1000000000000ULL, dot);
| ^
In function ‘coeff_to_string’:
lto1: note: destination object is likely at address zero
In function ‘word_to_string’,
inlined from ‘coeff_to_string’ at ./Modules/_decimal/libmpdec/io.c:410:13:
./Modules/_decimal/libmpdec/io.c:362:14: warning: writing 1 byte into a region of size 0 [-Wstringop-overflow=]
362 | case 12: EXTRACT_DIGIT(s, x, 100000000000ULL, dot);
| ^
In function ‘coeff_to_string’:
lto1: note: destination object is likely at address zero
lto1: note: destination object is likely at address zero
In function ‘word_to_string’,
inlined from ‘coeff_to_string’ at ./Modules/_decimal/libmpdec/io.c:410:13:
./Modules/_decimal/libmpdec/io.c:363:14: warning: writing 1 byte into a region of size 0 [-Wstringop-overflow=]
363 | case 11: EXTRACT_DIGIT(s, x, 10000000000ULL, dot);
| ^
In function ‘coeff_to_string’:
lto1: note: destination object is likely at address zero
In function ‘word_to_string’,
inlined from ‘coeff_to_string’ at ./Modules/_decimal/libmpdec/io.c:410:13:
./Modules/_decimal/libmpdec/io.c:362:14: warning: writing 1 byte into a region of size 0 [-Wstringop-overflow=]
362 | case 12: EXTRACT_DIGIT(s, x, 100000000000ULL, dot);
| ^
In function ‘coeff_to_string’:
lto1: note: destination object is likely at address zero
In function ‘word_to_string’,
inlined from ‘coeff_to_string’ at ./Modules/_decimal/libmpdec/io.c:410:13:
./Modules/_decimal/libmpdec/io.c:363:14: warning: writing 1 byte into a region of size 0 [-Wstringop-overflow=]
363 | case 11: EXTRACT_DIGIT(s, x, 10000000000ULL, dot);
| ^
In function ‘coeff_to_string’:
lto1: note: destination object is likely at address zero
In function ‘word_to_string’,
inlined from ‘coeff_to_string’ at ./Modules/_decimal/libmpdec/io.c:410:13:
./Modules/_decimal/libmpdec/io.c:365:14: warning: writing 1 byte into a region of size 0 [-Wstringop-overflow=]
365 | case 10: EXTRACT_DIGIT(s, x, 1000000000UL, dot);
| ^
In function ‘coeff_to_string’:
lto1: note: destination object is likely at address zero
lto1: note: destination object is likely at address zero
In function ‘word_to_string’,
inlined from ‘coeff_to_string’ at ./Modules/_decimal/libmpdec/io.c:410:13:
./Modules/_decimal/libmpdec/io.c:366:14: warning: writing 1 byte into a region of size 0 [-Wstringop-overflow=]
366 | case 9: EXTRACT_DIGIT(s, x, 100000000UL, dot);
| ^
In function ‘coeff_to_string’:
lto1: note: destination object is likely at address zero
In function ‘word_to_string’,
inlined from ‘coeff_to_string’ at ./Modules/_decimal/libmpdec/io.c:410:13:
./Modules/_decimal/libmpdec/io.c:365:14: warning: writing 1 byte into a region of size 0 [-Wstringop-overflow=]
365 | case 10: EXTRACT_DIGIT(s, x, 1000000000UL, dot);
| ^
In function ‘coeff_to_string’:
lto1: note: destination object is likely at address zero
In function ‘word_to_string’,
inlined from ‘coeff_to_string’ at ./Modules/_decimal/libmpdec/io.c:410:13:
./Modules/_decimal/libmpdec/io.c:366:14: warning: writing 1 byte into a region of size 0 [-Wstringop-overflow=]
366 | case 9: EXTRACT_DIGIT(s, x, 100000000UL, dot);
| ^
In function ‘coeff_to_string’:
lto1: note: destination object is likely at address zero
In function ‘word_to_string’,
inlined from ‘coeff_to_string’ at ./Modules/_decimal/libmpdec/io.c:410:13:
./Modules/_decimal/libmpdec/io.c:367:14: warning: writing 1 byte into a region of size 0 [-Wstringop-overflow=]
367 | case 8: EXTRACT_DIGIT(s, x, 10000000UL, dot);
| ^
In function ‘coeff_to_string’:
lto1: note: destination object is likely at address zero
lto1: note: destination object is likely at address zero
In function ‘word_to_string’,
inlined from ‘coeff_to_string’ at ./Modules/_decimal/libmpdec/io.c:410:13:
./Modules/_decimal/libmpdec/io.c:368:14: warning: writing 1 byte into a region of size 0 [-Wstringop-overflow=]
368 | case 7: EXTRACT_DIGIT(s, x, 1000000UL, dot);
| ^
In function ‘coeff_to_string’:
lto1: note: destination object is likely at address zero
In function ‘word_to_string’,
inlined from ‘coeff_to_string’ at ./Modules/_decimal/libmpdec/io.c:410:13:
./Modules/_decimal/libmpdec/io.c:367:14: warning: writing 1 byte into a region of size 0 [-Wstringop-overflow=]
367 | case 8: EXTRACT_DIGIT(s, x, 10000000UL, dot);
| ^
In function ‘coeff_to_string’:
lto1: note: destination object is likely at address zero
In function ‘word_to_string’,
inlined from ‘coeff_to_string’ at ./Modules/_decimal/libmpdec/io.c:410:13:
./Modules/_decimal/libmpdec/io.c:368:14: warning: writing 1 byte into a region of size 0 [-Wstringop-overflow=]
368 | case 7: EXTRACT_DIGIT(s, x, 1000000UL, dot);
| ^
In function ‘coeff_to_string’:
lto1: note: destination object is likely at address zero
In function ‘word_to_string’,
inlined from ‘coeff_to_string’ at ./Modules/_decimal/libmpdec/io.c:410:13:
./Modules/_decimal/libmpdec/io.c:369:14: warning: writing 1 byte into a region of size 0 [-Wstringop-overflow=]
369 | case 6: EXTRACT_DIGIT(s, x, 100000UL, dot);
| ^
In function ‘coeff_to_string’:
lto1: note: destination object is likely at address zero
lto1: note: destination object is likely at address zero
In function ‘word_to_string’,
inlined from ‘coeff_to_string’ at ./Modules/_decimal/libmpdec/io.c:410:13:
./Modules/_decimal/libmpdec/io.c:370:14: warning: writing 1 byte into a region of size 0 [-Wstringop-overflow=]
370 | case 5: EXTRACT_DIGIT(s, x, 10000UL, dot);
| ^
In function ‘coeff_to_string’:
lto1: note: destination object is likely at address zero
In function ‘word_to_string’,
inlined from ‘coeff_to_string’ at ./Modules/_decimal/libmpdec/io.c:410:13:
./Modules/_decimal/libmpdec/io.c:369:14: warning: writing 1 byte into a region of size 0 [-Wstringop-overflow=]
369 | case 6: EXTRACT_DIGIT(s, x, 100000UL, dot);
| ^
In function ‘coeff_to_string’:
lto1: note: destination object is likely at address zero
In function ‘word_to_string’,
inlined from ‘coeff_to_string’ at ./Modules/_decimal/libmpdec/io.c:410:13:
./Modules/_decimal/libmpdec/io.c:370:14: warning: writing 1 byte into a region of size 0 [-Wstringop-overflow=]
370 | case 5: EXTRACT_DIGIT(s, x, 10000UL, dot);
| ^
In function ‘coeff_to_string’:
lto1: note: destination object is likely at address zero
In function ‘word_to_string’,
inlined from ‘coeff_to_string’ at ./Modules/_decimal/libmpdec/io.c:410:13:
./Modules/_decimal/libmpdec/io.c:371:14: warning: writing 1 byte into a region of size 0 [-Wstringop-overflow=]
371 | case 4: EXTRACT_DIGIT(s, x, 1000UL, dot);
| ^
In function ‘coeff_to_string’:
lto1: note: destination object is likely at address zero
lto1: note: destination object is likely at address zero
In function ‘word_to_string’,
inlined from ‘coeff_to_string’ at ./Modules/_decimal/libmpdec/io.c:410:13:
./Modules/_decimal/libmpdec/io.c:372:14: warning: writing 1 byte into a region of size 0 [-Wstringop-overflow=]
372 | case 3: EXTRACT_DIGIT(s, x, 100UL, dot);
| ^
In function ‘coeff_to_string’:
lto1: note: destination object is likely at address zero
In function ‘word_to_string’,
inlined from ‘coeff_to_string’ at ./Modules/_decimal/libmpdec/io.c:410:13:
./Modules/_decimal/libmpdec/io.c:373:14: warning: writing 1 byte into a region of size 0 [-Wstringop-overflow=]
373 | case 2: EXTRACT_DIGIT(s, x, 10UL, dot);
| ^
In function ‘coeff_to_string’:
lto1: note: destination object is likely at address zero
In function ‘word_to_string’,
inlined from ‘coeff_to_string’ at ./Modules/_decimal/libmpdec/io.c:410:13:
./Modules/_decimal/libmpdec/io.c:371:14: warning: writing 1 byte into a region of size 0 [-Wstringop-overflow=]
371 | case 4: EXTRACT_DIGIT(s, x, 1000UL, dot);
| ^
In function ‘coeff_to_string’:
lto1: note: destination object is likely at address zero
In function ‘word_to_string’,
inlined from ‘coeff_to_string’ at ./Modules/_decimal/libmpdec/io.c:410:13:
./Modules/_decimal/libmpdec/io.c:372:14: warning: writing 1 byte into a region of size 0 [-Wstringop-overflow=]
372 | case 3: EXTRACT_DIGIT(s, x, 100UL, dot);
| ^
In function ‘coeff_to_string’:
lto1: note: destination object is likely at address zero
In function ‘word_to_string’,
inlined from ‘coeff_to_string’ at ./Modules/_decimal/libmpdec/io.c:410:13:
./Modules/_decimal/libmpdec/io.c:373:14: warning: writing 1 byte into a region of size 0 [-Wstringop-overflow=]
373 | case 2: EXTRACT_DIGIT(s, x, 10UL, dot);
| ^
In function ‘coeff_to_string’:
lto1: note: destination object is likely at address zero
Timeout (0:15:00)!
Thread 0x000003ffb1c77720 (most recent call first):
File "/home/dje/cpython-buildarea/3.x.edelsohn-fedora-rawhide-z.lto-pgo/build/Lib/selectors.py", line 398 in select
File "/home/dje/cpython-buildarea/3.x.edelsohn-fedora-rawhide-z.lto-pgo/build/Lib/subprocess.py", line 2108 in _communicate
File "/home/dje/cpython-buildarea/3.x.edelsohn-fedora-rawhide-z.lto-pgo/build/Lib/subprocess.py", line 1209 in communicate
File "/home/dje/cpython-buildarea/3.x.edelsohn-fedora-rawhide-z.lto-pgo/build/Lib/subprocess.py", line 550 in run
File "/home/dje/cpython-buildarea/3.x.edelsohn-fedora-rawhide-z.lto-pgo/build/Tools/freeze/test/freeze.py", line 25 in _run_quiet
File "/home/dje/cpython-buildarea/3.x.edelsohn-fedora-rawhide-z.lto-pgo/build/Tools/freeze/test/freeze.py", line 180 in prepare
File "/home/dje/cpython-buildarea/3.x.edelsohn-fedora-rawhide-z.lto-pgo/build/Lib/test/test_tools/test_freeze.py", line 27 in test_freeze_simple_script
File "/home/dje/cpython-buildarea/3.x.edelsohn-fedora-rawhide-z.lto-pgo/build/Lib/unittest/case.py", line 589 in _callTestMethod
File "/home/dje/cpython-buildarea/3.x.edelsohn-fedora-rawhide-z.lto-pgo/build/Lib/unittest/case.py", line 634 in run
File "/home/dje/cpython-buildarea/3.x.edelsohn-fedora-rawhide-z.lto-pgo/build/Lib/unittest/case.py", line 690 in __call__
File "/home/dje/cpython-buildarea/3.x.edelsohn-fedora-rawhide-z.lto-pgo/build/Lib/unittest/suite.py", line 122 in run
File "/home/dje/cpython-buildarea/3.x.edelsohn-fedora-rawhide-z.lto-pgo/build/Lib/unittest/suite.py", line 84 in __call__
File "/home/dje/cpython-buildarea/3.x.edelsohn-fedora-rawhide-z.lto-pgo/build/Lib/unittest/suite.py", line 122 in run
File "/home/dje/cpython-buildarea/3.x.edelsohn-fedora-rawhide-z.lto-pgo/build/Lib/unittest/suite.py", line 84 in __call__
File "/home/dje/cpython-buildarea/3.x.edelsohn-fedora-rawhide-z.lto-pgo/build/Lib/unittest/suite.py", line 122 in run
File "/home/dje/cpython-buildarea/3.x.edelsohn-fedora-rawhide-z.lto-pgo/build/Lib/unittest/suite.py", line 84 in __call__
File "/home/dje/cpython-buildarea/3.x.edelsohn-fedora-rawhide-z.lto-pgo/build/Lib/unittest/suite.py", line 122 in run
File "/home/dje/cpython-buildarea/3.x.edelsohn-fedora-rawhide-z.lto-pgo/build/Lib/unittest/suite.py", line 84 in __call__
File "/home/dje/cpython-buildarea/3.x.edelsohn-fedora-rawhide-z.lto-pgo/build/Lib/unittest/suite.py", line 122 in run
File "/home/dje/cpython-buildarea/3.x.edelsohn-fedora-rawhide-z.lto-pgo/build/Lib/unittest/suite.py", line 84 in __call__
File "/home/dje/cpython-buildarea/3.x.edelsohn-fedora-rawhide-z.lto-pgo/build/Lib/unittest/runner.py", line 240 in run
File "/home/dje/cpython-buildarea/3.x.edelsohn-fedora-rawhide-z.lto-pgo/build/Lib/test/support/__init__.py", line 1116 in _run_suite
File "/home/dje/cpython-buildarea/3.x.edelsohn-fedora-rawhide-z.lto-pgo/build/Lib/test/support/__init__.py", line 1242 in run_unittest
File "/home/dje/cpython-buildarea/3.x.edelsohn-fedora-rawhide-z.lto-pgo/build/Lib/test/libregrtest/runtest.py", line 294 in _test_module
File "/home/dje/cpython-buildarea/3.x.edelsohn-fedora-rawhide-z.lto-pgo/build/Lib/test/libregrtest/runtest.py", line 330 in _runtest_inner2
File "/home/dje/cpython-buildarea/3.x.edelsohn-fedora-rawhide-z.lto-pgo/build/Lib/test/libregrtest/runtest.py", line 373 in _runtest_inner
File "/home/dje/cpython-buildarea/3.x.edelsohn-fedora-rawhide-z.lto-pgo/build/Lib/test/libregrtest/runtest.py", line 248 in _runtest
File "/home/dje/cpython-buildarea/3.x.edelsohn-fedora-rawhide-z.lto-pgo/build/Lib/test/libregrtest/runtest.py", line 278 in runtest
File "/home/dje/cpython-buildarea/3.x.edelsohn-fedora-rawhide-z.lto-pgo/build/Lib/test/libregrtest/main.py", line 365 in rerun_failed_tests
File "/home/dje/cpython-buildarea/3.x.edelsohn-fedora-rawhide-z.lto-pgo/build/Lib/test/libregrtest/main.py", line 803 in _main
File "/home/dje/cpython-buildarea/3.x.edelsohn-fedora-rawhide-z.lto-pgo/build/Lib/test/libregrtest/main.py", line 758 in main
File "/home/dje/cpython-buildarea/3.x.edelsohn-fedora-rawhide-z.lto-pgo/build/Lib/test/libregrtest/main.py", line 822 in main
File "/home/dje/cpython-buildarea/3.x.edelsohn-fedora-rawhide-z.lto-pgo/build/Lib/test/__main__.py", line 2 in <module>
File "<frozen runpy>", line 88 in _run_code
File "<frozen runpy>", line 198 in _run_module_as_main
make: *** [Makefile:2019: buildbottest] Error 1
Cannot open file '/home/dje/cpython-buildarea/3.x.edelsohn-fedora-rawhide-z.lto-pgo/build/test-results.xml' for upload
Test report
===========
Failed tests:
- test_tools
Sincerely,
-The Buildbot
1
0
☠ Buildbot (Python): python/cpython - failed test (failure) (main)
by buildbot@python.org Aug. 8, 2023
by buildbot@python.org Aug. 8, 2023
Aug. 8, 2023
The Buildbot has detected a new failure on builder s390x Fedora LTO + PGO 3.x while building python/cpython.
Full details are available at:
https://buildbot.python.org/all/#/builders/545/builds/4274
Buildbot URL: https://buildbot.python.org/all/
Worker for this Build: edelsohn-fedora-z
Build Reason: <unknown>
Blamelist: Adam Turner <9087854+AA-Turner(a)users.noreply.github.com>, Alex Waygood <Alex.Waygood(a)Gmail.com>, Alexandru Mărășteanu <alexei(a)users.noreply.github.com>, Anders Kaseorg <andersk(a)mit.edu>, Barney Gale <barney.gale(a)gmail.com>, Brandt Bucher <brandtbucher(a)microsoft.com>, Charlie Zhao <zhaoyu_hit(a)qq.com>, Christopher Chavez <chrischavez(a)gmx.us>, Daniele Procida <daniele(a)vurt.org>, Dong-hee Na <donghee.na(a)python.org>, Eric Snow <ericsnowcurrently(a)gmail.com>, Erlend E. Aasland <erlend(a)python.org>, Fatih <77548106+fatihkabakk(a)users.noreply.github.com>, Felipe A. Hernandez <ergoithz(a)gmail.com>, Furkan Onder <furkanonder(a)protonmail.com>, Georg Brandl <georg(a)python.org>, Gertjan van Zwieten <git(a)gjvz.nl>, Guido van Rossum <guido(a)python.org>, Hugo van Kemenade <hugovk(a)users.noreply.github.com>, Illia Volochii <illia.volochii(a)gmail.com>, Inada Naoki <songofacandy(a)gmail.com>, Irit Katriel <1055913+iritkatriel(a)users.noreply.github.com>, Ivin Lee <62840497+rdrf2838(a)users.noreply.github
.com>, Jacob Walls <jacobtylerwalls(a)gmail.com>, James Cave <jcave137(a)gmail.com>, James Hilton-Balfe <gobot1234yt(a)gmail.com>, Kamil Turek <kamil.turek(a)hotmail.com>, Konstantin <kpp.live+github(a)gmail.com>, Kumar Aditya <kumaraditya(a)python.org>, Mark Shannon <mark(a)hotpy.org>, Michael The <michael-the1(a)users.noreply.github.com>, Ned Deily <nad(a)python.org>, Nikita Sobolev <mail(a)sobolevn.me>, Pablo Galindo Salgado <Pablogsal(a)gmail.com>, Pieter Eendebak <pieter.eendebak(a)gmail.com>, Rakesh Sabale <102187286+ghubrakesh(a)users.noreply.github.com>, Raymond Hettinger <rhettinger(a)users.noreply.github.com>, Serhiy Storchaka <storchaka(a)gmail.com>, Terry Jan Reedy <tjreedy(a)udel.edu>, Tian Gao <gaogaotiantian(a)hotmail.com>, Tom Niget <zippedfire(a)free.fr>, Tomas R <tomas.roun8(a)gmail.com>, Victor Stinner <vstinner(a)python.org>, cocoatomo <cocoatomo77(a)gmail.com>, da-woods <dw-git(a)d-woods.co.uk>, justdan6 <134341009+justdan6(a)users.noreply.github.com>, opavliuk <40970635+opavlyuk(a)users.noreply.github.com>,
shailshouryya <42100758+shailshouryya(a)users.noreply.github.com>
BUILD FAILED: failed test (failure)
Summary of the results of the build (if available):
===================================================
== Tests result: FAILURE then FAILURE ==
428 tests OK.
10 slowest tests:
- test_concurrent_futures: 2 min 18 sec
- test_multiprocessing_spawn: 1 min 31 sec
- test_signal: 1 min 17 sec
- test_multiprocessing_forkserver: 1 min 12 sec
- test_multiprocessing_fork: 1 min 8 sec
- test_socket: 43.6 sec
- test_imaplib: 32.1 sec
- test_io: 31.9 sec
- test_subprocess: 29.0 sec
- test_xmlrpc: 27.7 sec
1 test failed:
test.test_asyncio.test_subprocess
17 tests skipped:
test.test_asyncio.test_windows_events
test.test_asyncio.test_windows_utils test_devpoll test_gdb
test_ioctl test_kqueue test_launcher test_perf_profiler
test_readline test_startfile test_tkinter test_ttk
test_winconsoleio test_winreg test_winsound test_wmi
test_zipfile64
2 re-run tests:
test.test_asyncio.test_subprocess test_tools
1 test run no tests:
test_tools
Total duration: 16 min 8 sec
Captured traceback
==================
Traceback (most recent call last):
File "/home/dje/cpython-buildarea/3.x.edelsohn-fedora-z.lto-pgo/build/Lib/test/test_asyncio/test_subprocess.py", line 788, in test_subprocess_consistent_callbacks
self.loop.run_until_complete(main())
File "/home/dje/cpython-buildarea/3.x.edelsohn-fedora-z.lto-pgo/build/Lib/asyncio/base_events.py", line 664, in run_until_complete
return future.result()
^^^^^^^^^^^^^^^
File "/home/dje/cpython-buildarea/3.x.edelsohn-fedora-z.lto-pgo/build/Lib/test/test_asyncio/test_subprocess.py", line 780, in main
self.assertEqual(events, [
AssertionError: Lists differ: ['process_exited', ('pipe_data_received', 1, b'stdout')] != [('pipe_data_received', 1, b'stdout'), ('p[95 chars]ted']
Traceback (most recent call last):
File "/home/dje/cpython-buildarea/3.x.edelsohn-fedora-z.lto-pgo/build/Lib/test/test_asyncio/test_subprocess.py", line 788, in test_subprocess_consistent_callbacks
self.loop.run_until_complete(main())
File "/home/dje/cpython-buildarea/3.x.edelsohn-fedora-z.lto-pgo/build/Lib/asyncio/base_events.py", line 664, in run_until_complete
return future.result()
^^^^^^^^^^^^^^^
File "/home/dje/cpython-buildarea/3.x.edelsohn-fedora-z.lto-pgo/build/Lib/test/test_asyncio/test_subprocess.py", line 780, in main
self.assertEqual(events, [
AssertionError: Lists differ: [('pi[29 chars]t'), 'pipe_connection_lost', ('pipe_data_recei[57 chars]ted'] != [('pi[29 chars]t'), ('pipe_data_received', 2, b'stderr'), 'pi[57 chars]ted']
Test report
===========
Failed tests:
- test.test_asyncio.test_subprocess
- test_tools
Failed subtests:
- test_subprocess_consistent_callbacks - test.test_asyncio.test_subprocess.SubprocessPidfdWatcherTests.test_subprocess_consistent_callbacks
- test_subprocess_consistent_callbacks - test.test_asyncio.test_subprocess.SubprocessThreadedWatcherTests.test_subprocess_consistent_callbacks
Sincerely,
-The Buildbot
1
0
☠ Buildbot (Python): python/cpython - failed test (failure) uploading test-results.xml (failure) (main)
by buildbot@python.org Aug. 8, 2023
by buildbot@python.org Aug. 8, 2023
Aug. 8, 2023
The Buildbot has detected a new failure on builder s390x RHEL8 LTO + PGO 3.x while building python/cpython.
Full details are available at:
https://buildbot.python.org/all/#/builders/442/builds/4740
Buildbot URL: https://buildbot.python.org/all/
Worker for this Build: edelsohn-rhel8-z
Build Reason: <unknown>
Blamelist: Adam Turner <9087854+AA-Turner(a)users.noreply.github.com>, Alex Waygood <Alex.Waygood(a)Gmail.com>, Alexandru Mărășteanu <alexei(a)users.noreply.github.com>, Anders Kaseorg <andersk(a)mit.edu>, Barney Gale <barney.gale(a)gmail.com>, Brandt Bucher <brandtbucher(a)microsoft.com>, Charlie Zhao <zhaoyu_hit(a)qq.com>, Christopher Chavez <chrischavez(a)gmx.us>, Daniele Procida <daniele(a)vurt.org>, Dong-hee Na <donghee.na(a)python.org>, Eric Snow <ericsnowcurrently(a)gmail.com>, Erlend E. Aasland <erlend(a)python.org>, Fatih <77548106+fatihkabakk(a)users.noreply.github.com>, Felipe A. Hernandez <ergoithz(a)gmail.com>, Furkan Onder <furkanonder(a)protonmail.com>, Georg Brandl <georg(a)python.org>, Gertjan van Zwieten <git(a)gjvz.nl>, Guido van Rossum <guido(a)python.org>, Hugo van Kemenade <hugovk(a)users.noreply.github.com>, Illia Volochii <illia.volochii(a)gmail.com>, Inada Naoki <songofacandy(a)gmail.com>, Irit Katriel <1055913+iritkatriel(a)users.noreply.github.com>, Ivin Lee <62840497+rdrf2838(a)users.noreply.github
.com>, Jacob Walls <jacobtylerwalls(a)gmail.com>, James Cave <jcave137(a)gmail.com>, James Hilton-Balfe <gobot1234yt(a)gmail.com>, Kamil Turek <kamil.turek(a)hotmail.com>, Konstantin <kpp.live+github(a)gmail.com>, Kumar Aditya <kumaraditya(a)python.org>, Mark Shannon <mark(a)hotpy.org>, Michael The <michael-the1(a)users.noreply.github.com>, Ned Deily <nad(a)python.org>, Nikita Sobolev <mail(a)sobolevn.me>, Pablo Galindo Salgado <Pablogsal(a)gmail.com>, Pieter Eendebak <pieter.eendebak(a)gmail.com>, Rakesh Sabale <102187286+ghubrakesh(a)users.noreply.github.com>, Serhiy Storchaka <storchaka(a)gmail.com>, Terry Jan Reedy <tjreedy(a)udel.edu>, Tian Gao <gaogaotiantian(a)hotmail.com>, Tom Niget <zippedfire(a)free.fr>, Tomas R <tomas.roun8(a)gmail.com>, Victor Stinner <vstinner(a)python.org>, cocoatomo <cocoatomo77(a)gmail.com>, da-woods <dw-git(a)d-woods.co.uk>, justdan6 <134341009+justdan6(a)users.noreply.github.com>, opavliuk <40970635+opavlyuk(a)users.noreply.github.com>, shailshouryya <42100758+shailshouryya(a)users.noreply.githu
b.com>
BUILD FAILED: failed test (failure) uploading test-results.xml (failure)
Summary of the results of the build (if available):
===================================================
==
Captured traceback
==================
remote: Enumerating objects: 9, done.
remote: Counting objects: 11% (1/9)
remote: Counting objects: 22% (2/9)
remote: Counting objects: 33% (3/9)
remote: Counting objects: 44% (4/9)
remote: Counting objects: 55% (5/9)
remote: Counting objects: 66% (6/9)
remote: Counting objects: 77% (7/9)
remote: Counting objects: 88% (8/9)
remote: Counting objects: 100% (9/9)
remote: Counting objects: 100% (9/9), done.
remote: Compressing objects: 20% (1/5)
remote: Compressing objects: 40% (2/5)
remote: Compressing objects: 60% (3/5)
remote: Compressing objects: 80% (4/5)
remote: Compressing objects: 100% (5/5)
remote: Compressing objects: 100% (5/5), done.
remote: Total 5 (delta 4), reused 0 (delta 0), pack-reused 0
From https://github.com/python/cpython
* branch main -> FETCH_HEAD
Note: switching to 'f9e3ff1ea4b2c8b787360409d55f2037652b7456'.
You are in 'detached HEAD' state. You can look around, make experimental
changes and commit them, and you can discard any commits you make in this
state without impacting any branches by switching back to a branch.
If you want to create a new branch to retain commits you create, you may
do so (now or later) by using -c with the switch command. Example:
git switch -c <new-branch-name>
Or undo this operation with:
git switch -
Turn off this advice by setting config variable advice.detachedHead to false
HEAD is now at f9e3ff1ea4 gh-105699: Re-enable the Multiple-Interpreters Stress Tests (gh-107572)
Switched to and reset branch 'main'
find: ‘build’: No such file or directory
find: ‘build’: No such file or directory
find: ‘build’: No such file or directory
find: ‘build’: No such file or directory
make[2]: [Makefile:2794: clean-retain-profile] Error 1 (ignored)
./Modules/_decimal/libmpdec/context.c:57: warning: mpd_setminalloc: ignoring request to set MPD_MINALLOC a second time
./Modules/_decimal/libmpdec/context.c:57: warning: mpd_setminalloc: ignoring request to set MPD_MINALLOC a second time
Timeout (0:15:00)!
Thread 0x000003ffbbff7730 (most recent call first):
File "/home/dje/cpython-buildarea/3.x.edelsohn-rhel8-z.lto-pgo/build/Lib/selectors.py", line 398 in select
File "/home/dje/cpython-buildarea/3.x.edelsohn-rhel8-z.lto-pgo/build/Lib/subprocess.py", line 2108 in _communicate
File "/home/dje/cpython-buildarea/3.x.edelsohn-rhel8-z.lto-pgo/build/Lib/subprocess.py", line 1209 in communicate
File "/home/dje/cpython-buildarea/3.x.edelsohn-rhel8-z.lto-pgo/build/Lib/subprocess.py", line 550 in run
File "/home/dje/cpython-buildarea/3.x.edelsohn-rhel8-z.lto-pgo/build/Tools/freeze/test/freeze.py", line 25 in _run_quiet
File "/home/dje/cpython-buildarea/3.x.edelsohn-rhel8-z.lto-pgo/build/Tools/freeze/test/freeze.py", line 180 in prepare
File "/home/dje/cpython-buildarea/3.x.edelsohn-rhel8-z.lto-pgo/build/Lib/test/test_tools/test_freeze.py", line 27 in test_freeze_simple_script
File "/home/dje/cpython-buildarea/3.x.edelsohn-rhel8-z.lto-pgo/build/Lib/unittest/case.py", line 589 in _callTestMethod
File "/home/dje/cpython-buildarea/3.x.edelsohn-rhel8-z.lto-pgo/build/Lib/unittest/case.py", line 634 in run
File "/home/dje/cpython-buildarea/3.x.edelsohn-rhel8-z.lto-pgo/build/Lib/unittest/case.py", line 690 in __call__
File "/home/dje/cpython-buildarea/3.x.edelsohn-rhel8-z.lto-pgo/build/Lib/unittest/suite.py", line 122 in run
File "/home/dje/cpython-buildarea/3.x.edelsohn-rhel8-z.lto-pgo/build/Lib/unittest/suite.py", line 84 in __call__
File "/home/dje/cpython-buildarea/3.x.edelsohn-rhel8-z.lto-pgo/build/Lib/unittest/suite.py", line 122 in run
File "/home/dje/cpython-buildarea/3.x.edelsohn-rhel8-z.lto-pgo/build/Lib/unittest/suite.py", line 84 in __call__
File "/home/dje/cpython-buildarea/3.x.edelsohn-rhel8-z.lto-pgo/build/Lib/unittest/suite.py", line 122 in run
File "/home/dje/cpython-buildarea/3.x.edelsohn-rhel8-z.lto-pgo/build/Lib/unittest/suite.py", line 84 in __call__
File "/home/dje/cpython-buildarea/3.x.edelsohn-rhel8-z.lto-pgo/build/Lib/unittest/suite.py", line 122 in run
File "/home/dje/cpython-buildarea/3.x.edelsohn-rhel8-z.lto-pgo/build/Lib/unittest/suite.py", line 84 in __call__
File "/home/dje/cpython-buildarea/3.x.edelsohn-rhel8-z.lto-pgo/build/Lib/unittest/suite.py", line 122 in run
File "/home/dje/cpython-buildarea/3.x.edelsohn-rhel8-z.lto-pgo/build/Lib/unittest/suite.py", line 84 in __call__
File "/home/dje/cpython-buildarea/3.x.edelsohn-rhel8-z.lto-pgo/build/Lib/unittest/runner.py", line 240 in run
File "/home/dje/cpython-buildarea/3.x.edelsohn-rhel8-z.lto-pgo/build/Lib/test/support/__init__.py", line 1116 in _run_suite
File "/home/dje/cpython-buildarea/3.x.edelsohn-rhel8-z.lto-pgo/build/Lib/test/support/__init__.py", line 1242 in run_unittest
File "/home/dje/cpython-buildarea/3.x.edelsohn-rhel8-z.lto-pgo/build/Lib/test/libregrtest/runtest.py", line 294 in _test_module
File "/home/dje/cpython-buildarea/3.x.edelsohn-rhel8-z.lto-pgo/build/Lib/test/libregrtest/runtest.py", line 330 in _runtest_inner2
File "/home/dje/cpython-buildarea/3.x.edelsohn-rhel8-z.lto-pgo/build/Lib/test/libregrtest/runtest.py", line 373 in _runtest_inner
File "/home/dje/cpython-buildarea/3.x.edelsohn-rhel8-z.lto-pgo/build/Lib/test/libregrtest/runtest.py", line 248 in _runtest
File "/home/dje/cpython-buildarea/3.x.edelsohn-rhel8-z.lto-pgo/build/Lib/test/libregrtest/runtest.py", line 278 in runtest
File "/home/dje/cpython-buildarea/3.x.edelsohn-rhel8-z.lto-pgo/build/Lib/test/libregrtest/main.py", line 365 in rerun_failed_tests
File "/home/dje/cpython-buildarea/3.x.edelsohn-rhel8-z.lto-pgo/build/Lib/test/libregrtest/main.py", line 803 in _main
File "/home/dje/cpython-buildarea/3.x.edelsohn-rhel8-z.lto-pgo/build/Lib/test/libregrtest/main.py", line 758 in main
File "/home/dje/cpython-buildarea/3.x.edelsohn-rhel8-z.lto-pgo/build/Lib/test/libregrtest/main.py", line 822 in main
File "/home/dje/cpython-buildarea/3.x.edelsohn-rhel8-z.lto-pgo/build/Lib/test/__main__.py", line 2 in <module>
File "<frozen runpy>", line 88 in _run_code
File "<frozen runpy>", line 198 in _run_module_as_main
make: *** [Makefile:2021: buildbottest] Error 1
Cannot open file '/home/dje/cpython-buildarea/3.x.edelsohn-rhel8-z.lto-pgo/build/test-results.xml' for upload
Test report
===========
Failed tests:
- test_tools
Sincerely,
-The BuildbotThe Buildbot has detected a new failure on builder aarch64 Fedora Rawhide Clang 3.x while building python/cpython.
Full details are available at:
https://buildbot.python.org/all/#/builders/40/builds/4576
Buildbot URL: https://buildbot.python.org/all/
Worker for this Build: cstratak-fedora-rawhide-aarch64
Build Reason: <unknown>
Blamelist: Eric Snow <ericsnowcurrently(a)gmail.com>
BUILD FAILED: failed test (failure)
Summary of the results of the build (if available):
===================================================
== Tests result: ENV CHANGED ==
432 tests OK.
10 slowest tests:
- test_multiprocessing_spawn: 3 min 5 sec
- test_concurrent_futures: 2 min 40 sec
- test_multiprocessing_forkserver: 1 min 30 sec
- test_math: 1 min 21 sec
- test_multiprocessing_fork: 1 min 14 sec
- test_capi: 1 min 9 sec
- test_signal: 1 min 1 sec
- test_socket: 57.8 sec
- test_gdb: 49.5 sec
- test_unparse: 42.9 sec
1 test altered the execution environment:
test_interpreters
14 tests skipped:
test.test_asyncio.test_windows_events
test.test_asyncio.test_windows_utils test_devpoll test_ioctl
test_kqueue test_launcher test_startfile test_tkinter test_ttk
test_winconsoleio test_winreg test_winsound test_wmi
test_zipfile64
Total duration: 3 min 14 sec
Captured traceback
==================
Traceback (most recent call last):
File "<frozen importlib._bootstrap>", line 1266, in _find_and_load
File "<frozen importlib._bootstrap>", line 1237, in _find_and_load_unlocked
File "<frozen importlib._bootstrap>", line 841, in _load_unlocked
File "<frozen importlib._bootstrap_external>", line 998, in exec_module
File "<frozen importlib._bootstrap_external>", line 1094, in get_code
File "<frozen importlib._bootstrap_external>", line 1193, in get_data
TypeError: descriptor 'close' for '_io.BufferedReader' objects doesn't apply to a '_io.FileIO' object
Traceback (most recent call last):
File "/home/buildbot/buildarea/3.x.cstratak-fedora-rawhide-aarch64.clang/build/Lib/threading.py", line 1052, in _bootstrap_inner
self.run()
File "/home/buildbot/buildarea/3.x.cstratak-fedora-rawhide-aarch64.clang/build/Lib/threading.py", line 989, in run
self._target(*self._args, **self._kwargs)
File "/home/buildbot/buildarea/3.x.cstratak-fedora-rawhide-aarch64.clang/build/Lib/test/test_interpreters.py", line 481, in task
interp = interpreters.create()
^^^^^^^^^^^^^^^^^^^^^
File "/home/buildbot/buildarea/3.x.cstratak-fedora-rawhide-aarch64.clang/build/Lib/test/support/interpreters.py", line 25, in create
id = _interpreters.create(isolated=isolated)
^^^^^^^^^^^^^^^^^^^^^^^^^^^^^^^^^^^^^^^
RuntimeError: interpreter creation failed
k
Test report
===========
Sincerely,
-The Buildbot
1
0
☠ Buildbot (Python): python/cpython - failed test (failure) uploading test-results.xml (failure) (main)
by buildbot@python.org Aug. 8, 2023
by buildbot@python.org Aug. 8, 2023
Aug. 8, 2023
The Buildbot has detected a new failure on builder s390x Fedora LTO + PGO 3.x while building python/cpython.
Full details are available at:
https://buildbot.python.org/all/#/builders/545/builds/4271
Buildbot URL: https://buildbot.python.org/all/
Worker for this Build: edelsohn-fedora-z
Build Reason: <unknown>
Blamelist: Adam Turner <9087854+AA-Turner(a)users.noreply.github.com>, Alex Waygood <Alex.Waygood(a)Gmail.com>, Alexandru Mărășteanu <alexei(a)users.noreply.github.com>, Anders Kaseorg <andersk(a)mit.edu>, Barney Gale <barney.gale(a)gmail.com>, Brandt Bucher <brandtbucher(a)microsoft.com>, Charlie Zhao <zhaoyu_hit(a)qq.com>, Christopher Chavez <chrischavez(a)gmx.us>, Daniele Procida <daniele(a)vurt.org>, Dong-hee Na <donghee.na(a)python.org>, Eric Snow <ericsnowcurrently(a)gmail.com>, Erlend E. Aasland <erlend(a)python.org>, Felipe A. Hernandez <ergoithz(a)gmail.com>, Furkan Onder <furkanonder(a)protonmail.com>, Georg Brandl <georg(a)python.org>, Gertjan van Zwieten <git(a)gjvz.nl>, Guido van Rossum <guido(a)python.org>, Hugo van Kemenade <hugovk(a)users.noreply.github.com>, Illia Volochii <illia.volochii(a)gmail.com>, Inada Naoki <songofacandy(a)gmail.com>, Irit Katriel <1055913+iritkatriel(a)users.noreply.github.com>, Ivin Lee <62840497+rdrf2838(a)users.noreply.github.com>, Jacob Walls <jacobtylerwalls(a)gmail.com>, James C
ave <jcave137(a)gmail.com>, James Hilton-Balfe <gobot1234yt(a)gmail.com>, Kamil Turek <kamil.turek(a)hotmail.com>, Konstantin <kpp.live+github(a)gmail.com>, Kumar Aditya <kumaraditya(a)python.org>, Mark Shannon <mark(a)hotpy.org>, Michael The <michael-the1(a)users.noreply.github.com>, Ned Deily <nad(a)python.org>, Nikita Sobolev <mail(a)sobolevn.me>, Pablo Galindo Salgado <Pablogsal(a)gmail.com>, Pieter Eendebak <pieter.eendebak(a)gmail.com>, Rakesh Sabale <102187286+ghubrakesh(a)users.noreply.github.com>, Serhiy Storchaka <storchaka(a)gmail.com>, Terry Jan Reedy <tjreedy(a)udel.edu>, Tian Gao <gaogaotiantian(a)hotmail.com>, Tom Niget <zippedfire(a)free.fr>, Tomas R <tomas.roun8(a)gmail.com>, Victor Stinner <vstinner(a)python.org>, cocoatomo <cocoatomo77(a)gmail.com>, da-woods <dw-git(a)d-woods.co.uk>, justdan6 <134341009+justdan6(a)users.noreply.github.com>, opavliuk <40970635+opavlyuk(a)users.noreply.github.com>, shailshouryya <42100758+shailshouryya(a)users.noreply.github.com>
BUILD FAILED: failed test (failure) uploading test-results.xml (failure)
Summary of the results of the build (if available):
===================================================
==
Captured traceback
==================
remote: Enumerating objects: 8, done.
remote: Counting objects: 12% (1/8)
remote: Counting objects: 25% (2/8)
remote: Counting objects: 37% (3/8)
remote: Counting objects: 50% (4/8)
remote: Counting objects: 62% (5/8)
remote: Counting objects: 75% (6/8)
remote: Counting objects: 87% (7/8)
remote: Counting objects: 100% (8/8)
remote: Counting objects: 100% (8/8), done.
remote: Compressing objects: 50% (1/2)
remote: Compressing objects: 100% (2/2)
remote: Compressing objects: 100% (2/2), done.
remote: Total 8 (delta 6), reused 8 (delta 6), pack-reused 0
From https://github.com/python/cpython
* branch main -> FETCH_HEAD
Note: switching to '7c5153de5a2bd2c886173a317f116885a925cfce'.
You are in 'detached HEAD' state. You can look around, make experimental
changes and commit them, and you can discard any commits you make in this
state without impacting any branches by switching back to a branch.
If you want to create a new branch to retain commits you create, you may
do so (now or later) by using -c with the switch command. Example:
git switch -c <new-branch-name>
Or undo this operation with:
git switch -
Turn off this advice by setting config variable advice.detachedHead to false
HEAD is now at 7c5153de5a gh-106368: Argument clinic: add tests for more failure paths (#107731)
Switched to and reset branch 'main'
find: ‘build’: No such file or directory
find: ‘build’: No such file or directory
find: ‘build’: No such file or directory
find: ‘build’: No such file or directory
make[2]: [Makefile:2792: clean-retain-profile] Error 1 (ignored)
./Modules/_decimal/libmpdec/context.c:56: warning: mpd_setminalloc: ignoring request to set MPD_MINALLOC a second time
./Modules/_decimal/libmpdec/context.c:56: warning: mpd_setminalloc: ignoring request to set MPD_MINALLOC a second time
In function ‘word_to_string’,
inlined from ‘coeff_to_string’ at ./Modules/_decimal/libmpdec/io.c:410:13,
inlined from ‘_mpd_to_string’ at ./Modules/_decimal/libmpdec/io.c:611:18:
./Modules/_decimal/libmpdec/io.c:348:40: warning: writing 1 byte into a region of size 0 [-Wstringop-overflow=]
348 | if (s == dot) *s++ = '.'; *s++ = '0' + (char)(x / d); x %= d
| ~~~~~^~~~~~~~~~~~~~~~~~~~~
./Modules/_decimal/libmpdec/io.c:348:40: warning: writing 1 byte into a region of size 0 [-Wstringop-overflow=]
348 | if (s == dot) *s++ = '.'; *s++ = '0' + (char)(x / d); x %= d
| ~~~~~^~~~~~~~~~~~~~~~~~~~~
./Modules/_decimal/libmpdec/io.c:348:40: warning: writing 1 byte into a region of size 0 [-Wstringop-overflow=]
348 | if (s == dot) *s++ = '.'; *s++ = '0' + (char)(x / d); x %= d
| ~~~~~^~~~~~~~~~~~~~~~~~~~~
./Modules/_decimal/libmpdec/io.c:348:40: warning: writing 1 byte into a region of size 0 [-Wstringop-overflow=]
348 | if (s == dot) *s++ = '.'; *s++ = '0' + (char)(x / d); x %= d
| ~~~~~^~~~~~~~~~~~~~~~~~~~~
./Modules/_decimal/libmpdec/io.c:348:40: warning: writing 1 byte into a region of size 0 [-Wstringop-overflow=]
348 | if (s == dot) *s++ = '.'; *s++ = '0' + (char)(x / d); x %= d
| ~~~~~^~~~~~~~~~~~~~~~~~~~~
./Modules/_decimal/libmpdec/io.c:348:40: warning: writing 1 byte into a region of size 0 [-Wstringop-overflow=]
348 | if (s == dot) *s++ = '.'; *s++ = '0' + (char)(x / d); x %= d
| ~~~~~^~~~~~~~~~~~~~~~~~~~~
./Modules/_decimal/libmpdec/io.c:348:40: warning: writing 1 byte into a region of size 0 [-Wstringop-overflow=]
348 | if (s == dot) *s++ = '.'; *s++ = '0' + (char)(x / d); x %= d
| ~~~~~^~~~~~~~~~~~~~~~~~~~~
./Modules/_decimal/libmpdec/io.c:348:40: warning: writing 1 byte into a region of size 0 [-Wstringop-overflow=]
348 | if (s == dot) *s++ = '.'; *s++ = '0' + (char)(x / d); x %= d
| ~~~~~^~~~~~~~~~~~~~~~~~~~~
./Modules/_decimal/libmpdec/io.c:348:40: warning: writing 1 byte into a region of size 0 [-Wstringop-overflow=]
348 | if (s == dot) *s++ = '.'; *s++ = '0' + (char)(x / d); x %= d
| ~~~~~^~~~~~~~~~~~~~~~~~~~~
./Modules/_decimal/libmpdec/io.c:348:40: warning: writing 1 byte into a region of size 0 [-Wstringop-overflow=]
348 | if (s == dot) *s++ = '.'; *s++ = '0' + (char)(x / d); x %= d
| ~~~~~^~~~~~~~~~~~~~~~~~~~~
./Modules/_decimal/libmpdec/io.c:348:40: warning: writing 1 byte into a region of size 0 [-Wstringop-overflow=]
348 | if (s == dot) *s++ = '.'; *s++ = '0' + (char)(x / d); x %= d
| ~~~~~^~~~~~~~~~~~~~~~~~~~~
./Modules/_decimal/libmpdec/io.c:348:40: warning: writing 1 byte into a region of size 0 [-Wstringop-overflow=]
348 | if (s == dot) *s++ = '.'; *s++ = '0' + (char)(x / d); x %= d
| ~~~~~^~~~~~~~~~~~~~~~~~~~~
./Modules/_decimal/libmpdec/io.c:348:40: warning: writing 1 byte into a region of size 0 [-Wstringop-overflow=]
348 | if (s == dot) *s++ = '.'; *s++ = '0' + (char)(x / d); x %= d
| ~~~~~^~~~~~~~~~~~~~~~~~~~~
./Modules/_decimal/libmpdec/io.c:348:40: warning: writing 1 byte into a region of size 0 [-Wstringop-overflow=]
348 | if (s == dot) *s++ = '.'; *s++ = '0' + (char)(x / d); x %= d
| ~~~~~^~~~~~~~~~~~~~~~~~~~~
./Modules/_decimal/libmpdec/io.c:348:40: warning: writing 1 byte into a region of size 0 [-Wstringop-overflow=]
348 | if (s == dot) *s++ = '.'; *s++ = '0' + (char)(x / d); x %= d
| ~~~~~^~~~~~~~~~~~~~~~~~~~~
./Modules/_decimal/libmpdec/io.c:348:40: warning: writing 1 byte into a region of size 0 [-Wstringop-overflow=]
348 | if (s == dot) *s++ = '.'; *s++ = '0' + (char)(x / d); x %= d
| ~~~~~^~~~~~~~~~~~~~~~~~~~~
./Modules/_decimal/libmpdec/io.c:348:40: warning: writing 1 byte into a region of size 0 [-Wstringop-overflow=]
348 | if (s == dot) *s++ = '.'; *s++ = '0' + (char)(x / d); x %= d
| ~~~~~^~~~~~~~~~~~~~~~~~~~~
./Modules/_decimal/libmpdec/io.c:348:40: warning: writing 1 byte into a region of size 0 [-Wstringop-overflow=]
348 | if (s == dot) *s++ = '.'; *s++ = '0' + (char)(x / d); x %= d
| ~~~~~^~~~~~~~~~~~~~~~~~~~~
./Modules/_decimal/libmpdec/io.c:348:40: warning: writing 1 byte into a region of size 0 [-Wstringop-overflow=]
348 | if (s == dot) *s++ = '.'; *s++ = '0' + (char)(x / d); x %= d
| ~~~~~^~~~~~~~~~~~~~~~~~~~~
./Modules/_decimal/libmpdec/io.c:348:40: warning: writing 1 byte into a region of size 0 [-Wstringop-overflow=]
348 | if (s == dot) *s++ = '.'; *s++ = '0' + (char)(x / d); x %= d
| ~~~~~^~~~~~~~~~~~~~~~~~~~~
./Modules/_decimal/libmpdec/io.c:348:40: warning: writing 1 byte into a region of size 0 [-Wstringop-overflow=]
348 | if (s == dot) *s++ = '.'; *s++ = '0' + (char)(x / d); x %= d
| ~~~~~^~~~~~~~~~~~~~~~~~~~~
./Modules/_decimal/libmpdec/io.c:348:40: warning: writing 1 byte into a region of size 0 [-Wstringop-overflow=]
348 | if (s == dot) *s++ = '.'; *s++ = '0' + (char)(x / d); x %= d
| ~~~~~^~~~~~~~~~~~~~~~~~~~~
./Modules/_decimal/libmpdec/io.c:348:40: warning: writing 1 byte into a region of size 0 [-Wstringop-overflow=]
348 | if (s == dot) *s++ = '.'; *s++ = '0' + (char)(x / d); x %= d
| ~~~~~^~~~~~~~~~~~~~~~~~~~~
./Modules/_decimal/libmpdec/io.c:348:40: warning: writing 1 byte into a region of size 0 [-Wstringop-overflow=]
348 | if (s == dot) *s++ = '.'; *s++ = '0' + (char)(x / d); x %= d
| ~~~~~^~~~~~~~~~~~~~~~~~~~~
./Modules/_decimal/libmpdec/io.c:348:40: warning: writing 1 byte into a region of size 0 [-Wstringop-overflow=]
348 | if (s == dot) *s++ = '.'; *s++ = '0' + (char)(x / d); x %= d
| ~~~~~^~~~~~~~~~~~~~~~~~~~~
./Modules/_decimal/libmpdec/io.c:348:40: warning: writing 1 byte into a region of size 0 [-Wstringop-overflow=]
348 | if (s == dot) *s++ = '.'; *s++ = '0' + (char)(x / d); x %= d
| ~~~~~^~~~~~~~~~~~~~~~~~~~~
./Modules/_decimal/libmpdec/io.c:348:40: warning: writing 1 byte into a region of size 0 [-Wstringop-overflow=]
348 | if (s == dot) *s++ = '.'; *s++ = '0' + (char)(x / d); x %= d
| ~~~~~^~~~~~~~~~~~~~~~~~~~~
./Modules/_decimal/libmpdec/io.c:348:40: warning: writing 1 byte into a region of size 0 [-Wstringop-overflow=]
348 | if (s == dot) *s++ = '.'; *s++ = '0' + (char)(x / d); x %= d
| ~~~~~^~~~~~~~~~~~~~~~~~~~~
./Modules/_decimal/libmpdec/io.c:348:40: warning: writing 1 byte into a region of size 0 [-Wstringop-overflow=]
348 | if (s == dot) *s++ = '.'; *s++ = '0' + (char)(x / d); x %= d
| ~~~~~^~~~~~~~~~~~~~~~~~~~~
./Modules/_decimal/libmpdec/io.c:348:40: warning: writing 1 byte into a region of size 0 [-Wstringop-overflow=]
348 | if (s == dot) *s++ = '.'; *s++ = '0' + (char)(x / d); x %= d
| ~~~~~^~~~~~~~~~~~~~~~~~~~~
./Modules/_decimal/libmpdec/io.c:348:40: warning: writing 1 byte into a region of size 0 [-Wstringop-overflow=]
348 | if (s == dot) *s++ = '.'; *s++ = '0' + (char)(x / d); x %= d
| ~~~~~^~~~~~~~~~~~~~~~~~~~~
./Modules/_decimal/libmpdec/io.c:348:40: warning: writing 1 byte into a region of size 0 [-Wstringop-overflow=]
348 | if (s == dot) *s++ = '.'; *s++ = '0' + (char)(x / d); x %= d
| ~~~~~^~~~~~~~~~~~~~~~~~~~~
./Modules/_decimal/libmpdec/io.c:348:40: warning: writing 1 byte into a region of size 0 [-Wstringop-overflow=]
348 | if (s == dot) *s++ = '.'; *s++ = '0' + (char)(x / d); x %= d
| ~~~~~^~~~~~~~~~~~~~~~~~~~~
In function ‘word_to_string’,
inlined from ‘coeff_to_string’ at ./Modules/_decimal/libmpdec/io.c:410:13:
./Modules/_decimal/libmpdec/io.c:348:40: warning: writing 1 byte into a region of size 0 [-Wstringop-overflow=]
348 | if (s == dot) *s++ = '.'; *s++ = '0' + (char)(x / d); x %= d
| ~~~~~^~~~~~~~~~~~~~~~~~~~~
./Modules/_decimal/libmpdec/io.c:348:40: warning: writing 1 byte into a region of size 0 [-Wstringop-overflow=]
348 | if (s == dot) *s++ = '.'; *s++ = '0' + (char)(x / d); x %= d
| ~~~~~^~~~~~~~~~~~~~~~~~~~~
./Modules/_decimal/libmpdec/io.c:348:40: warning: writing 1 byte into a region of size 0 [-Wstringop-overflow=]
348 | if (s == dot) *s++ = '.'; *s++ = '0' + (char)(x / d); x %= d
| ~~~~~^~~~~~~~~~~~~~~~~~~~~
./Modules/_decimal/libmpdec/io.c:348:40: warning: writing 1 byte into a region of size 0 [-Wstringop-overflow=]
348 | if (s == dot) *s++ = '.'; *s++ = '0' + (char)(x / d); x %= d
| ~~~~~^~~~~~~~~~~~~~~~~~~~~
./Modules/_decimal/libmpdec/io.c:348:40: warning: writing 1 byte into a region of size 0 [-Wstringop-overflow=]
348 | if (s == dot) *s++ = '.'; *s++ = '0' + (char)(x / d); x %= d
| ~~~~~^~~~~~~~~~~~~~~~~~~~~
./Modules/_decimal/libmpdec/io.c:348:40: warning: writing 1 byte into a region of size 0 [-Wstringop-overflow=]
348 | if (s == dot) *s++ = '.'; *s++ = '0' + (char)(x / d); x %= d
| ~~~~~^~~~~~~~~~~~~~~~~~~~~
./Modules/_decimal/libmpdec/io.c:348:40: warning: writing 1 byte into a region of size 0 [-Wstringop-overflow=]
348 | if (s == dot) *s++ = '.'; *s++ = '0' + (char)(x / d); x %= d
| ~~~~~^~~~~~~~~~~~~~~~~~~~~
./Modules/_decimal/libmpdec/io.c:348:40: warning: writing 1 byte into a region of size 0 [-Wstringop-overflow=]
348 | if (s == dot) *s++ = '.'; *s++ = '0' + (char)(x / d); x %= d
| ~~~~~^~~~~~~~~~~~~~~~~~~~~
./Modules/_decimal/libmpdec/io.c:348:40: warning: writing 1 byte into a region of size 0 [-Wstringop-overflow=]
348 | if (s == dot) *s++ = '.'; *s++ = '0' + (char)(x / d); x %= d
| ~~~~~^~~~~~~~~~~~~~~~~~~~~
./Modules/_decimal/libmpdec/io.c:348:40: warning: writing 1 byte into a region of size 0 [-Wstringop-overflow=]
348 | if (s == dot) *s++ = '.'; *s++ = '0' + (char)(x / d); x %= d
| ~~~~~^~~~~~~~~~~~~~~~~~~~~
./Modules/_decimal/libmpdec/io.c:348:40: warning: writing 1 byte into a region of size 0 [-Wstringop-overflow=]
348 | if (s == dot) *s++ = '.'; *s++ = '0' + (char)(x / d); x %= d
| ~~~~~^~~~~~~~~~~~~~~~~~~~~
./Modules/_decimal/libmpdec/io.c:348:40: warning: writing 1 byte into a region of size 0 [-Wstringop-overflow=]
348 | if (s == dot) *s++ = '.'; *s++ = '0' + (char)(x / d); x %= d
| ~~~~~^~~~~~~~~~~~~~~~~~~~~
./Modules/_decimal/libmpdec/io.c:348:40: warning: writing 1 byte into a region of size 0 [-Wstringop-overflow=]
348 | if (s == dot) *s++ = '.'; *s++ = '0' + (char)(x / d); x %= d
| ~~~~~^~~~~~~~~~~~~~~~~~~~~
./Modules/_decimal/libmpdec/io.c:348:40: warning: writing 1 byte into a region of size 0 [-Wstringop-overflow=]
348 | if (s == dot) *s++ = '.'; *s++ = '0' + (char)(x / d); x %= d
| ~~~~~^~~~~~~~~~~~~~~~~~~~~
./Modules/_decimal/libmpdec/io.c:348:40: warning: writing 1 byte into a region of size 0 [-Wstringop-overflow=]
348 | if (s == dot) *s++ = '.'; *s++ = '0' + (char)(x / d); x %= d
| ~~~~~^~~~~~~~~~~~~~~~~~~~~
./Modules/_decimal/libmpdec/io.c:348:40: warning: writing 1 byte into a region of size 0 [-Wstringop-overflow=]
348 | if (s == dot) *s++ = '.'; *s++ = '0' + (char)(x / d); x %= d
| ~~~~~^~~~~~~~~~~~~~~~~~~~~
./Modules/_decimal/libmpdec/io.c:348:40: warning: writing 1 byte into a region of size 0 [-Wstringop-overflow=]
348 | if (s == dot) *s++ = '.'; *s++ = '0' + (char)(x / d); x %= d
| ~~~~~^~~~~~~~~~~~~~~~~~~~~
./Modules/_decimal/libmpdec/io.c:348:40: warning: writing 1 byte into a region of size 0 [-Wstringop-overflow=]
348 | if (s == dot) *s++ = '.'; *s++ = '0' + (char)(x / d); x %= d
| ~~~~~^~~~~~~~~~~~~~~~~~~~~
./Modules/_decimal/libmpdec/io.c:348:40: warning: writing 1 byte into a region of size 0 [-Wstringop-overflow=]
348 | if (s == dot) *s++ = '.'; *s++ = '0' + (char)(x / d); x %= d
| ~~~~~^~~~~~~~~~~~~~~~~~~~~
./Modules/_decimal/libmpdec/io.c:348:40: warning: writing 1 byte into a region of size 0 [-Wstringop-overflow=]
348 | if (s == dot) *s++ = '.'; *s++ = '0' + (char)(x / d); x %= d
| ~~~~~^~~~~~~~~~~~~~~~~~~~~
./Modules/_decimal/libmpdec/io.c:348:40: warning: writing 1 byte into a region of size 0 [-Wstringop-overflow=]
348 | if (s == dot) *s++ = '.'; *s++ = '0' + (char)(x / d); x %= d
| ~~~~~^~~~~~~~~~~~~~~~~~~~~
./Modules/_decimal/libmpdec/io.c:348:40: warning: writing 1 byte into a region of size 0 [-Wstringop-overflow=]
348 | if (s == dot) *s++ = '.'; *s++ = '0' + (char)(x / d); x %= d
| ~~~~~^~~~~~~~~~~~~~~~~~~~~
./Modules/_decimal/libmpdec/io.c:348:40: warning: writing 1 byte into a region of size 0 [-Wstringop-overflow=]
348 | if (s == dot) *s++ = '.'; *s++ = '0' + (char)(x / d); x %= d
| ~~~~~^~~~~~~~~~~~~~~~~~~~~
./Modules/_decimal/libmpdec/io.c:348:40: warning: writing 1 byte into a region of size 0 [-Wstringop-overflow=]
348 | if (s == dot) *s++ = '.'; *s++ = '0' + (char)(x / d); x %= d
| ~~~~~^~~~~~~~~~~~~~~~~~~~~
./Modules/_decimal/libmpdec/io.c:348:40: warning: writing 1 byte into a region of size 0 [-Wstringop-overflow=]
348 | if (s == dot) *s++ = '.'; *s++ = '0' + (char)(x / d); x %= d
| ~~~~~^~~~~~~~~~~~~~~~~~~~~
./Modules/_decimal/libmpdec/io.c:348:40: warning: writing 1 byte into a region of size 0 [-Wstringop-overflow=]
348 | if (s == dot) *s++ = '.'; *s++ = '0' + (char)(x / d); x %= d
| ~~~~~^~~~~~~~~~~~~~~~~~~~~
./Modules/_decimal/libmpdec/io.c:348:40: warning: writing 1 byte into a region of size 0 [-Wstringop-overflow=]
348 | if (s == dot) *s++ = '.'; *s++ = '0' + (char)(x / d); x %= d
| ~~~~~^~~~~~~~~~~~~~~~~~~~~
./Modules/_decimal/libmpdec/io.c:348:40: warning: writing 1 byte into a region of size 0 [-Wstringop-overflow=]
348 | if (s == dot) *s++ = '.'; *s++ = '0' + (char)(x / d); x %= d
| ~~~~~^~~~~~~~~~~~~~~~~~~~~
./Modules/_decimal/libmpdec/io.c:348:40: warning: writing 1 byte into a region of size 0 [-Wstringop-overflow=]
348 | if (s == dot) *s++ = '.'; *s++ = '0' + (char)(x / d); x %= d
| ~~~~~^~~~~~~~~~~~~~~~~~~~~
./Modules/_decimal/libmpdec/io.c:348:40: warning: writing 1 byte into a region of size 0 [-Wstringop-overflow=]
348 | if (s == dot) *s++ = '.'; *s++ = '0' + (char)(x / d); x %= d
| ~~~~~^~~~~~~~~~~~~~~~~~~~~
./Modules/_decimal/libmpdec/io.c:348:40: warning: writing 1 byte into a region of size 0 [-Wstringop-overflow=]
348 | if (s == dot) *s++ = '.'; *s++ = '0' + (char)(x / d); x %= d
| ~~~~~^~~~~~~~~~~~~~~~~~~~~
./Modules/_decimal/libmpdec/io.c:348:40: warning: writing 1 byte into a region of size 0 [-Wstringop-overflow=]
348 | if (s == dot) *s++ = '.'; *s++ = '0' + (char)(x / d); x %= d
| ~~~~~^~~~~~~~~~~~~~~~~~~~~
./Modules/_decimal/libmpdec/io.c:348:40: warning: writing 1 byte into a region of size 0 [-Wstringop-overflow=]
348 | if (s == dot) *s++ = '.'; *s++ = '0' + (char)(x / d); x %= d
| ~~~~~^~~~~~~~~~~~~~~~~~~~~
In function ‘utf8_toUtf8’,
inlined from ‘toAscii’ at ./Modules/expat/xmltok.c:1043:3,
inlined from ‘doParseXmlDecl’ at ./Modules/expat/xmltok.c:1197:13:
./Modules/expat/xmltok.c:390:5: warning: ‘memcpy’ writing 2 or more bytes into a region of size 1 overflows the destination [-Wstringop-overflow=]
390 | memcpy(*toP, *fromP, bytesToCopy);
| ^~~~~~~~~~~~~~~~~~~~~~~~~~~~~~~~~
./Modules/expat/xmltok.c: In function ‘doParseXmlDecl’:
./Modules/expat/xmltok.c:1041:8: note: destination object ‘buf’ of size 1
1041 | char buf[1];
| ^~~
In function ‘utf8_toUtf8’,
inlined from ‘toAscii’ at ./Modules/expat/xmltok.c:1043:3,
inlined from ‘parsePseudoAttribute’ at ./Modules/expat/xmltok.c:1075:9:
./Modules/expat/xmltok.c:390:5: warning: ‘memcpy’ writing 2 or more bytes into a region of size 1 overflows the destination [-Wstringop-overflow=]
390 | memcpy(*toP, *fromP, bytesToCopy);
| ^~~~~~~~~~~~~~~~~~~~~~~~~~~~~~~~~
./Modules/expat/xmltok.c: In function ‘parsePseudoAttribute’:
./Modules/expat/xmltok.c:1041:8: note: destination object ‘buf’ of size 1
1041 | char buf[1];
| ^~~
In function ‘utf8_toUtf8’,
inlined from ‘toAscii’ at ./Modules/expat/xmltok.c:1043:3,
inlined from ‘parsePseudoAttribute’ at ./Modules/expat/xmltok.c:1081:12:
./Modules/expat/xmltok.c:390:5: warning: ‘memcpy’ writing 2 or more bytes into a region of size 1 overflows the destination [-Wstringop-overflow=]
390 | memcpy(*toP, *fromP, bytesToCopy);
| ^~~~~~~~~~~~~~~~~~~~~~~~~~~~~~~~~
./Modules/expat/xmltok.c: In function ‘parsePseudoAttribute’:
./Modules/expat/xmltok.c:1041:8: note: destination object ‘buf’ of size 1
1041 | char buf[1];
| ^~~
In function ‘utf8_toUtf8’,
inlined from ‘toAscii’ at ./Modules/expat/xmltok.c:1043:3,
inlined from ‘parsePseudoAttribute’ at ./Modules/expat/xmltok.c:1081:12:
./Modules/expat/xmltok.c:390:5: warning: ‘memcpy’ writing 2 or more bytes into a region of size 1 overflows the destination [-Wstringop-overflow=]
390 | memcpy(*toP, *fromP, bytesToCopy);
| ^~~~~~~~~~~~~~~~~~~~~~~~~~~~~~~~~
./Modules/expat/xmltok.c: In function ‘parsePseudoAttribute’:
./Modules/expat/xmltok.c:1041:8: note: destination object ‘buf’ of size 1
1041 | char buf[1];
| ^~~
In function ‘utf8_toUtf8’,
inlined from ‘toAscii’ at ./Modules/expat/xmltok.c:1043:3,
inlined from ‘parsePseudoAttribute’ at ./Modules/expat/xmltok.c:1088:9:
./Modules/expat/xmltok.c:390:5: warning: ‘memcpy’ writing 2 or more bytes into a region of size 1 overflows the destination [-Wstringop-overflow=]
390 | memcpy(*toP, *fromP, bytesToCopy);
| ^~~~~~~~~~~~~~~~~~~~~~~~~~~~~~~~~
./Modules/expat/xmltok.c: In function ‘parsePseudoAttribute’:
./Modules/expat/xmltok.c:1041:8: note: destination object ‘buf’ of size 1
1041 | char buf[1];
| ^~~
In function ‘utf8_toUtf8’,
inlined from ‘toAscii’ at ./Modules/expat/xmltok.c:1043:3,
inlined from ‘parsePseudoAttribute’ at ./Modules/expat/xmltok.c:1088:9:
./Modules/expat/xmltok.c:390:5: warning: ‘memcpy’ writing 2 or more bytes into a region of size 1 overflows the destination [-Wstringop-overflow=]
390 | memcpy(*toP, *fromP, bytesToCopy);
| ^~~~~~~~~~~~~~~~~~~~~~~~~~~~~~~~~
./Modules/expat/xmltok.c: In function ‘parsePseudoAttribute’:
./Modules/expat/xmltok.c:1041:8: note: destination object ‘buf’ of size 1
1041 | char buf[1];
| ^~~
In function ‘utf8_toUtf8’,
inlined from ‘toAscii’ at ./Modules/expat/xmltok.c:1043:3,
inlined from ‘parsePseudoAttribute’ at ./Modules/expat/xmltok.c:1115:7:
./Modules/expat/xmltok.c:390:5: warning: ‘memcpy’ writing 2 or more bytes into a region of size 1 overflows the destination [-Wstringop-overflow=]
390 | memcpy(*toP, *fromP, bytesToCopy);
| ^~~~~~~~~~~~~~~~~~~~~~~~~~~~~~~~~
./Modules/expat/xmltok.c: In function ‘parsePseudoAttribute’:
./Modules/expat/xmltok.c:1041:8: note: destination object ‘buf’ of size 1
1041 | char buf[1];
| ^~~
In function ‘utf8_toUtf8’,
inlined from ‘toAscii’ at ./Modules/expat/xmltok.c:1043:3,
inlined from ‘parsePseudoAttribute’ at ./Modules/expat/xmltok.c:1128:9:
./Modules/expat/xmltok.c:390:5: warning: ‘memcpy’ writing 2 or more bytes into a region of size 1 overflows the destination [-Wstringop-overflow=]
390 | memcpy(*toP, *fromP, bytesToCopy);
| ^~~~~~~~~~~~~~~~~~~~~~~~~~~~~~~~~
./Modules/expat/xmltok.c: In function ‘parsePseudoAttribute’:
./Modules/expat/xmltok.c:1041:8: note: destination object ‘buf’ of size 1
1041 | char buf[1];
| ^~~
In function ‘utf8_toUtf8’,
inlined from ‘toAscii’ at ./Modules/expat/xmltok.c:1043:3,
inlined from ‘parsePseudoAttribute’ at ./Modules/expat/xmltok.c:1128:9:
./Modules/expat/xmltok.c:390:5: warning: ‘memcpy’ writing 2 or more bytes into a region of size 1 overflows the destination [-Wstringop-overflow=]
390 | memcpy(*toP, *fromP, bytesToCopy);
| ^~~~~~~~~~~~~~~~~~~~~~~~~~~~~~~~~
./Modules/expat/xmltok.c: In function ‘parsePseudoAttribute’:
./Modules/expat/xmltok.c:1041:8: note: destination object ‘buf’ of size 1
1041 | char buf[1];
| ^~~
In function ‘utf8_toUtf8’,
inlined from ‘toAscii’ at ./Modules/expat/xmltok.c:1043:3,
inlined from ‘doParseXmlDecl’ at ./Modules/expat/xmltok.c:1197:13:
./Modules/expat/xmltok.c:390:5: warning: ‘memcpy’ writing 2 or more bytes into a region of size 1 overflows the destination [-Wstringop-overflow=]
390 | memcpy(*toP, *fromP, bytesToCopy);
| ^
./Modules/expat/xmltok.c: In function ‘doParseXmlDecl’:
./Modules/expat/xmltok.c:1041:8: note: destination object ‘buf’ of size 1
1041 | char buf[1];
| ^
In function ‘utf8_toUtf8’,
inlined from ‘toAscii’ at ./Modules/expat/xmltok.c:1043:3,
inlined from ‘parsePseudoAttribute’ at ./Modules/expat/xmltok.c:1075:9:
./Modules/expat/xmltok.c:390:5: warning: ‘memcpy’ writing 2 or more bytes into a region of size 1 overflows the destination [-Wstringop-overflow=]
390 | memcpy(*toP, *fromP, bytesToCopy);
| ^
./Modules/expat/xmltok.c: In function ‘parsePseudoAttribute’:
./Modules/expat/xmltok.c:1041:8: note: destination object ‘buf’ of size 1
1041 | char buf[1];
| ^
In function ‘utf8_toUtf8’,
inlined from ‘toAscii’ at ./Modules/expat/xmltok.c:1043:3,
inlined from ‘parsePseudoAttribute’ at ./Modules/expat/xmltok.c:1081:12:
./Modules/expat/xmltok.c:390:5: warning: ‘memcpy’ writing 2 or more bytes into a region of size 1 overflows the destination [-Wstringop-overflow=]
390 | memcpy(*toP, *fromP, bytesToCopy);
| ^
./Modules/expat/xmltok.c: In function ‘parsePseudoAttribute’:
./Modules/expat/xmltok.c:1041:8: note: destination object ‘buf’ of size 1
1041 | char buf[1];
| ^
In function ‘utf8_toUtf8’,
inlined from ‘toAscii’ at ./Modules/expat/xmltok.c:1043:3,
inlined from ‘parsePseudoAttribute’ at ./Modules/expat/xmltok.c:1081:12:
./Modules/expat/xmltok.c:390:5: warning: ‘memcpy’ writing 2 or more bytes into a region of size 1 overflows the destination [-Wstringop-overflow=]
390 | memcpy(*toP, *fromP, bytesToCopy);
| ^
./Modules/expat/xmltok.c: In function ‘parsePseudoAttribute’:
./Modules/expat/xmltok.c:1041:8: note: destination object ‘buf’ of size 1
1041 | char buf[1];
| ^
In function ‘utf8_toUtf8’,
inlined from ‘toAscii’ at ./Modules/expat/xmltok.c:1043:3,
inlined from ‘parsePseudoAttribute’ at ./Modules/expat/xmltok.c:1088:9:
./Modules/expat/xmltok.c:390:5: warning: ‘memcpy’ writing 2 or more bytes into a region of size 1 overflows the destination [-Wstringop-overflow=]
390 | memcpy(*toP, *fromP, bytesToCopy);
| ^
./Modules/expat/xmltok.c: In function ‘parsePseudoAttribute’:
./Modules/expat/xmltok.c:1041:8: note: destination object ‘buf’ of size 1
1041 | char buf[1];
| ^
In function ‘utf8_toUtf8’,
inlined from ‘toAscii’ at ./Modules/expat/xmltok.c:1043:3,
inlined from ‘parsePseudoAttribute’ at ./Modules/expat/xmltok.c:1088:9:
./Modules/expat/xmltok.c:390:5: warning: ‘memcpy’ writing 2 or more bytes into a region of size 1 overflows the destination [-Wstringop-overflow=]
390 | memcpy(*toP, *fromP, bytesToCopy);
| ^
./Modules/expat/xmltok.c: In function ‘parsePseudoAttribute’:
./Modules/expat/xmltok.c:1041:8: note: destination object ‘buf’ of size 1
1041 | char buf[1];
| ^
In function ‘utf8_toUtf8’,
inlined from ‘toAscii’ at ./Modules/expat/xmltok.c:1043:3,
inlined from ‘parsePseudoAttribute’ at ./Modules/expat/xmltok.c:1115:7:
./Modules/expat/xmltok.c:390:5: warning: ‘memcpy’ writing 2 or more bytes into a region of size 1 overflows the destination [-Wstringop-overflow=]
390 | memcpy(*toP, *fromP, bytesToCopy);
| ^
./Modules/expat/xmltok.c: In function ‘parsePseudoAttribute’:
./Modules/expat/xmltok.c:1041:8: note: destination object ‘buf’ of size 1
1041 | char buf[1];
| ^
In function ‘utf8_toUtf8’,
inlined from ‘toAscii’ at ./Modules/expat/xmltok.c:1043:3,
inlined from ‘parsePseudoAttribute’ at ./Modules/expat/xmltok.c:1128:9:
./Modules/expat/xmltok.c:390:5: warning: ‘memcpy’ writing 2 or more bytes into a region of size 1 overflows the destination [-Wstringop-overflow=]
390 | memcpy(*toP, *fromP, bytesToCopy);
| ^
./Modules/expat/xmltok.c: In function ‘parsePseudoAttribute’:
./Modules/expat/xmltok.c:1041:8: note: destination object ‘buf’ of size 1
1041 | char buf[1];
| ^
In function ‘utf8_toUtf8’,
inlined from ‘toAscii’ at ./Modules/expat/xmltok.c:1043:3,
inlined from ‘parsePseudoAttribute’ at ./Modules/expat/xmltok.c:1128:9:
./Modules/expat/xmltok.c:390:5: warning: ‘memcpy’ writing 2 or more bytes into a region of size 1 overflows the destination [-Wstringop-overflow=]
390 | memcpy(*toP, *fromP, bytesToCopy);
| ^
./Modules/expat/xmltok.c: In function ‘parsePseudoAttribute’:
./Modules/expat/xmltok.c:1041:8: note: destination object ‘buf’ of size 1
1041 | char buf[1];
| ^
In function ‘word_to_string’,
inlined from ‘coeff_to_string’ at ./Modules/_decimal/libmpdec/io.c:410:13:
./Modules/_decimal/libmpdec/io.c:359:14: warning: writing 1 byte into a region of size 0 [-Wstringop-overflow=]
359 | case 15: EXTRACT_DIGIT(s, x, 100000000000000ULL, dot);
| ^
./Modules/_decimal/libmpdec/io.c:358:14: warning: writing 1 byte into a region of size 0 [-Wstringop-overflow=]
358 | case 16: EXTRACT_DIGIT(s, x, 1000000000000000ULL, dot);
| ^
./Modules/_decimal/libmpdec/io.c:359:14: warning: writing 1 byte into a region of size 0 [-Wstringop-overflow=]
359 | case 15: EXTRACT_DIGIT(s, x, 100000000000000ULL, dot);
| ^
./Modules/_decimal/libmpdec/io.c:360:14: warning: writing 1 byte into a region of size 0 [-Wstringop-overflow=]
360 | case 14: EXTRACT_DIGIT(s, x, 10000000000000ULL, dot);
| ^
./Modules/_decimal/libmpdec/io.c:357:14: warning: writing 1 byte into a region of size 0 [-Wstringop-overflow=]
357 | case 17: EXTRACT_DIGIT(s, x, 10000000000000000ULL, dot);
| ^
./Modules/_decimal/libmpdec/io.c:356:14: warning: writing 1 byte into a region of size 0 [-Wstringop-overflow=]
356 | case 18: EXTRACT_DIGIT(s, x, 100000000000000000ULL, dot);
| ^
./Modules/_decimal/libmpdec/io.c:357:14: warning: writing 1 byte into a region of size 0 [-Wstringop-overflow=]
357 | case 17: EXTRACT_DIGIT(s, x, 10000000000000000ULL, dot);
| ^
./Modules/_decimal/libmpdec/io.c:358:14: warning: writing 1 byte into a region of size 0 [-Wstringop-overflow=]
358 | case 16: EXTRACT_DIGIT(s, x, 1000000000000000ULL, dot);
| ^
./Modules/_decimal/libmpdec/io.c:361:14: warning: writing 1 byte into a region of size 0 [-Wstringop-overflow=]
361 | case 13: EXTRACT_DIGIT(s, x, 1000000000000ULL, dot);
| ^
./Modules/_decimal/libmpdec/io.c:360:14: warning: writing 1 byte into a region of size 0 [-Wstringop-overflow=]
360 | case 14: EXTRACT_DIGIT(s, x, 10000000000000ULL, dot);
| ^
./Modules/_decimal/libmpdec/io.c:361:14: warning: writing 1 byte into a region of size 0 [-Wstringop-overflow=]
361 | case 13: EXTRACT_DIGIT(s, x, 1000000000000ULL, dot);
| ^
./Modules/_decimal/libmpdec/io.c:362:14: warning: writing 1 byte into a region of size 0 [-Wstringop-overflow=]
362 | case 12: EXTRACT_DIGIT(s, x, 100000000000ULL, dot);
| ^
./Modules/_decimal/libmpdec/io.c:363:14: warning: writing 1 byte into a region of size 0 [-Wstringop-overflow=]
363 | case 11: EXTRACT_DIGIT(s, x, 10000000000ULL, dot);
| ^
./Modules/_decimal/libmpdec/io.c:362:14: warning: writing 1 byte into a region of size 0 [-Wstringop-overflow=]
362 | case 12: EXTRACT_DIGIT(s, x, 100000000000ULL, dot);
| ^
./Modules/_decimal/libmpdec/io.c:363:14: warning: writing 1 byte into a region of size 0 [-Wstringop-overflow=]
363 | case 11: EXTRACT_DIGIT(s, x, 10000000000ULL, dot);
| ^
./Modules/_decimal/libmpdec/io.c:365:14: warning: writing 1 byte into a region of size 0 [-Wstringop-overflow=]
365 | case 10: EXTRACT_DIGIT(s, x, 1000000000UL, dot);
| ^
./Modules/_decimal/libmpdec/io.c:366:14: warning: writing 1 byte into a region of size 0 [-Wstringop-overflow=]
366 | case 9: EXTRACT_DIGIT(s, x, 100000000UL, dot);
| ^
./Modules/_decimal/libmpdec/io.c:365:14: warning: writing 1 byte into a region of size 0 [-Wstringop-overflow=]
365 | case 10: EXTRACT_DIGIT(s, x, 1000000000UL, dot);
| ^
./Modules/_decimal/libmpdec/io.c:366:14: warning: writing 1 byte into a region of size 0 [-Wstringop-overflow=]
366 | case 9: EXTRACT_DIGIT(s, x, 100000000UL, dot);
| ^
./Modules/_decimal/libmpdec/io.c:367:14: warning: writing 1 byte into a region of size 0 [-Wstringop-overflow=]
367 | case 8: EXTRACT_DIGIT(s, x, 10000000UL, dot);
| ^
./Modules/_decimal/libmpdec/io.c:368:14: warning: writing 1 byte into a region of size 0 [-Wstringop-overflow=]
368 | case 7: EXTRACT_DIGIT(s, x, 1000000UL, dot);
| ^
./Modules/_decimal/libmpdec/io.c:367:14: warning: writing 1 byte into a region of size 0 [-Wstringop-overflow=]
367 | case 8: EXTRACT_DIGIT(s, x, 10000000UL, dot);
| ^
./Modules/_decimal/libmpdec/io.c:368:14: warning: writing 1 byte into a region of size 0 [-Wstringop-overflow=]
368 | case 7: EXTRACT_DIGIT(s, x, 1000000UL, dot);
| ^
./Modules/_decimal/libmpdec/io.c:369:14: warning: writing 1 byte into a region of size 0 [-Wstringop-overflow=]
369 | case 6: EXTRACT_DIGIT(s, x, 100000UL, dot);
| ^
./Modules/_decimal/libmpdec/io.c:370:14: warning: writing 1 byte into a region of size 0 [-Wstringop-overflow=]
370 | case 5: EXTRACT_DIGIT(s, x, 10000UL, dot);
| ^
./Modules/_decimal/libmpdec/io.c:369:14: warning: writing 1 byte into a region of size 0 [-Wstringop-overflow=]
369 | case 6: EXTRACT_DIGIT(s, x, 100000UL, dot);
| ^
./Modules/_decimal/libmpdec/io.c:370:14: warning: writing 1 byte into a region of size 0 [-Wstringop-overflow=]
370 | case 5: EXTRACT_DIGIT(s, x, 10000UL, dot);
| ^
./Modules/_decimal/libmpdec/io.c:371:14: warning: writing 1 byte into a region of size 0 [-Wstringop-overflow=]
371 | case 4: EXTRACT_DIGIT(s, x, 1000UL, dot);
| ^
./Modules/_decimal/libmpdec/io.c:372:14: warning: writing 1 byte into a region of size 0 [-Wstringop-overflow=]
372 | case 3: EXTRACT_DIGIT(s, x, 100UL, dot);
| ^
./Modules/_decimal/libmpdec/io.c:373:14: warning: writing 1 byte into a region of size 0 [-Wstringop-overflow=]
373 | case 2: EXTRACT_DIGIT(s, x, 10UL, dot);
| ^
./Modules/_decimal/libmpdec/io.c:371:14: warning: writing 1 byte into a region of size 0 [-Wstringop-overflow=]
371 | case 4: EXTRACT_DIGIT(s, x, 1000UL, dot);
| ^
./Modules/_decimal/libmpdec/io.c:372:14: warning: writing 1 byte into a region of size 0 [-Wstringop-overflow=]
372 | case 3: EXTRACT_DIGIT(s, x, 100UL, dot);
| ^
./Modules/_decimal/libmpdec/io.c:373:14: warning: writing 1 byte into a region of size 0 [-Wstringop-overflow=]
373 | case 2: EXTRACT_DIGIT(s, x, 10UL, dot);
| ^
Timeout (0:15:00)!
Thread 0x000003ffb77f70a0 (most recent call first):
File "/home/dje/cpython-buildarea/3.x.edelsohn-fedora-z.lto-pgo/build/Lib/selectors.py", line 398 in select
File "/home/dje/cpython-buildarea/3.x.edelsohn-fedora-z.lto-pgo/build/Lib/subprocess.py", line 2108 in _communicate
File "/home/dje/cpython-buildarea/3.x.edelsohn-fedora-z.lto-pgo/build/Lib/subprocess.py", line 1209 in communicate
File "/home/dje/cpython-buildarea/3.x.edelsohn-fedora-z.lto-pgo/build/Lib/subprocess.py", line 550 in run
File "/home/dje/cpython-buildarea/3.x.edelsohn-fedora-z.lto-pgo/build/Tools/freeze/test/freeze.py", line 25 in _run_quiet
File "/home/dje/cpython-buildarea/3.x.edelsohn-fedora-z.lto-pgo/build/Tools/freeze/test/freeze.py", line 180 in prepare
File "/home/dje/cpython-buildarea/3.x.edelsohn-fedora-z.lto-pgo/build/Lib/test/test_tools/test_freeze.py", line 27 in test_freeze_simple_script
File "/home/dje/cpython-buildarea/3.x.edelsohn-fedora-z.lto-pgo/build/Lib/unittest/case.py", line 589 in _callTestMethod
File "/home/dje/cpython-buildarea/3.x.edelsohn-fedora-z.lto-pgo/build/Lib/unittest/case.py", line 634 in run
File "/home/dje/cpython-buildarea/3.x.edelsohn-fedora-z.lto-pgo/build/Lib/unittest/case.py", line 690 in __call__
File "/home/dje/cpython-buildarea/3.x.edelsohn-fedora-z.lto-pgo/build/Lib/unittest/suite.py", line 122 in run
File "/home/dje/cpython-buildarea/3.x.edelsohn-fedora-z.lto-pgo/build/Lib/unittest/suite.py", line 84 in __call__
File "/home/dje/cpython-buildarea/3.x.edelsohn-fedora-z.lto-pgo/build/Lib/unittest/suite.py", line 122 in run
File "/home/dje/cpython-buildarea/3.x.edelsohn-fedora-z.lto-pgo/build/Lib/unittest/suite.py", line 84 in __call__
File "/home/dje/cpython-buildarea/3.x.edelsohn-fedora-z.lto-pgo/build/Lib/unittest/suite.py", line 122 in run
File "/home/dje/cpython-buildarea/3.x.edelsohn-fedora-z.lto-pgo/build/Lib/unittest/suite.py", line 84 in __call__
File "/home/dje/cpython-buildarea/3.x.edelsohn-fedora-z.lto-pgo/build/Lib/unittest/suite.py", line 122 in run
File "/home/dje/cpython-buildarea/3.x.edelsohn-fedora-z.lto-pgo/build/Lib/unittest/suite.py", line 84 in __call__
File "/home/dje/cpython-buildarea/3.x.edelsohn-fedora-z.lto-pgo/build/Lib/unittest/suite.py", line 122 in run
File "/home/dje/cpython-buildarea/3.x.edelsohn-fedora-z.lto-pgo/build/Lib/unittest/suite.py", line 84 in __call__
File "/home/dje/cpython-buildarea/3.x.edelsohn-fedora-z.lto-pgo/build/Lib/unittest/runner.py", line 240 in run
File "/home/dje/cpython-buildarea/3.x.edelsohn-fedora-z.lto-pgo/build/Lib/test/support/__init__.py", line 1116 in _run_suite
File "/home/dje/cpython-buildarea/3.x.edelsohn-fedora-z.lto-pgo/build/Lib/test/support/__init__.py", line 1242 in run_unittest
File "/home/dje/cpython-buildarea/3.x.edelsohn-fedora-z.lto-pgo/build/Lib/test/libregrtest/runtest.py", line 294 in _test_module
File "/home/dje/cpython-buildarea/3.x.edelsohn-fedora-z.lto-pgo/build/Lib/test/libregrtest/runtest.py", line 330 in _runtest_inner2
File "/home/dje/cpython-buildarea/3.x.edelsohn-fedora-z.lto-pgo/build/Lib/test/libregrtest/runtest.py", line 373 in _runtest_inner
File "/home/dje/cpython-buildarea/3.x.edelsohn-fedora-z.lto-pgo/build/Lib/test/libregrtest/runtest.py", line 248 in _runtest
File "/home/dje/cpython-buildarea/3.x.edelsohn-fedora-z.lto-pgo/build/Lib/test/libregrtest/runtest.py", line 278 in runtest
File "/home/dje/cpython-buildarea/3.x.edelsohn-fedora-z.lto-pgo/build/Lib/test/libregrtest/main.py", line 365 in rerun_failed_tests
File "/home/dje/cpython-buildarea/3.x.edelsohn-fedora-z.lto-pgo/build/Lib/test/libregrtest/main.py", line 803 in _main
File "/home/dje/cpython-buildarea/3.x.edelsohn-fedora-z.lto-pgo/build/Lib/test/libregrtest/main.py", line 758 in main
File "/home/dje/cpython-buildarea/3.x.edelsohn-fedora-z.lto-pgo/build/Lib/test/libregrtest/main.py", line 822 in main
File "/home/dje/cpython-buildarea/3.x.edelsohn-fedora-z.lto-pgo/build/Lib/test/__main__.py", line 2 in <module>
File "<frozen runpy>", line 88 in _run_code
File "<frozen runpy>", line 198 in _run_module_as_main
make: *** [Makefile:2019: buildbottest] Error 1
Cannot open file '/home/dje/cpython-buildarea/3.x.edelsohn-fedora-z.lto-pgo/build/test-results.xml' for upload
Test report
===========
Failed tests:
- test_tools
Sincerely,
-The Buildbot
1
0
☠ Buildbot (Python): - failed test (failure) (648d42643eeca18206825f0f4c58c58f71e0ae1a)
by buildbot@python.org Aug. 8, 2023
by buildbot@python.org Aug. 8, 2023
Aug. 8, 2023
The Buildbot has detected a new failure on builder AMD64 Windows11 Refleaks 3.11 while building Python.
Full details are available at:
https://buildbot.python.org/all/#/builders/987/builds/449
Buildbot URL: https://buildbot.python.org/all/
Worker for this Build: ware-win11
Build Reason: <unknown>
Blamelist:
BUILD FAILED: failed test (failure)
Summary of the results of the build (if available):
===================================================
Captured traceback
==================
remote: Enumerating objects: 50, done.
remote: Counting objects: 2% (1/50)
remote: Counting objects: 4% (2/50)
remote: Counting objects: 6% (3/50)
remote: Counting objects: 8% (4/50)
remote: Counting objects: 10% (5/50)
remote: Counting objects: 12% (6/50)
remote: Counting objects: 14% (7/50)
remote: Counting objects: 16% (8/50)
remote: Counting objects: 18% (9/50)
remote: Counting objects: 20% (10/50)
remote: Counting objects: 22% (11/50)
remote: Counting objects: 24% (12/50)
remote: Counting objects: 26% (13/50)
remote: Counting objects: 28% (14/50)
remote: Counting objects: 30% (15/50)
remote: Counting objects: 32% (16/50)
remote: Counting objects: 34% (17/50)
remote: Counting objects: 36% (18/50)
remote: Counting objects: 38% (19/50)
remote: Counting objects: 40% (20/50)
remote: Counting objects: 42% (21/50)
remote: Counting objects: 44% (22/50)
remote: Counting objects: 46% (23/50)
remote: Counting objects: 48% (24/50)
remote: Counting objects: 50% (25/50)
remote: Counting objects: 52% (26/50)
remote: Counting objects: 54% (27/50)
remote: Counting objects: 56% (28/50)
remote: Counting objects: 58% (29/50)
remote: Counting objects: 60% (30/50)
remote: Counting objects: 62% (31/50)
remote: Counting objects: 64% (32/50)
remote: Counting objects: 66% (33/50)
remote: Counting objects: 68% (34/50)
remote: Counting objects: 70% (35/50)
remote: Counting objects: 72% (36/50)
remote: Counting objects: 74% (37/50)
remote: Counting objects: 76% (38/50)
remote: Counting objects: 78% (39/50)
remote: Counting objects: 80% (40/50)
remote: Counting objects: 82% (41/50)
remote: Counting objects: 84% (42/50)
remote: Counting objects: 86% (43/50)
remote: Counting objects: 88% (44/50)
remote: Counting objects: 90% (45/50)
remote: Counting objects: 92% (46/50)
remote: Counting objects: 94% (47/50)
remote: Counting objects: 96% (48/50)
remote: Counting objects: 98% (49/50)
remote: Counting objects: 100% (50/50)
remote: Counting objects: 100% (50/50), done.
remote: Compressing objects: 2% (1/44)
remote: Compressing objects: 4% (2/44)
remote: Compressing objects: 6% (3/44)
remote: Compressing objects: 9% (4/44)
remote: Compressing objects: 11% (5/44)
remote: Compressing objects: 13% (6/44)
remote: Compressing objects: 15% (7/44)
remote: Compressing objects: 18% (8/44)
remote: Compressing objects: 20% (9/44)
remote: Compressing objects: 22% (10/44)
remote: Compressing objects: 25% (11/44)
remote: Compressing objects: 27% (12/44)
remote: Compressing objects: 29% (13/44)
remote: Compressing objects: 31% (14/44)
remote: Compressing objects: 34% (15/44)
remote: Compressing objects: 36% (16/44)
remote: Compressing objects: 38% (17/44)
remote: Compressing objects: 40% (18/44)
remote: Compressing objects: 43% (19/44)
remote: Compressing objects: 45% (20/44)
remote: Compressing objects: 47% (21/44)
remote: Compressing objects: 50% (22/44)
remote: Compressing objects: 52% (23/44)
remote: Compressing objects: 54% (24/44)
remote: Compressing objects: 56% (25/44)
remote: Compressing objects: 59% (26/44)
remote: Compressing objects: 61% (27/44)
remote: Compressing objects: 63% (28/44)
remote: Compressing objects: 65% (29/44)
remote: Compressing objects: 68% (30/44)
remote: Compressing objects: 70% (31/44)
remote: Compressing objects: 72% (32/44)
remote: Compressing objects: 75% (33/44)
remote: Compressing objects: 77% (34/44)
remote: Compressing objects: 79% (35/44)
remote: Compressing objects: 81% (36/44)
remote: Compressing objects: 84% (37/44)
remote: Compressing objects: 86% (38/44)
remote: Compressing objects: 88% (39/44)
remote: Compressing objects: 90% (40/44)
remote: Compressing objects: 93% (41/44)
remote: Compressing objects: 95% (42/44)
remote: Compressing objects: 97% (43/44)
remote: Compressing objects: 100% (44/44)
remote: Compressing objects: 100% (44/44), done.
remote: Total 50 (delta 10), reused 26 (delta 6), pack-reused 0
From https://github.com/python/cpython
* branch 3.11 -> FETCH_HEAD
Note: switching to 'FETCH_HEAD'.
You are in 'detached HEAD' state. You can look around, make experimental
changes and commit them, and you can discard any commits you make in this
state without impacting any branches by switching back to a branch.
If you want to create a new branch to retain commits you create, you may
do so (now or later) by using -c with the switch command. Example:
git switch -c <new-branch-name>
Or undo this operation with:
git switch -
Turn off this advice by setting config variable advice.detachedHead to false
HEAD is now at 648d42643e README: remove unmaintained sections (GH-107703)
Switched to and reset branch '3.11'
Could Not Find b:\uildarea\3.11.ware-win11.refleak\build\Lib\*.pyc
The system cannot find the file specified.
Could Not Find b:\uildarea\3.11.ware-win11.refleak\build\PCbuild\python*.zip
WARNING: Disable --verbose3 because it's incompatible with --huntrleaks: see http://bugs.python.org/issue27103
Could Not Find b:\uildarea\3.11.ware-win11.refleak\build\PCbuild\python*.zip
Test report
===========
Sincerely,
-The BuildbotThe Buildbot has detected a new failure on builder s390x Fedora Rawhide Refleaks 3.11 while building Python.
Full details are available at:
https://buildbot.python.org/all/#/builders/1000/builds/448
Buildbot URL: https://buildbot.python.org/all/
Worker for this Build: edelsohn-fedora-rawhide-z
Build Reason: <unknown>
Blamelist:
BUILD FAILED: failed test (failure)
Summary of the results of the build (if available):
===================================================
== Tests result: FAILURE then FAILURE ==
418 tests OK.
10 slowest tests:
- test_signal: 31 min 1 sec
- test_concurrent_futures: 15 min 31 sec
- test_asyncio: 14 min 46 sec
- test_multiprocessing_spawn: 13 min 26 sec
- test_multiprocessing_forkserver: 8 min 42 sec
- test_multiprocessing_fork: 7 min 5 sec
- test_socket: 3 min 49 sec
- test_io: 3 min 21 sec
- test_imaplib: 3 min 14 sec
- test_compileall: 2 min 50 sec
1 test failed:
test_tools
15 tests skipped:
test_devpoll test_gdb test_ioctl test_kqueue test_launcher
test_msilib test_nis test_startfile test_tix test_tk
test_ttk_guionly test_winconsoleio test_winreg test_winsound
test_zipfile64
3 re-run tests:
test_peg_generator test_tools test_venv
Total duration: 52 min 28 sec
Captured traceback
==================
Traceback (most recent call last):
File "/home/dje/cpython-buildarea/3.11.edelsohn-fedora-rawhide-z.refleak/build/Lib/test/test_venv.py", line 748, in nicer_error
yield
File "/home/dje/cpython-buildarea/3.11.edelsohn-fedora-rawhide-z.refleak/build/Lib/test/test_venv.py", line 683, in do_test_with_pip
self.run_with_capture(venv.create, self.env_dir,
File "/home/dje/cpython-buildarea/3.11.edelsohn-fedora-rawhide-z.refleak/build/Lib/test/test_venv.py", line 87, in run_with_capture
func(*args, **kwargs)
File "/home/dje/cpython-buildarea/3.11.edelsohn-fedora-rawhide-z.refleak/build/Lib/venv/__init__.py", line 468, in create
builder.create(env_dir)
File "/home/dje/cpython-buildarea/3.11.edelsohn-fedora-rawhide-z.refleak/build/Lib/venv/__init__.py", line 76, in create
self._setup_pip(context)
File "/home/dje/cpython-buildarea/3.11.edelsohn-fedora-rawhide-z.refleak/build/Lib/venv/__init__.py", line 358, in _setup_pip
self._call_new_python(context, '-m', 'ensurepip', '--upgrade',
File "/home/dje/cpython-buildarea/3.11.edelsohn-fedora-rawhide-z.refleak/build/Lib/venv/__init__.py", line 354, in _call_new_python
subprocess.check_output(args, **kwargs)
File "/home/dje/cpython-buildarea/3.11.edelsohn-fedora-rawhide-z.refleak/build/Lib/subprocess.py", line 466, in check_output
return run(*popenargs, stdout=PIPE, timeout=timeout, check=True,
^^^^^^^^^^^^^^^^^^^^^^^^^^^^^^^^^^^^^^^^^^^^^^^^^^^^^^^^^
File "/home/dje/cpython-buildarea/3.11.edelsohn-fedora-rawhide-z.refleak/build/Lib/subprocess.py", line 571, in run
raise CalledProcessError(retcode, process.args,
subprocess.CalledProcessError: Command '['/tmp/tmp4ebxhy_h/bin/python', '-m', 'ensurepip', '--upgrade', '--default-pip']' returned non-zero exit status 1.
Traceback (most recent call last):
File "/home/dje/cpython-buildarea/3.11.edelsohn-fedora-rawhide-z.refleak/build/Lib/multiprocessing/util.py", line 300, in _run_finalizers
finalizer()
File "/home/dje/cpython-buildarea/3.11.edelsohn-fedora-rawhide-z.refleak/build/Lib/multiprocessing/util.py", line 224, in __call__
res = self._callback(*self._args, **self._kwargs)
^^^^^^^^^^^^^^^^^^^^^^^^^^^^^^^^^^^^^^^^^^^
File "/home/dje/cpython-buildarea/3.11.edelsohn-fedora-rawhide-z.refleak/build/Lib/multiprocessing/synchronize.py", line 87, in _cleanup
sem_unlink(name)
FileNotFoundError: [Errno 2] No such file or directory
Traceback (most recent call last):
File "/home/dje/cpython-buildarea/3.11.edelsohn-fedora-rawhide-z.refleak/build/Lib/multiprocessing/util.py", line 300, in _run_finalizers
finalizer()
File "/home/dje/cpython-buildarea/3.11.edelsohn-fedora-rawhide-z.refleak/build/Lib/multiprocessing/util.py", line 224, in __call__
res = self._callback(*self._args, **self._kwargs)
^^^^^^^^^^^^^^^^^^^^^^^^^^^^^^^^^^^^^^^^^^^
File "/home/dje/cpython-buildarea/3.11.edelsohn-fedora-rawhide-z.refleak/build/Lib/multiprocessing/synchronize.py", line 87, in _cleanup
sem_unlink(name)
FileNotFoundError: [Errno 2] No such file or directory
Traceback (most recent call last):
File "/home/dje/cpython-buildarea/3.11.edelsohn-fedora-rawhide-z.refleak/build/Lib/multiprocessing/util.py", line 300, in _run_finalizers
finalizer()
File "/home/dje/cpython-buildarea/3.11.edelsohn-fedora-rawhide-z.refleak/build/Lib/multiprocessing/util.py", line 224, in __call__
res = self._callback(*self._args, **self._kwargs)
^^^^^^^^^^^^^^^^^^^^^^^^^^^^^^^^^^^^^^^^^^^
File "/home/dje/cpython-buildarea/3.11.edelsohn-fedora-rawhide-z.refleak/build/Lib/multiprocessing/synchronize.py", line 87, in _cleanup
sem_unlink(name)
FileNotFoundError: [Errno 2] No such file or directory
Traceback (most recent call last):
File "/home/dje/cpython-buildarea/3.11.edelsohn-fedora-rawhide-z.refleak/build/Lib/multiprocessing/util.py", line 300, in _run_finalizers
finalizer()
File "/home/dje/cpython-buildarea/3.11.edelsohn-fedora-rawhide-z.refleak/build/Lib/multiprocessing/util.py", line 224, in __call__
res = self._callback(*self._args, **self._kwargs)
^^^^^^^^^^^^^^^^^^^^^^^^^^^^^^^^^^^^^^^^^^^
File "/home/dje/cpython-buildarea/3.11.edelsohn-fedora-rawhide-z.refleak/build/Lib/multiprocessing/synchronize.py", line 87, in _cleanup
sem_unlink(name)
FileNotFoundError: [Errno 2] No such file or directory
Traceback (most recent call last):
File "/home/dje/cpython-buildarea/3.11.edelsohn-fedora-rawhide-z.refleak/build/Lib/multiprocessing/util.py", line 300, in _run_finalizers
finalizer()
File "/home/dje/cpython-buildarea/3.11.edelsohn-fedora-rawhide-z.refleak/build/Lib/multiprocessing/util.py", line 224, in __call__
res = self._callback(*self._args, **self._kwargs)
^^^^^^^^^^^^^^^^^^^^^^^^^^^^^^^^^^^^^^^^^^^
File "/home/dje/cpython-buildarea/3.11.edelsohn-fedora-rawhide-z.refleak/build/Lib/multiprocessing/synchronize.py", line 87, in _cleanup
sem_unlink(name)
FileNotFoundError: [Errno 2] No such file or directory
Traceback (most recent call last):
File "/home/dje/cpython-buildarea/3.11.edelsohn-fedora-rawhide-z.refleak/build/Lib/multiprocessing/util.py", line 300, in _run_finalizers
finalizer()
File "/home/dje/cpython-buildarea/3.11.edelsohn-fedora-rawhide-z.refleak/build/Lib/multiprocessing/util.py", line 224, in __call__
res = self._callback(*self._args, **self._kwargs)
^^^^^^^^^^^^^^^^^^^^^^^^^^^^^^^^^^^^^^^^^^^
File "/home/dje/cpython-buildarea/3.11.edelsohn-fedora-rawhide-z.refleak/build/Lib/multiprocessing/synchronize.py", line 87, in _cleanup
sem_unlink(name)
FileNotFoundError: [Errno 2] No such file or directory
./home/dje/cpython-buildarea/3.11.edelsohn-fedora-rawhide-z.refleak/build/Lib/multiprocessing/resource_tracker.py:224: UserWarning: resource_tracker: There appear to be 6 leaked semaphore objects to clean up at shutdown
warnings.warn('resource_tracker: There appear to be %d '
Traceback (most recent call last):
File "/home/dje/cpython-buildarea/3.11.edelsohn-fedora-rawhide-z.refleak/build/Lib/multiprocessing/util.py", line 300, in _run_finalizers
finalizer()
File "/home/dje/cpython-buildarea/3.11.edelsohn-fedora-rawhide-z.refleak/build/Lib/multiprocessing/util.py", line 224, in __call__
res = self._callback(*self._args, **self._kwargs)
^^^^^^^^^^^^^^^^^^^^^^^^^^^^^^^^^^^^^^^^^^^
File "/home/dje/cpython-buildarea/3.11.edelsohn-fedora-rawhide-z.refleak/build/Lib/multiprocessing/synchronize.py", line 87, in _cleanup
sem_unlink(name)
FileNotFoundError: [Errno 2] No such file or directory
Traceback (most recent call last):
File "/home/dje/cpython-buildarea/3.11.edelsohn-fedora-rawhide-z.refleak/build/Lib/multiprocessing/util.py", line 300, in _run_finalizers
finalizer()
File "/home/dje/cpython-buildarea/3.11.edelsohn-fedora-rawhide-z.refleak/build/Lib/multiprocessing/util.py", line 224, in __call__
res = self._callback(*self._args, **self._kwargs)
^^^^^^^^^^^^^^^^^^^^^^^^^^^^^^^^^^^^^^^^^^^
File "/home/dje/cpython-buildarea/3.11.edelsohn-fedora-rawhide-z.refleak/build/Lib/multiprocessing/synchronize.py", line 87, in _cleanup
sem_unlink(name)
FileNotFoundError: [Errno 2] No such file or directory
Traceback (most recent call last):
File "/home/dje/cpython-buildarea/3.11.edelsohn-fedora-rawhide-z.refleak/build/Lib/multiprocessing/util.py", line 300, in _run_finalizers
finalizer()
File "/home/dje/cpython-buildarea/3.11.edelsohn-fedora-rawhide-z.refleak/build/Lib/multiprocessing/util.py", line 224, in __call__
res = self._callback(*self._args, **self._kwargs)
^^^^^^^^^^^^^^^^^^^^^^^^^^^^^^^^^^^^^^^^^^^
File "/home/dje/cpython-buildarea/3.11.edelsohn-fedora-rawhide-z.refleak/build/Lib/multiprocessing/synchronize.py", line 87, in _cleanup
sem_unlink(name)
FileNotFoundError: [Errno 2] No such file or directory
Traceback (most recent call last):
File "/home/dje/cpython-buildarea/3.11.edelsohn-fedora-rawhide-z.refleak/build/Lib/multiprocessing/util.py", line 300, in _run_finalizers
finalizer()
File "/home/dje/cpython-buildarea/3.11.edelsohn-fedora-rawhide-z.refleak/build/Lib/multiprocessing/util.py", line 224, in __call__
res = self._callback(*self._args, **self._kwargs)
^^^^^^^^^^^^^^^^^^^^^^^^^^^^^^^^^^^^^^^^^^^
File "/home/dje/cpython-buildarea/3.11.edelsohn-fedora-rawhide-z.refleak/build/Lib/multiprocessing/synchronize.py", line 87, in _cleanup
sem_unlink(name)
FileNotFoundError: [Errno 2] No such file or directory
Traceback (most recent call last):
File "/home/dje/cpython-buildarea/3.11.edelsohn-fedora-rawhide-z.refleak/build/Lib/multiprocessing/util.py", line 300, in _run_finalizers
finalizer()
File "/home/dje/cpython-buildarea/3.11.edelsohn-fedora-rawhide-z.refleak/build/Lib/multiprocessing/util.py", line 224, in __call__
res = self._callback(*self._args, **self._kwargs)
^^^^^^^^^^^^^^^^^^^^^^^^^^^^^^^^^^^^^^^^^^^
File "/home/dje/cpython-buildarea/3.11.edelsohn-fedora-rawhide-z.refleak/build/Lib/multiprocessing/synchronize.py", line 87, in _cleanup
sem_unlink(name)
FileNotFoundError: [Errno 2] No such file or directory
Traceback (most recent call last):
File "/home/dje/cpython-buildarea/3.11.edelsohn-fedora-rawhide-z.refleak/build/Lib/multiprocessing/util.py", line 300, in _run_finalizers
finalizer()
File "/home/dje/cpython-buildarea/3.11.edelsohn-fedora-rawhide-z.refleak/build/Lib/multiprocessing/util.py", line 224, in __call__
res = self._callback(*self._args, **self._kwargs)
^^^^^^^^^^^^^^^^^^^^^^^^^^^^^^^^^^^^^^^^^^^
File "/home/dje/cpython-buildarea/3.11.edelsohn-fedora-rawhide-z.refleak/build/Lib/multiprocessing/synchronize.py", line 87, in _cleanup
sem_unlink(name)
FileNotFoundError: [Errno 2] No such file or directory
./home/dje/cpython-buildarea/3.11.edelsohn-fedora-rawhide-z.refleak/build/Lib/multiprocessing/resource_tracker.py:224: UserWarning: resource_tracker: There appear to be 6 leaked semaphore objects to clean up at shutdown
warnings.warn('resource_tracker: There appear to be %d '
Traceback (most recent call last):
File "/home/dje/cpython-buildarea/3.11.edelsohn-fedora-rawhide-z.refleak/build/Lib/multiprocessing/util.py", line 300, in _run_finalizers
finalizer()
File "/home/dje/cpython-buildarea/3.11.edelsohn-fedora-rawhide-z.refleak/build/Lib/multiprocessing/util.py", line 224, in __call__
res = self._callback(*self._args, **self._kwargs)
^^^^^^^^^^^^^^^^^^^^^^^^^^^^^^^^^^^^^^^^^^^
File "/home/dje/cpython-buildarea/3.11.edelsohn-fedora-rawhide-z.refleak/build/Lib/multiprocessing/synchronize.py", line 87, in _cleanup
sem_unlink(name)
FileNotFoundError: [Errno 2] No such file or directory
Traceback (most recent call last):
File "/home/dje/cpython-buildarea/3.11.edelsohn-fedora-rawhide-z.refleak/build/Lib/multiprocessing/util.py", line 300, in _run_finalizers
finalizer()
File "/home/dje/cpython-buildarea/3.11.edelsohn-fedora-rawhide-z.refleak/build/Lib/multiprocessing/util.py", line 224, in __call__
res = self._callback(*self._args, **self._kwargs)
^^^^^^^^^^^^^^^^^^^^^^^^^^^^^^^^^^^^^^^^^^^
File "/home/dje/cpython-buildarea/3.11.edelsohn-fedora-rawhide-z.refleak/build/Lib/multiprocessing/synchronize.py", line 87, in _cleanup
sem_unlink(name)
FileNotFoundError: [Errno 2] No such file or directory
Traceback (most recent call last):
File "/home/dje/cpython-buildarea/3.11.edelsohn-fedora-rawhide-z.refleak/build/Lib/multiprocessing/util.py", line 300, in _run_finalizers
finalizer()
File "/home/dje/cpython-buildarea/3.11.edelsohn-fedora-rawhide-z.refleak/build/Lib/multiprocessing/util.py", line 224, in __call__
res = self._callback(*self._args, **self._kwargs)
^^^^^^^^^^^^^^^^^^^^^^^^^^^^^^^^^^^^^^^^^^^
File "/home/dje/cpython-buildarea/3.11.edelsohn-fedora-rawhide-z.refleak/build/Lib/multiprocessing/synchronize.py", line 87, in _cleanup
sem_unlink(name)
FileNotFoundError: [Errno 2] No such file or directory
Traceback (most recent call last):
File "/home/dje/cpython-buildarea/3.11.edelsohn-fedora-rawhide-z.refleak/build/Lib/multiprocessing/util.py", line 300, in _run_finalizers
finalizer()
File "/home/dje/cpython-buildarea/3.11.edelsohn-fedora-rawhide-z.refleak/build/Lib/multiprocessing/util.py", line 224, in __call__
res = self._callback(*self._args, **self._kwargs)
^^^^^^^^^^^^^^^^^^^^^^^^^^^^^^^^^^^^^^^^^^^
File "/home/dje/cpython-buildarea/3.11.edelsohn-fedora-rawhide-z.refleak/build/Lib/multiprocessing/synchronize.py", line 87, in _cleanup
sem_unlink(name)
FileNotFoundError: [Errno 2] No such file or directory
Traceback (most recent call last):
File "/home/dje/cpython-buildarea/3.11.edelsohn-fedora-rawhide-z.refleak/build/Lib/multiprocessing/util.py", line 300, in _run_finalizers
finalizer()
File "/home/dje/cpython-buildarea/3.11.edelsohn-fedora-rawhide-z.refleak/build/Lib/multiprocessing/util.py", line 224, in __call__
res = self._callback(*self._args, **self._kwargs)
^^^^^^^^^^^^^^^^^^^^^^^^^^^^^^^^^^^^^^^^^^^
File "/home/dje/cpython-buildarea/3.11.edelsohn-fedora-rawhide-z.refleak/build/Lib/multiprocessing/synchronize.py", line 87, in _cleanup
sem_unlink(name)
FileNotFoundError: [Errno 2] No such file or directory
Traceback (most recent call last):
File "/home/dje/cpython-buildarea/3.11.edelsohn-fedora-rawhide-z.refleak/build/Lib/multiprocessing/util.py", line 300, in _run_finalizers
finalizer()
File "/home/dje/cpython-buildarea/3.11.edelsohn-fedora-rawhide-z.refleak/build/Lib/multiprocessing/util.py", line 224, in __call__
res = self._callback(*self._args, **self._kwargs)
^^^^^^^^^^^^^^^^^^^^^^^^^^^^^^^^^^^^^^^^^^^
File "/home/dje/cpython-buildarea/3.11.edelsohn-fedora-rawhide-z.refleak/build/Lib/multiprocessing/synchronize.py", line 87, in _cleanup
sem_unlink(name)
FileNotFoundError: [Errno 2] No such file or directory
./home/dje/cpython-buildarea/3.11.edelsohn-fedora-rawhide-z.refleak/build/Lib/multiprocessing/resource_tracker.py:224: UserWarning: resource_tracker: There appear to be 6 leaked semaphore objects to clean up at shutdown
warnings.warn('resource_tracker: There appear to be %d '
Traceback (most recent call last):
File "/home/dje/cpython-buildarea/3.11.edelsohn-fedora-rawhide-z.refleak/build/Lib/multiprocessing/util.py", line 300, in _run_finalizers
finalizer()
File "/home/dje/cpython-buildarea/3.11.edelsohn-fedora-rawhide-z.refleak/build/Lib/multiprocessing/util.py", line 224, in __call__
res = self._callback(*self._args, **self._kwargs)
^^^^^^^^^^^^^^^^^^^^^^^^^^^^^^^^^^^^^^^^^^^
File "/home/dje/cpython-buildarea/3.11.edelsohn-fedora-rawhide-z.refleak/build/Lib/multiprocessing/synchronize.py", line 87, in _cleanup
sem_unlink(name)
FileNotFoundError: [Errno 2] No such file or directory
Traceback (most recent call last):
File "/home/dje/cpython-buildarea/3.11.edelsohn-fedora-rawhide-z.refleak/build/Lib/multiprocessing/util.py", line 300, in _run_finalizers
finalizer()
File "/home/dje/cpython-buildarea/3.11.edelsohn-fedora-rawhide-z.refleak/build/Lib/multiprocessing/util.py", line 224, in __call__
res = self._callback(*self._args, **self._kwargs)
^^^^^^^^^^^^^^^^^^^^^^^^^^^^^^^^^^^^^^^^^^^
File "/home/dje/cpython-buildarea/3.11.edelsohn-fedora-rawhide-z.refleak/build/Lib/multiprocessing/synchronize.py", line 87, in _cleanup
sem_unlink(name)
FileNotFoundError: [Errno 2] No such file or directory
Traceback (most recent call last):
File "/home/dje/cpython-buildarea/3.11.edelsohn-fedora-rawhide-z.refleak/build/Lib/multiprocessing/util.py", line 300, in _run_finalizers
finalizer()
File "/home/dje/cpython-buildarea/3.11.edelsohn-fedora-rawhide-z.refleak/build/Lib/multiprocessing/util.py", line 224, in __call__
res = self._callback(*self._args, **self._kwargs)
^^^^^^^^^^^^^^^^^^^^^^^^^^^^^^^^^^^^^^^^^^^
File "/home/dje/cpython-buildarea/3.11.edelsohn-fedora-rawhide-z.refleak/build/Lib/multiprocessing/synchronize.py", line 87, in _cleanup
sem_unlink(name)
FileNotFoundError: [Errno 2] No such file or directory
Traceback (most recent call last):
File "/home/dje/cpython-buildarea/3.11.edelsohn-fedora-rawhide-z.refleak/build/Lib/multiprocessing/util.py", line 300, in _run_finalizers
finalizer()
File "/home/dje/cpython-buildarea/3.11.edelsohn-fedora-rawhide-z.refleak/build/Lib/multiprocessing/util.py", line 224, in __call__
res = self._callback(*self._args, **self._kwargs)
^^^^^^^^^^^^^^^^^^^^^^^^^^^^^^^^^^^^^^^^^^^
File "/home/dje/cpython-buildarea/3.11.edelsohn-fedora-rawhide-z.refleak/build/Lib/multiprocessing/synchronize.py", line 87, in _cleanup
sem_unlink(name)
FileNotFoundError: [Errno 2] No such file or directory
Traceback (most recent call last):
File "/home/dje/cpython-buildarea/3.11.edelsohn-fedora-rawhide-z.refleak/build/Lib/multiprocessing/util.py", line 300, in _run_finalizers
finalizer()
File "/home/dje/cpython-buildarea/3.11.edelsohn-fedora-rawhide-z.refleak/build/Lib/multiprocessing/util.py", line 224, in __call__
res = self._callback(*self._args, **self._kwargs)
^^^^^^^^^^^^^^^^^^^^^^^^^^^^^^^^^^^^^^^^^^^
File "/home/dje/cpython-buildarea/3.11.edelsohn-fedora-rawhide-z.refleak/build/Lib/multiprocessing/synchronize.py", line 87, in _cleanup
sem_unlink(name)
FileNotFoundError: [Errno 2] No such file or directory
Traceback (most recent call last):
File "/home/dje/cpython-buildarea/3.11.edelsohn-fedora-rawhide-z.refleak/build/Lib/multiprocessing/util.py", line 300, in _run_finalizers
finalizer()
File "/home/dje/cpython-buildarea/3.11.edelsohn-fedora-rawhide-z.refleak/build/Lib/multiprocessing/util.py", line 224, in __call__
res = self._callback(*self._args, **self._kwargs)
^^^^^^^^^^^^^^^^^^^^^^^^^^^^^^^^^^^^^^^^^^^
File "/home/dje/cpython-buildarea/3.11.edelsohn-fedora-rawhide-z.refleak/build/Lib/multiprocessing/synchronize.py", line 87, in _cleanup
sem_unlink(name)
FileNotFoundError: [Errno 2] No such file or directory
./home/dje/cpython-buildarea/3.11.edelsohn-fedora-rawhide-z.refleak/build/Lib/multiprocessing/resource_tracker.py:224: UserWarning: resource_tracker: There appear to be 6 leaked semaphore objects to clean up at shutdown
warnings.warn('resource_tracker: There appear to be %d '
Traceback (most recent call last):
File "/home/dje/cpython-buildarea/3.11.edelsohn-fedora-rawhide-z.refleak/build/Lib/multiprocessing/util.py", line 300, in _run_finalizers
finalizer()
File "/home/dje/cpython-buildarea/3.11.edelsohn-fedora-rawhide-z.refleak/build/Lib/multiprocessing/util.py", line 224, in __call__
res = self._callback(*self._args, **self._kwargs)
^^^^^^^^^^^^^^^^^^^^^^^^^^^^^^^^^^^^^^^^^^^
File "/home/dje/cpython-buildarea/3.11.edelsohn-fedora-rawhide-z.refleak/build/Lib/multiprocessing/synchronize.py", line 87, in _cleanup
sem_unlink(name)
FileNotFoundError: [Errno 2] No such file or directory
Traceback (most recent call last):
File "/home/dje/cpython-buildarea/3.11.edelsohn-fedora-rawhide-z.refleak/build/Lib/multiprocessing/util.py", line 300, in _run_finalizers
finalizer()
File "/home/dje/cpython-buildarea/3.11.edelsohn-fedora-rawhide-z.refleak/build/Lib/multiprocessing/util.py", line 224, in __call__
res = self._callback(*self._args, **self._kwargs)
^^^^^^^^^^^^^^^^^^^^^^^^^^^^^^^^^^^^^^^^^^^
File "/home/dje/cpython-buildarea/3.11.edelsohn-fedora-rawhide-z.refleak/build/Lib/multiprocessing/synchronize.py", line 87, in _cleanup
sem_unlink(name)
FileNotFoundError: [Errno 2] No such file or directory
Traceback (most recent call last):
File "/home/dje/cpython-buildarea/3.11.edelsohn-fedora-rawhide-z.refleak/build/Lib/multiprocessing/util.py", line 300, in _run_finalizers
finalizer()
File "/home/dje/cpython-buildarea/3.11.edelsohn-fedora-rawhide-z.refleak/build/Lib/multiprocessing/util.py", line 224, in __call__
res = self._callback(*self._args, **self._kwargs)
^^^^^^^^^^^^^^^^^^^^^^^^^^^^^^^^^^^^^^^^^^^
File "/home/dje/cpython-buildarea/3.11.edelsohn-fedora-rawhide-z.refleak/build/Lib/multiprocessing/synchronize.py", line 87, in _cleanup
sem_unlink(name)
FileNotFoundError: [Errno 2] No such file or directory
Traceback (most recent call last):
File "/home/dje/cpython-buildarea/3.11.edelsohn-fedora-rawhide-z.refleak/build/Lib/multiprocessing/util.py", line 300, in _run_finalizers
finalizer()
File "/home/dje/cpython-buildarea/3.11.edelsohn-fedora-rawhide-z.refleak/build/Lib/multiprocessing/util.py", line 224, in __call__
res = self._callback(*self._args, **self._kwargs)
^^^^^^^^^^^^^^^^^^^^^^^^^^^^^^^^^^^^^^^^^^^
File "/home/dje/cpython-buildarea/3.11.edelsohn-fedora-rawhide-z.refleak/build/Lib/multiprocessing/synchronize.py", line 87, in _cleanup
sem_unlink(name)
FileNotFoundError: [Errno 2] No such file or directory
Traceback (most recent call last):
File "/home/dje/cpython-buildarea/3.11.edelsohn-fedora-rawhide-z.refleak/build/Lib/multiprocessing/util.py", line 300, in _run_finalizers
finalizer()
File "/home/dje/cpython-buildarea/3.11.edelsohn-fedora-rawhide-z.refleak/build/Lib/multiprocessing/util.py", line 224, in __call__
res = self._callback(*self._args, **self._kwargs)
^^^^^^^^^^^^^^^^^^^^^^^^^^^^^^^^^^^^^^^^^^^
File "/home/dje/cpython-buildarea/3.11.edelsohn-fedora-rawhide-z.refleak/build/Lib/multiprocessing/synchronize.py", line 87, in _cleanup
sem_unlink(name)
FileNotFoundError: [Errno 2] No such file or directory
Traceback (most recent call last):
File "/home/dje/cpython-buildarea/3.11.edelsohn-fedora-rawhide-z.refleak/build/Lib/multiprocessing/util.py", line 300, in _run_finalizers
finalizer()
File "/home/dje/cpython-buildarea/3.11.edelsohn-fedora-rawhide-z.refleak/build/Lib/multiprocessing/util.py", line 224, in __call__
res = self._callback(*self._args, **self._kwargs)
^^^^^^^^^^^^^^^^^^^^^^^^^^^^^^^^^^^^^^^^^^^
File "/home/dje/cpython-buildarea/3.11.edelsohn-fedora-rawhide-z.refleak/build/Lib/multiprocessing/synchronize.py", line 87, in _cleanup
sem_unlink(name)
FileNotFoundError: [Errno 2] No such file or directory
./home/dje/cpython-buildarea/3.11.edelsohn-fedora-rawhide-z.refleak/build/Lib/multiprocessing/resource_tracker.py:224: UserWarning: resource_tracker: There appear to be 6 leaked semaphore objects to clean up at shutdown
warnings.warn('resource_tracker: There appear to be %d '
Traceback (most recent call last):
File "/home/dje/cpython-buildarea/3.11.edelsohn-fedora-rawhide-z.refleak/build/Lib/multiprocessing/util.py", line 300, in _run_finalizers
finalizer()
File "/home/dje/cpython-buildarea/3.11.edelsohn-fedora-rawhide-z.refleak/build/Lib/multiprocessing/util.py", line 224, in __call__
res = self._callback(*self._args, **self._kwargs)
^^^^^^^^^^^^^^^^^^^^^^^^^^^^^^^^^^^^^^^^^^^
File "/home/dje/cpython-buildarea/3.11.edelsohn-fedora-rawhide-z.refleak/build/Lib/multiprocessing/synchronize.py", line 87, in _cleanup
sem_unlink(name)
FileNotFoundError: [Errno 2] No such file or directory
Traceback (most recent call last):
File "/home/dje/cpython-buildarea/3.11.edelsohn-fedora-rawhide-z.refleak/build/Lib/multiprocessing/util.py", line 300, in _run_finalizers
finalizer()
File "/home/dje/cpython-buildarea/3.11.edelsohn-fedora-rawhide-z.refleak/build/Lib/multiprocessing/util.py", line 224, in __call__
res = self._callback(*self._args, **self._kwargs)
^^^^^^^^^^^^^^^^^^^^^^^^^^^^^^^^^^^^^^^^^^^
File "/home/dje/cpython-buildarea/3.11.edelsohn-fedora-rawhide-z.refleak/build/Lib/multiprocessing/synchronize.py", line 87, in _cleanup
sem_unlink(name)
FileNotFoundError: [Errno 2] No such file or directory
Traceback (most recent call last):
File "/home/dje/cpython-buildarea/3.11.edelsohn-fedora-rawhide-z.refleak/build/Lib/multiprocessing/util.py", line 300, in _run_finalizers
finalizer()
File "/home/dje/cpython-buildarea/3.11.edelsohn-fedora-rawhide-z.refleak/build/Lib/multiprocessing/util.py", line 224, in __call__
res = self._callback(*self._args, **self._kwargs)
^^^^^^^^^^^^^^^^^^^^^^^^^^^^^^^^^^^^^^^^^^^
File "/home/dje/cpython-buildarea/3.11.edelsohn-fedora-rawhide-z.refleak/build/Lib/multiprocessing/synchronize.py", line 87, in _cleanup
sem_unlink(name)
FileNotFoundError: [Errno 2] No such file or directory
Traceback (most recent call last):
File "/home/dje/cpython-buildarea/3.11.edelsohn-fedora-rawhide-z.refleak/build/Lib/multiprocessing/util.py", line 300, in _run_finalizers
finalizer()
File "/home/dje/cpython-buildarea/3.11.edelsohn-fedora-rawhide-z.refleak/build/Lib/multiprocessing/util.py", line 224, in __call__
res = self._callback(*self._args, **self._kwargs)
^^^^^^^^^^^^^^^^^^^^^^^^^^^^^^^^^^^^^^^^^^^
File "/home/dje/cpython-buildarea/3.11.edelsohn-fedora-rawhide-z.refleak/build/Lib/multiprocessing/synchronize.py", line 87, in _cleanup
sem_unlink(name)
FileNotFoundError: [Errno 2] No such file or directory
Traceback (most recent call last):
File "/home/dje/cpython-buildarea/3.11.edelsohn-fedora-rawhide-z.refleak/build/Lib/multiprocessing/util.py", line 300, in _run_finalizers
finalizer()
File "/home/dje/cpython-buildarea/3.11.edelsohn-fedora-rawhide-z.refleak/build/Lib/multiprocessing/util.py", line 224, in __call__
res = self._callback(*self._args, **self._kwargs)
^^^^^^^^^^^^^^^^^^^^^^^^^^^^^^^^^^^^^^^^^^^
File "/home/dje/cpython-buildarea/3.11.edelsohn-fedora-rawhide-z.refleak/build/Lib/multiprocessing/synchronize.py", line 87, in _cleanup
sem_unlink(name)
FileNotFoundError: [Errno 2] No such file or directory
Traceback (most recent call last):
File "/home/dje/cpython-buildarea/3.11.edelsohn-fedora-rawhide-z.refleak/build/Lib/multiprocessing/util.py", line 300, in _run_finalizers
finalizer()
File "/home/dje/cpython-buildarea/3.11.edelsohn-fedora-rawhide-z.refleak/build/Lib/multiprocessing/util.py", line 224, in __call__
res = self._callback(*self._args, **self._kwargs)
^^^^^^^^^^^^^^^^^^^^^^^^^^^^^^^^^^^^^^^^^^^
File "/home/dje/cpython-buildarea/3.11.edelsohn-fedora-rawhide-z.refleak/build/Lib/multiprocessing/synchronize.py", line 87, in _cleanup
sem_unlink(name)
FileNotFoundError: [Errno 2] No such file or directory
.
Traceback (most recent call last):
File "/home/dje/cpython-buildarea/3.11.edelsohn-fedora-rawhide-z.refleak/build/Lib/multiprocessing/resource_tracker.py", line 209, in main
cache[rtype].remove(name)
KeyError: '/psm_18e7c50e'
.Traceback (most recent call last):
File "/home/dje/cpython-buildarea/3.11.edelsohn-fedora-rawhide-z.refleak/build/Lib/multiprocessing/resource_tracker.py", line 209, in main
cache[rtype].remove(name)
KeyError: '/psm_6b177c67'
.Traceback (most recent call last):
File "/home/dje/cpython-buildarea/3.11.edelsohn-fedora-rawhide-z.refleak/build/Lib/multiprocessing/resource_tracker.py", line 209, in main
cache[rtype].remove(name)
KeyError: '/psm_7102d94e'
.Traceback (most recent call last):
File "/home/dje/cpython-buildarea/3.11.edelsohn-fedora-rawhide-z.refleak/build/Lib/multiprocessing/resource_tracker.py", line 209, in main
cache[rtype].remove(name)
KeyError: '/psm_8b900d07'
.Traceback (most recent call last):
File "/home/dje/cpython-buildarea/3.11.edelsohn-fedora-rawhide-z.refleak/build/Lib/multiprocessing/resource_tracker.py", line 209, in main
cache[rtype].remove(name)
KeyError: '/psm_3a91f129'
.Traceback (most recent call last):
File "/home/dje/cpython-buildarea/3.11.edelsohn-fedora-rawhide-z.refleak/build/Lib/multiprocessing/resource_tracker.py", line 209, in main
cache[rtype].remove(name)
KeyError: '/psm_07c5f73f'
.
Traceback (most recent call last):
File "/tmp/tmphxqp9lgq/cpython/Lib/runpy.py", line 198, in _run_module_as_main
return _run_code(code, main_globals, None,
^^^^^^^^^^^^^^^^^^^^^^^^^^^^^^^^^^^
File "/tmp/tmphxqp9lgq/cpython/Lib/runpy.py", line 88, in _run_code
exec(code, run_globals)
File "/tmp/tmphxqp9lgq/cpython/Lib/ensurepip/__main__.py", line 5, in <module>
sys.exit(ensurepip._main())
^^^^^^^^^^^^^^^^^
File "/tmp/tmphxqp9lgq/cpython/Lib/ensurepip/__init__.py", line 286, in _main
return _bootstrap(
^^^^^^^^^^^
File "/tmp/tmphxqp9lgq/cpython/Lib/ensurepip/__init__.py", line 202, in _bootstrap
return _run_pip([*args, *_PACKAGE_NAMES], additional_paths)
^^^^^^^^^^^^^^^^^^^^^^^^^^^^^^^^^^^^^^^^^^^^^^^^^^^^
File "/tmp/tmphxqp9lgq/cpython/Lib/ensurepip/__init__.py", line 103, in _run_pip
return subprocess.run(cmd, check=True).returncode
^^^^^^^^^^^^^^^^^^^^^^^^^^^^^^^
File "/tmp/tmphxqp9lgq/cpython/Lib/subprocess.py", line 571, in run
raise CalledProcessError(retcode, process.args,
subprocess.CalledProcessError: Command '['/tmp/tmphxqp9lgq/python-build/python', '-W', 'ignore::DeprecationWarning', '-c', '\nimport runpy\nimport sys\nsys.path = [\'/tmp/tmpf4qh31mt/setuptools-65.5.0-py3-none-any.whl\', \'/tmp/tmpf4qh31mt/pip-23.2.1-py3-none-any.whl\'] + sys.path\nsys.argv[1:] = [\'install\', \'--no-cache-dir\', \'--no-index\', \'--find-links\', \'/tmp/tmpf4qh31mt\', \'--root\', \'/\', \'--upgrade\', \'setuptools\', \'pip\']\nrunpy.run_module("pip", run_name="__main__", alter_sys=True)\n']' returned non-zero exit status 1.
make[1]: *** [Makefile:1876: install] Error 1
Traceback (most recent call last):
File "/home/dje/cpython-buildarea/3.11.edelsohn-fedora-rawhide-z.refleak/build/Lib/test/test_venv.py", line 761, in test_with_pip
self.do_test_with_pip(True)
File "/home/dje/cpython-buildarea/3.11.edelsohn-fedora-rawhide-z.refleak/build/Lib/test/test_venv.py", line 682, in do_test_with_pip
with self.nicer_error():
File "/home/dje/cpython-buildarea/3.11.edelsohn-fedora-rawhide-z.refleak/build/Lib/contextlib.py", line 155, in __exit__
self.gen.throw(typ, value, traceback)
File "/home/dje/cpython-buildarea/3.11.edelsohn-fedora-rawhide-z.refleak/build/Lib/test/test_venv.py", line 752, in nicer_error
self.fail(
AssertionError: Command '['/tmp/tmp4ebxhy_h/bin/python', '-m', 'ensurepip', '--upgrade', '--default-pip']' returned non-zero exit status 1.
Traceback (most recent call last):
File "/home/dje/cpython-buildarea/3.11.edelsohn-fedora-rawhide-z.refleak/build/Lib/multiprocessing/resource_tracker.py", line 209, in main
cache[rtype].remove(name)
KeyError: '/psm_ee516885'
.Traceback (most recent call last):
File "/home/dje/cpython-buildarea/3.11.edelsohn-fedora-rawhide-z.refleak/build/Lib/multiprocessing/resource_tracker.py", line 209, in main
cache[rtype].remove(name)
KeyError: '/psm_ef818929'
.Traceback (most recent call last):
File "/home/dje/cpython-buildarea/3.11.edelsohn-fedora-rawhide-z.refleak/build/Lib/multiprocessing/resource_tracker.py", line 209, in main
cache[rtype].remove(name)
KeyError: '/psm_6c547f48'
.Traceback (most recent call last):
File "/home/dje/cpython-buildarea/3.11.edelsohn-fedora-rawhide-z.refleak/build/Lib/multiprocessing/resource_tracker.py", line 209, in main
cache[rtype].remove(name)
KeyError: '/psm_3bfaf79c'
.Traceback (most recent call last):
File "/home/dje/cpython-buildarea/3.11.edelsohn-fedora-rawhide-z.refleak/build/Lib/multiprocessing/resource_tracker.py", line 209, in main
cache[rtype].remove(name)
KeyError: '/psm_42e3da7c'
.
Traceback (most recent call last):
File "/home/dje/cpython-buildarea/3.11.edelsohn-fedora-rawhide-z.refleak/build/Lib/multiprocessing/resource_tracker.py", line 209, in main
cache[rtype].remove(name)
KeyError: '/psm_3683fb41'
..Traceback (most recent call last):
File "/home/dje/cpython-buildarea/3.11.edelsohn-fedora-rawhide-z.refleak/build/Lib/multiprocessing/resource_tracker.py", line 209, in main
cache[rtype].remove(name)
KeyError: '/psm_5fa4cbae'
.Traceback (most recent call last):
File "/home/dje/cpython-buildarea/3.11.edelsohn-fedora-rawhide-z.refleak/build/Lib/multiprocessing/resource_tracker.py", line 209, in main
cache[rtype].remove(name)
KeyError: '/psm_fc7684d2'
.Traceback (most recent call last):
File "/home/dje/cpython-buildarea/3.11.edelsohn-fedora-rawhide-z.refleak/build/Lib/multiprocessing/resource_tracker.py", line 209, in main
cache[rtype].remove(name)
KeyError: '/psm_3c8aaa1d'
.Traceback (most recent call last):
File "/home/dje/cpython-buildarea/3.11.edelsohn-fedora-rawhide-z.refleak/build/Lib/multiprocessing/resource_tracker.py", line 209, in main
cache[rtype].remove(name)
KeyError: '/psm_a34faf71'
.
Traceback (most recent call last):
File "/home/dje/cpython-buildarea/3.11.edelsohn-fedora-rawhide-z.refleak/build/Lib/test/test_tools/test_freeze.py", line 27, in test_freeze_simple_script
outdir, scriptfile, python = helper.prepare(script, outdir)
^^^^^^^^^^^^^^^^^^^^^^^^^^^^^^
File "/home/dje/cpython-buildarea/3.11.edelsohn-fedora-rawhide-z.refleak/build/Tools/freeze/test/freeze.py", line 184, in prepare
_run_quiet([MAKE, '-C', builddir, 'install'])
File "/home/dje/cpython-buildarea/3.11.edelsohn-fedora-rawhide-z.refleak/build/Tools/freeze/test/freeze.py", line 25, in _run_quiet
return subprocess.run(
^^^^^^^^^^^^^^^
File "/home/dje/cpython-buildarea/3.11.edelsohn-fedora-rawhide-z.refleak/build/Lib/subprocess.py", line 571, in run
raise CalledProcessError(retcode, process.args,
subprocess.CalledProcessError: Command '['/usr/bin/make', '-C', '/tmp/tmphxqp9lgq/python-build', 'install']' returned non-zero exit status 2.
Traceback (most recent call last):
File "<string>", line 1, in <module>
File "/tmp/tmphxqp9lgq/cpython/Lib/sysconfig.py", line 715, in get_config_var
return get_config_vars().get(name)
^^^^^^^^^^^^^^^^^
File "/tmp/tmphxqp9lgq/cpython/Lib/sysconfig.py", line 670, in get_config_vars
_init_posix(_CONFIG_VARS)
File "/tmp/tmphxqp9lgq/cpython/Lib/sysconfig.py", line 531, in _init_posix
_temp = __import__(name, globals(), locals(), ['build_time_vars'], 0)
^^^^^^^^^^^^^^^^^^^^^^^^^^^^^^^^^^^^^^^^^^^^^^^^^^^^^^^^^^^^^
ModuleNotFoundError: No module named '_sysconfigdata_d_linux_s390x-linux-gnu'
Traceback (most recent call last):
File "<string>", line 1, in <module>
File "/tmp/tmpe_6e4xks/cpython/Lib/sysconfig.py", line 715, in get_config_var
return get_config_vars().get(name)
^^^^^^^^^^^^^^^^^
File "/tmp/tmpe_6e4xks/cpython/Lib/sysconfig.py", line 670, in get_config_vars
_init_posix(_CONFIG_VARS)
File "/tmp/tmpe_6e4xks/cpython/Lib/sysconfig.py", line 531, in _init_posix
_temp = __import__(name, globals(), locals(), ['build_time_vars'], 0)
^^^^^^^^^^^^^^^^^^^^^^^^^^^^^^^^^^^^^^^^^^^^^^^^^^^^^^^^^^^^^
ModuleNotFoundError: No module named '_sysconfigdata_d_linux_s390x-linux-gnu'
Traceback (most recent call last):
File "/home/dje/cpython-buildarea/3.11.edelsohn-fedora-rawhide-z.refleak/build/Lib/test/test_tools/test_freeze.py", line 27, in test_freeze_simple_script
outdir, scriptfile, python = helper.prepare(script, outdir)
^^^^^^^^^^^^^^^^^^^^^^^^^^^^^^
File "/home/dje/cpython-buildarea/3.11.edelsohn-fedora-rawhide-z.refleak/build/Tools/freeze/test/freeze.py", line 184, in prepare
_run_quiet([MAKE, '-C', builddir, 'install'])
File "/home/dje/cpython-buildarea/3.11.edelsohn-fedora-rawhide-z.refleak/build/Tools/freeze/test/freeze.py", line 25, in _run_quiet
return subprocess.run(
^^^^^^^^^^^^^^^
File "/home/dje/cpython-buildarea/3.11.edelsohn-fedora-rawhide-z.refleak/build/Lib/subprocess.py", line 571, in run
raise CalledProcessError(retcode, process.args,
subprocess.CalledProcessError: Command '['/usr/bin/make', '-C', '/tmp/tmpe_6e4xks/python-build', 'install']' returned non-zero exit status 2.
Traceback (most recent call last):
File "/home/dje/cpython-buildarea/3.11.edelsohn-fedora-rawhide-z.refleak/build/Lib/runpy.py", line 198, in _run_module_as_main
return _run_code(code, main_globals, None,
^^^^^^^^^^^^^^^^^^^^^^^^^^^^^^^^^^^
File "/home/dje/cpython-buildarea/3.11.edelsohn-fedora-rawhide-z.refleak/build/Lib/runpy.py", line 88, in _run_code
exec(code, run_globals)
File "/home/dje/cpython-buildarea/3.11.edelsohn-fedora-rawhide-z.refleak/build/Lib/ensurepip/__main__.py", line 5, in <module>
sys.exit(ensurepip._main())
^^^^^^^^^^^^^^^^^
File "/home/dje/cpython-buildarea/3.11.edelsohn-fedora-rawhide-z.refleak/build/Lib/ensurepip/__init__.py", line 286, in _main
return _bootstrap(
^^^^^^^^^^^
File "/home/dje/cpython-buildarea/3.11.edelsohn-fedora-rawhide-z.refleak/build/Lib/ensurepip/__init__.py", line 202, in _bootstrap
return _run_pip([*args, *_PACKAGE_NAMES], additional_paths)
^^^^^^^^^^^^^^^^^^^^^^^^^^^^^^^^^^^^^^^^^^^^^^^^^^^^
File "/home/dje/cpython-buildarea/3.11.edelsohn-fedora-rawhide-z.refleak/build/Lib/ensurepip/__init__.py", line 103, in _run_pip
return subprocess.run(cmd, check=True).returncode
^^^^^^^^^^^^^^^^^^^^^^^^^^^^^^^
File "/home/dje/cpython-buildarea/3.11.edelsohn-fedora-rawhide-z.refleak/build/Lib/subprocess.py", line 571, in run
raise CalledProcessError(retcode, process.args,
subprocess.CalledProcessError: Command '['/tmp/tmp4ebxhy_h/bin/python', '-W', 'ignore::DeprecationWarning', '-c', '\nimport runpy\nimport sys\nsys.path = [\'/tmp/tmpax8ceirj/setuptools-65.5.0-py3-none-any.whl\', \'/tmp/tmpax8ceirj/pip-23.2.1-py3-none-any.whl\'] + sys.path\nsys.argv[1:] = [\'install\', \'--no-cache-dir\', \'--no-index\', \'--find-links\', \'/tmp/tmpax8ceirj\', \'--upgrade\', \'setuptools\', \'pip\']\nrunpy.run_module("pip", run_name="__main__", alter_sys=True)\n']' returned non-zero exit status 1.
Test report
===========
Failed tests:
- test_tools
Failed subtests:
- test_freeze_simple_script - test.test_tools.test_freeze.TestFreeze.test_freeze_simple_script
Sincerely,
-The Buildbot
1
0