Buildbot-status
Threads by month
- ----- 2026 -----
- October
- September
- August
- July
- June
- May
- April
- March
- February
- January
- ----- 2025 -----
- December
- November
- October
- September
- August
- July
- June
- May
- April
- March
- February
- January
- ----- 2024 -----
- December
- November
- October
- September
- August
- July
- June
- May
- April
- March
- February
- January
- ----- 2023 -----
- December
- November
- October
- September
- August
- July
- June
- May
- April
- March
- February
- January
- ----- 2022 -----
- December
- November
- October
- September
- August
- July
- June
- May
- April
- March
- February
- January
- ----- 2021 -----
- December
- November
- October
- September
- August
- July
- June
- May
- April
- March
- February
- January
- ----- 2020 -----
- December
- November
- October
- September
- August
- July
- June
- May
- April
- March
- February
- January
- ----- 2019 -----
- December
- November
- October
- September
- August
- July
- June
- May
- April
- March
- February
- January
- ----- 2018 -----
- December
- November
- October
- September
- August
- July
- June
- May
- April
- March
- February
- January
- ----- 2017 -----
- December
- November
- October
- September
- August
- July
- June
- May
July 2024
- 1 participants
- 255 discussions
The Buildbot worker named edelsohn-rhel-z went away.
It last disconnected at Fri Jul 26 13:37:14 2024.
The admin on record (as reported by WORKER:info/admin) was David Edelsohn <dje.gcc+bb(a)gmail.com>
.
1
0
☠ Buildbot (Python): - failed test (failure) (0300e33b223a6cfd691bea186cd413424162d83a)
by buildbot@python.org July 26, 2024
by buildbot@python.org July 26, 2024
July 26, 2024
The Buildbot has detected a new failure on builder PPC64LE RHEL8 Refleaks 3.12 while building Python.
Full details are available at:
https://buildbot.python.org/#/builders/1158/builds/435
Buildbot URL: https://buildbot.python.org/
Worker for this Build: cstratak-RHEL8-ppc64le
Build Reason: <unknown>
Blamelist:
BUILD FAILED: failed test (failure)
Summary of the results of the build (if available):
===================================================
Captured traceback
==================
remote: Enumerating objects: 48, done.
remote: Counting objects: 2% (1/45)
remote: Counting objects: 4% (2/45)
remote: Counting objects: 6% (3/45)
remote: Counting objects: 8% (4/45)
remote: Counting objects: 11% (5/45)
remote: Counting objects: 13% (6/45)
remote: Counting objects: 15% (7/45)
remote: Counting objects: 17% (8/45)
remote: Counting objects: 20% (9/45)
remote: Counting objects: 22% (10/45)
remote: Counting objects: 24% (11/45)
remote: Counting objects: 26% (12/45)
remote: Counting objects: 28% (13/45)
remote: Counting objects: 31% (14/45)
remote: Counting objects: 33% (15/45)
remote: Counting objects: 35% (16/45)
remote: Counting objects: 37% (17/45)
remote: Counting objects: 40% (18/45)
remote: Counting objects: 42% (19/45)
remote: Counting objects: 44% (20/45)
remote: Counting objects: 46% (21/45)
remote: Counting objects: 48% (22/45)
remote: Counting objects: 51% (23/45)
remote: Counting objects: 53% (24/45)
remote: Counting objects: 55% (25/45)
remote: Counting objects: 57% (26/45)
remote: Counting objects: 60% (27/45)
remote: Counting objects: 62% (28/45)
remote: Counting objects: 64% (29/45)
remote: Counting objects: 66% (30/45)
remote: Counting objects: 68% (31/45)
remote: Counting objects: 71% (32/45)
remote: Counting objects: 73% (33/45)
remote: Counting objects: 75% (34/45)
remote: Counting objects: 77% (35/45)
remote: Counting objects: 80% (36/45)
remote: Counting objects: 82% (37/45)
remote: Counting objects: 84% (38/45)
remote: Counting objects: 86% (39/45)
remote: Counting objects: 88% (40/45)
remote: Counting objects: 91% (41/45)
remote: Counting objects: 93% (42/45)
remote: Counting objects: 95% (43/45)
remote: Counting objects: 97% (44/45)
remote: Counting objects: 100% (45/45)
remote: Counting objects: 100% (45/45), done.
remote: Compressing objects: 2% (1/35)
remote: Compressing objects: 5% (2/35)
remote: Compressing objects: 8% (3/35)
remote: Compressing objects: 11% (4/35)
remote: Compressing objects: 14% (5/35)
remote: Compressing objects: 17% (6/35)
remote: Compressing objects: 20% (7/35)
remote: Compressing objects: 22% (8/35)
remote: Compressing objects: 25% (9/35)
remote: Compressing objects: 28% (10/35)
remote: Compressing objects: 31% (11/35)
remote: Compressing objects: 34% (12/35)
remote: Compressing objects: 37% (13/35)
remote: Compressing objects: 40% (14/35)
remote: Compressing objects: 42% (15/35)
remote: Compressing objects: 45% (16/35)
remote: Compressing objects: 48% (17/35)
remote: Compressing objects: 51% (18/35)
remote: Compressing objects: 54% (19/35)
remote: Compressing objects: 57% (20/35)
remote: Compressing objects: 60% (21/35)
remote: Compressing objects: 62% (22/35)
remote: Compressing objects: 65% (23/35)
remote: Compressing objects: 68% (24/35)
remote: Compressing objects: 71% (25/35)
remote: Compressing objects: 74% (26/35)
remote: Compressing objects: 77% (27/35)
remote: Compressing objects: 80% (28/35)
remote: Compressing objects: 82% (29/35)
remote: Compressing objects: 85% (30/35)
remote: Compressing objects: 88% (31/35)
remote: Compressing objects: 91% (32/35)
remote: Compressing objects: 94% (33/35)
remote: Compressing objects: 97% (34/35)
remote: Compressing objects: 100% (35/35)
remote: Compressing objects: 100% (35/35), done.
remote: Total 48 (delta 15), reused 27 (delta 10), pack-reused 3
From https://github.com/python/cpython
* branch 3.12 -> FETCH_HEAD
Note: switching to 'FETCH_HEAD'.
You are in 'detached HEAD' state. You can look around, make experimental
changes and commit them, and you can discard any commits you make in this
state without impacting any branches by switching back to a branch.
If you want to create a new branch to retain commits you create, you may
do so (now or later) by using -c with the switch command. Example:
git switch -c <new-branch-name>
Or undo this operation with:
git switch -
Turn off this advice by setting config variable advice.detachedHead to false
HEAD is now at 0300e33b22 [3.12] gh-121913: Use str(exc) instead of exc.strerror in `asyncio.base_events` (GH-122269) (#122279)
Switched to and reset branch '3.12'
make: *** [Makefile:2021: buildbottest] Terminated
Test report
===========
Sincerely,
-The Buildbot
1
0
☠ Buildbot (Python): - failed test (failure) (5592399313c963c110280a7c98de974889e1d353)
by buildbot@python.org July 26, 2024
by buildbot@python.org July 26, 2024
July 26, 2024
The Buildbot has detected a new failure on builder PPC64LE RHEL8 Refleaks 3.x while building Python.
Full details are available at:
https://buildbot.python.org/#/builders/384/builds/1187
Buildbot URL: https://buildbot.python.org/
Worker for this Build: cstratak-RHEL8-ppc64le
Build Reason: <unknown>
Blamelist:
BUILD FAILED: failed test (failure)
Summary of the results of the build (if available):
===================================================
Captured traceback
==================
remote: Enumerating objects: 41, done.
remote: Counting objects: 2% (1/41)
remote: Counting objects: 4% (2/41)
remote: Counting objects: 7% (3/41)
remote: Counting objects: 9% (4/41)
remote: Counting objects: 12% (5/41)
remote: Counting objects: 14% (6/41)
remote: Counting objects: 17% (7/41)
remote: Counting objects: 19% (8/41)
remote: Counting objects: 21% (9/41)
remote: Counting objects: 24% (10/41)
remote: Counting objects: 26% (11/41)
remote: Counting objects: 29% (12/41)
remote: Counting objects: 31% (13/41)
remote: Counting objects: 34% (14/41)
remote: Counting objects: 36% (15/41)
remote: Counting objects: 39% (16/41)
remote: Counting objects: 41% (17/41)
remote: Counting objects: 43% (18/41)
remote: Counting objects: 46% (19/41)
remote: Counting objects: 48% (20/41)
remote: Counting objects: 51% (21/41)
remote: Counting objects: 53% (22/41)
remote: Counting objects: 56% (23/41)
remote: Counting objects: 58% (24/41)
remote: Counting objects: 60% (25/41)
remote: Counting objects: 63% (26/41)
remote: Counting objects: 65% (27/41)
remote: Counting objects: 68% (28/41)
remote: Counting objects: 70% (29/41)
remote: Counting objects: 73% (30/41)
remote: Counting objects: 75% (31/41)
remote: Counting objects: 78% (32/41)
remote: Counting objects: 80% (33/41)
remote: Counting objects: 82% (34/41)
remote: Counting objects: 85% (35/41)
remote: Counting objects: 87% (36/41)
remote: Counting objects: 90% (37/41)
remote: Counting objects: 92% (38/41)
remote: Counting objects: 95% (39/41)
remote: Counting objects: 97% (40/41)
remote: Counting objects: 100% (41/41)
remote: Counting objects: 100% (41/41), done.
remote: Compressing objects: 3% (1/28)
remote: Compressing objects: 7% (2/28)
remote: Compressing objects: 10% (3/28)
remote: Compressing objects: 14% (4/28)
remote: Compressing objects: 17% (5/28)
remote: Compressing objects: 21% (6/28)
remote: Compressing objects: 25% (7/28)
remote: Compressing objects: 28% (8/28)
remote: Compressing objects: 32% (9/28)
remote: Compressing objects: 35% (10/28)
remote: Compressing objects: 39% (11/28)
remote: Compressing objects: 42% (12/28)
remote: Compressing objects: 46% (13/28)
remote: Compressing objects: 50% (14/28)
remote: Compressing objects: 53% (15/28)
remote: Compressing objects: 57% (16/28)
remote: Compressing objects: 60% (17/28)
remote: Compressing objects: 64% (18/28)
remote: Compressing objects: 67% (19/28)
remote: Compressing objects: 71% (20/28)
remote: Compressing objects: 75% (21/28)
remote: Compressing objects: 78% (22/28)
remote: Compressing objects: 82% (23/28)
remote: Compressing objects: 85% (24/28)
remote: Compressing objects: 89% (25/28)
remote: Compressing objects: 92% (26/28)
remote: Compressing objects: 96% (27/28)
remote: Compressing objects: 100% (28/28)
remote: Compressing objects: 100% (28/28), done.
remote: Total 41 (delta 15), reused 22 (delta 13), pack-reused 0
From https://github.com/python/cpython
* branch main -> FETCH_HEAD
Note: switching to 'FETCH_HEAD'.
You are in 'detached HEAD' state. You can look around, make experimental
changes and commit them, and you can discard any commits you make in this
state without impacting any branches by switching back to a branch.
If you want to create a new branch to retain commits you create, you may
do so (now or later) by using -c with the switch command. Example:
git switch -c <new-branch-name>
Or undo this operation with:
git switch -
Turn off this advice by setting config variable advice.detachedHead to false
HEAD is now at 5592399313 gh-122208: Don't delivery PyDict_EVENT_ADDED until it can't fail (#122207)
Switched to and reset branch 'main'
configure: WARNING: no system libmpdecimal found; falling back to bundled libmpdecimal (deprecated and scheduled for removal in Python 3.15)
make: *** [Makefile:2267: buildbottest] Terminated
Test report
===========
Sincerely,
-The Buildbot
1
0
☠ Buildbot (Python): python/cpython - failed test (failure) (main)
by buildbot@python.org July 25, 2024
by buildbot@python.org July 25, 2024
July 25, 2024
The Buildbot has detected a new failure on builder iOS ARM64 Simulator 3.x while building python/cpython.
Full details are available at:
https://buildbot.python.org/#/builders/1380/builds/922
Buildbot URL: https://buildbot.python.org/
Worker for this Build: rkm-arm64-ios-simulator
Build Reason: <unknown>
Blamelist: Marc Mueller <30130371+cdce8p(a)users.noreply.github.com>
BUILD FAILED: failed test (failure)
Summary of the results of the build (if available):
===================================================
==
Captured traceback
==================
Traceback (most recent call last):
File "/Users/buildbot/Library/Developer/XCTestDevices/F05B2E02-3C3F-4FF7-A55F-11613958B0BB/data/Containers/Bundle/Application/99A3AB7F-A1D2-4792-B4C8-CC021997CCB1/iOSTestbed.app/python/lib/python3.14/test/test_socketserver.py", line 228, in test_ThreadingUnixDatagramServer
self.run_server(socketserver.ThreadingUnixDatagramServer,
~~~~~~~~~~~~~~~^^^^^^^^^^^^^^^^^^^^^^^^^^^^^^^^^^^^^^^^^^
socketserver.DatagramRequestHandler,
^^^^^^^^^^^^^^^^^^^^^^^^^^^^^^^^^^^^
self.dgram_examine)
^^^^^^^^^^^^^^^^^^^
File "/Users/buildbot/Library/Developer/XCTestDevices/F05B2E02-3C3F-4FF7-A55F-11613958B0BB/data/Containers/Bundle/Application/99A3AB7F-A1D2-4792-B4C8-CC021997CCB1/iOSTestbed.app/python/lib/python3.14/test/support/threading_helper.py", line 66, in decorator
return func(*args)
File "/Users/buildbot/Library/Developer/XCTestDevices/F05B2E02-3C3F-4FF7-A55F-11613958B0BB/data/Containers/Bundle/Application/99A3AB7F-A1D2-4792-B4C8-CC021997CCB1/iOSTestbed.app/python/lib/python3.14/test/test_socketserver.py", line 133, in run_server
testfunc(svrcls.address_family, addr)
~~~~~~~~^^^^^^^^^^^^^^^^^^^^^^^^^^^^^
File "/Users/buildbot/Library/Developer/XCTestDevices/F05B2E02-3C3F-4FF7-A55F-11613958B0BB/data/Containers/Bundle/Application/99A3AB7F-A1D2-4792-B4C8-CC021997CCB1/iOSTestbed.app/python/lib/python3.14/test/test_socketserver.py", line 160, in dgram_examine
buf = data = receive(s, 100)
~~~~~~~^^^^^^^^
File "/Users/buildbot/Library/Developer/XCTestDevices/F05B2E02-3C3F-4FF7-A55F-11613958B0BB/data/Containers/Bundle/Application/99A3AB7F-A1D2-4792-B4C8-CC021997CCB1/iOSTestbed.app/python/lib/python3.14/test/test_socketserver.py", line 43, in receive
raise RuntimeError("timed out on %r" % (sock,))
RuntimeError: timed out on <socket.socket fd=24, family=1, type=2, proto=0, laddr=./test_python_gi6ji1ee.sock>
Traceback (most recent call last):
File "/Users/buildbot/Library/Developer/XCTestDevices/F05B2E02-3C3F-4FF7-A55F-11613958B0BB/data/Containers/Bundle/Application/99A3AB7F-A1D2-4792-B4C8-CC021997CCB1/iOSTestbed.app/python/lib/python3.14/threading.py", line 1039, in _bootstrap_inner
self.run()
~~~~~~~~^^
File "/Users/buildbot/Library/Developer/XCTestDevices/F05B2E02-3C3F-4FF7-A55F-11613958B0BB/data/Containers/Bundle/Application/99A3AB7F-A1D2-4792-B4C8-CC021997CCB1/iOSTestbed.app/python/lib/python3.14/threading.py", line 990, in run
self._target(*self._args, **self._kwargs)
~~~~~~~~~~~~^^^^^^^^^^^^^^^^^^^^^^^^^^^^^
File "/Users/buildbot/Library/Developer/XCTestDevices/F05B2E02-3C3F-4FF7-A55F-11613958B0BB/data/Containers/Bundle/Application/99A3AB7F-A1D2-4792-B4C8-CC021997CCB1/iOSTestbed.app/python/lib/python3.14/socketserver.py", line 694, in process_request_thread
self.handle_error(request, client_address)
~~~~~~~~~~~~~~~~~^^^^^^^^^^^^^^^^^^^^^^^^^
File "/Users/buildbot/Library/Developer/XCTestDevices/F05B2E02-3C3F-4FF7-A55F-11613958B0BB/data/Containers/Bundle/Application/99A3AB7F-A1D2-4792-B4C8-CC021997CCB1/iOSTestbed.app/python/lib/python3.14/socketserver.py", line 692, in process_request_thread
self.finish_request(request, client_address)
~~~~~~~~~~~~~~~~~~~^^^^^^^^^^^^^^^^^^^^^^^^^
File "/Users/buildbot/Library/Developer/XCTestDevices/F05B2E02-3C3F-4FF7-A55F-11613958B0BB/data/Containers/Bundle/Application/99A3AB7F-A1D2-4792-B4C8-CC021997CCB1/iOSTestbed.app/python/lib/python3.14/socketserver.py", line 362, in finish_request
self.RequestHandlerClass(request, client_address, self)
~~~~~~~~~~~~~~~~~~~~~~~~^^^^^^^^^^^^^^^^^^^^^^^^^^^^^^^
File "/Users/buildbot/Library/Developer/XCTestDevices/F05B2E02-3C3F-4FF7-A55F-11613958B0BB/data/Containers/Bundle/Application/99A3AB7F-A1D2-4792-B4C8-CC021997CCB1/iOSTestbed.app/python/lib/python3.14/socketserver.py", line 763, in __init__
self.finish()
~~~~~~~~~~~^^
File "/Users/buildbot/Library/Developer/XCTestDevices/F05B2E02-3C3F-4FF7-A55F-11613958B0BB/data/Containers/Bundle/Application/99A3AB7F-A1D2-4792-B4C8-CC021997CCB1/iOSTestbed.app/python/lib/python3.14/socketserver.py", line 858, in finish
self.socket.sendto(self.wfile.getvalue(), self.client_address)
~~~~~~~~~~~~~~~~~~^^^^^^^^^^^^^^^^^^^^^^^^^^^^^^^^^^^^^^^^^^^^
ConnectionResetError: [Errno 54] Connection reset by peer
Warning -- threading_cleanup() failed to clean up threads in 1.0 seconds
Warning -- before: thread count=0, dangling=1
Warning -- after: thread count=1, dangling=3
Warning -- Dangling thread: <Thread(<class 'socketserver.ThreadingUnixDatagramServer'> serving, started daemon 6115389440)>
Warning -- Dangling thread: <Thread(Thread-2873 (process_request_thread), stopped 6132215808)>
Warning -- Dangling thread: <_MainThread(MainThread, started 4372660800)>
ERROR
Test report
===========
Failed tests:
- test_socketserver
Failed subtests:
- test_ThreadingUnixDatagramServer - test.test_socketserver.SocketServerTest.test_ThreadingUnixDatagramServer
Sincerely,
-The Buildbot
1
0
☠ Buildbot (Python): - failed test (failure) (d86ab5dde286642a378fcc32c243bc3b4bed750d)
by buildbot@python.org July 25, 2024
by buildbot@python.org July 25, 2024
July 25, 2024
The Buildbot has detected a new failure on builder AMD64 RHEL7 Refleaks 3.10 while building Python.
Full details are available at:
https://buildbot.python.org/#/builders/693/builds/1186
Buildbot URL: https://buildbot.python.org/
Worker for this Build: cstratak-RHEL7-x86_64
Build Reason: <unknown>
Blamelist:
BUILD FAILED: failed test (failure)
Summary of the results of the build (if available):
===================================================
== Tests result: ENV CHANGED ==
410 tests OK.
10 slowest tests:
- test_signal: 31 min 43 sec
- test_asyncio: 31 min 25 sec
- test_pydoc: 30 min 18 sec
- test_concurrent_futures: 14 min 37 sec
- test_multiprocessing_spawn: 11 min 23 sec
- test_multiprocessing_forkserver: 8 min 13 sec
- test_multiprocessing_fork: 6 min 55 sec
- test_lib2to3: 5 min 3 sec
- test_gdb: 4 min 43 sec
- test_peg_generator: 4 min 11 sec
1 test altered the execution environment:
test_threading
14 tests skipped:
test_devpoll test_ioctl test_kqueue test_msilib test_smtpnet
test_ssl test_startfile test_tix test_tk test_ttk_guionly
test_winconsoleio test_winreg test_winsound test_zipfile64
Total duration: 39 min 39 sec
Captured traceback
==================
Traceback (most recent call last):
File "/home/buildbot/buildarea/3.10.cstratak-RHEL7-x86_64.refleak/build/Lib/multiprocessing/resource_tracker.py", line 209, in main
cache[rtype].remove(name)
KeyError: '/psm_1d54bbc7'
.Traceback (most recent call last):
File "/home/buildbot/buildarea/3.10.cstratak-RHEL7-x86_64.refleak/build/Lib/multiprocessing/resource_tracker.py", line 209, in main
cache[rtype].remove(name)
KeyError: '/psm_27492799'
.Traceback (most recent call last):
File "/home/buildbot/buildarea/3.10.cstratak-RHEL7-x86_64.refleak/build/Lib/multiprocessing/resource_tracker.py", line 209, in main
cache[rtype].remove(name)
KeyError: '/psm_29072482'
.Traceback (most recent call last):
File "/home/buildbot/buildarea/3.10.cstratak-RHEL7-x86_64.refleak/build/Lib/multiprocessing/resource_tracker.py", line 209, in main
cache[rtype].remove(name)
KeyError: '/psm_318f9b77'
.Traceback (most recent call last):
File "/home/buildbot/buildarea/3.10.cstratak-RHEL7-x86_64.refleak/build/Lib/multiprocessing/resource_tracker.py", line 209, in main
cache[rtype].remove(name)
KeyError: '/psm_a35f1181'
.Traceback (most recent call last):
File "/home/buildbot/buildarea/3.10.cstratak-RHEL7-x86_64.refleak/build/Lib/multiprocessing/resource_tracker.py", line 209, in main
cache[rtype].remove(name)
KeyError: '/psm_bd100735'
.
Traceback (most recent call last):
File "/home/buildbot/buildarea/3.10.cstratak-RHEL7-x86_64.refleak/build/Lib/multiprocessing/resource_tracker.py", line 209, in main
cache[rtype].remove(name)
KeyError: '/psm_81763eed'
.Traceback (most recent call last):
File "/home/buildbot/buildarea/3.10.cstratak-RHEL7-x86_64.refleak/build/Lib/multiprocessing/resource_tracker.py", line 209, in main
cache[rtype].remove(name)
KeyError: '/psm_90514253'
.Traceback (most recent call last):
File "/home/buildbot/buildarea/3.10.cstratak-RHEL7-x86_64.refleak/build/Lib/multiprocessing/resource_tracker.py", line 209, in main
cache[rtype].remove(name)
KeyError: '/psm_752463d9'
.Traceback (most recent call last):
File "/home/buildbot/buildarea/3.10.cstratak-RHEL7-x86_64.refleak/build/Lib/multiprocessing/resource_tracker.py", line 209, in main
cache[rtype].remove(name)
KeyError: '/psm_1b102b4b'
.Traceback (most recent call last):
File "/home/buildbot/buildarea/3.10.cstratak-RHEL7-x86_64.refleak/build/Lib/multiprocessing/resource_tracker.py", line 209, in main
cache[rtype].remove(name)
KeyError: '/psm_4408c1f5'
.Traceback (most recent call last):
File "/home/buildbot/buildarea/3.10.cstratak-RHEL7-x86_64.refleak/build/Lib/multiprocessing/resource_tracker.py", line 209, in main
cache[rtype].remove(name)
KeyError: '/psm_84baccf1'
.
Traceback (most recent call last):
File "/home/buildbot/buildarea/3.10.cstratak-RHEL7-x86_64.refleak/build/Lib/multiprocessing/resource_tracker.py", line 209, in main
cache[rtype].remove(name)
KeyError: '/psm_660c5a67'
.Traceback (most recent call last):
File "/home/buildbot/buildarea/3.10.cstratak-RHEL7-x86_64.refleak/build/Lib/multiprocessing/resource_tracker.py", line 209, in main
cache[rtype].remove(name)
KeyError: '/psm_a3e29031'
.Traceback (most recent call last):
File "/home/buildbot/buildarea/3.10.cstratak-RHEL7-x86_64.refleak/build/Lib/multiprocessing/resource_tracker.py", line 209, in main
cache[rtype].remove(name)
KeyError: '/psm_7adbdf44'
.Traceback (most recent call last):
File "/home/buildbot/buildarea/3.10.cstratak-RHEL7-x86_64.refleak/build/Lib/multiprocessing/resource_tracker.py", line 209, in main
cache[rtype].remove(name)
KeyError: '/psm_5dafa102'
.Traceback (most recent call last):
File "/home/buildbot/buildarea/3.10.cstratak-RHEL7-x86_64.refleak/build/Lib/multiprocessing/resource_tracker.py", line 209, in main
cache[rtype].remove(name)
KeyError: '/psm_3cd590ad'
.Traceback (most recent call last):
File "/home/buildbot/buildarea/3.10.cstratak-RHEL7-x86_64.refleak/build/Lib/multiprocessing/resource_tracker.py", line 209, in main
cache[rtype].remove(name)
KeyError: '/psm_db067523'
.
Traceback (most recent call last):
File "/home/buildbot/buildarea/3.10.cstratak-RHEL7-x86_64.refleak/build/Lib/multiprocessing/util.py", line 300, in _run_finalizers
finalizer()
File "/home/buildbot/buildarea/3.10.cstratak-RHEL7-x86_64.refleak/build/Lib/multiprocessing/util.py", line 224, in __call__
res = self._callback(*self._args, **self._kwargs)
File "/home/buildbot/buildarea/3.10.cstratak-RHEL7-x86_64.refleak/build/Lib/multiprocessing/synchronize.py", line 87, in _cleanup
sem_unlink(name)
FileNotFoundError: [Errno 2] No such file or directory
Traceback (most recent call last):
File "/home/buildbot/buildarea/3.10.cstratak-RHEL7-x86_64.refleak/build/Lib/multiprocessing/util.py", line 300, in _run_finalizers
finalizer()
File "/home/buildbot/buildarea/3.10.cstratak-RHEL7-x86_64.refleak/build/Lib/multiprocessing/util.py", line 224, in __call__
res = self._callback(*self._args, **self._kwargs)
File "/home/buildbot/buildarea/3.10.cstratak-RHEL7-x86_64.refleak/build/Lib/multiprocessing/synchronize.py", line 87, in _cleanup
sem_unlink(name)
FileNotFoundError: [Errno 2] No such file or directory
Traceback (most recent call last):
File "/home/buildbot/buildarea/3.10.cstratak-RHEL7-x86_64.refleak/build/Lib/multiprocessing/util.py", line 300, in _run_finalizers
finalizer()
File "/home/buildbot/buildarea/3.10.cstratak-RHEL7-x86_64.refleak/build/Lib/multiprocessing/util.py", line 224, in __call__
res = self._callback(*self._args, **self._kwargs)
File "/home/buildbot/buildarea/3.10.cstratak-RHEL7-x86_64.refleak/build/Lib/multiprocessing/synchronize.py", line 87, in _cleanup
sem_unlink(name)
FileNotFoundError: [Errno 2] No such file or directory
Traceback (most recent call last):
File "/home/buildbot/buildarea/3.10.cstratak-RHEL7-x86_64.refleak/build/Lib/multiprocessing/util.py", line 300, in _run_finalizers
finalizer()
File "/home/buildbot/buildarea/3.10.cstratak-RHEL7-x86_64.refleak/build/Lib/multiprocessing/util.py", line 224, in __call__
res = self._callback(*self._args, **self._kwargs)
File "/home/buildbot/buildarea/3.10.cstratak-RHEL7-x86_64.refleak/build/Lib/multiprocessing/synchronize.py", line 87, in _cleanup
sem_unlink(name)
FileNotFoundError: [Errno 2] No such file or directory
Traceback (most recent call last):
File "/home/buildbot/buildarea/3.10.cstratak-RHEL7-x86_64.refleak/build/Lib/multiprocessing/util.py", line 300, in _run_finalizers
finalizer()
File "/home/buildbot/buildarea/3.10.cstratak-RHEL7-x86_64.refleak/build/Lib/multiprocessing/util.py", line 224, in __call__
res = self._callback(*self._args, **self._kwargs)
File "/home/buildbot/buildarea/3.10.cstratak-RHEL7-x86_64.refleak/build/Lib/multiprocessing/synchronize.py", line 87, in _cleanup
sem_unlink(name)
FileNotFoundError: [Errno 2] No such file or directory
Traceback (most recent call last):
File "/home/buildbot/buildarea/3.10.cstratak-RHEL7-x86_64.refleak/build/Lib/multiprocessing/util.py", line 300, in _run_finalizers
finalizer()
File "/home/buildbot/buildarea/3.10.cstratak-RHEL7-x86_64.refleak/build/Lib/multiprocessing/util.py", line 224, in __call__
res = self._callback(*self._args, **self._kwargs)
File "/home/buildbot/buildarea/3.10.cstratak-RHEL7-x86_64.refleak/build/Lib/multiprocessing/synchronize.py", line 87, in _cleanup
sem_unlink(name)
FileNotFoundError: [Errno 2] No such file or directory
./home/buildbot/buildarea/3.10.cstratak-RHEL7-x86_64.refleak/build/Lib/multiprocessing/resource_tracker.py:224: UserWarning: resource_tracker: There appear to be 6 leaked semaphore objects to clean up at shutdown
warnings.warn('resource_tracker: There appear to be %d '
Traceback (most recent call last):
File "/home/buildbot/buildarea/3.10.cstratak-RHEL7-x86_64.refleak/build/Lib/multiprocessing/util.py", line 300, in _run_finalizers
finalizer()
File "/home/buildbot/buildarea/3.10.cstratak-RHEL7-x86_64.refleak/build/Lib/multiprocessing/util.py", line 224, in __call__
res = self._callback(*self._args, **self._kwargs)
File "/home/buildbot/buildarea/3.10.cstratak-RHEL7-x86_64.refleak/build/Lib/multiprocessing/synchronize.py", line 87, in _cleanup
sem_unlink(name)
FileNotFoundError: [Errno 2] No such file or directory
Traceback (most recent call last):
File "/home/buildbot/buildarea/3.10.cstratak-RHEL7-x86_64.refleak/build/Lib/multiprocessing/util.py", line 300, in _run_finalizers
finalizer()
File "/home/buildbot/buildarea/3.10.cstratak-RHEL7-x86_64.refleak/build/Lib/multiprocessing/util.py", line 224, in __call__
res = self._callback(*self._args, **self._kwargs)
File "/home/buildbot/buildarea/3.10.cstratak-RHEL7-x86_64.refleak/build/Lib/multiprocessing/synchronize.py", line 87, in _cleanup
sem_unlink(name)
FileNotFoundError: [Errno 2] No such file or directory
Traceback (most recent call last):
File "/home/buildbot/buildarea/3.10.cstratak-RHEL7-x86_64.refleak/build/Lib/multiprocessing/util.py", line 300, in _run_finalizers
finalizer()
File "/home/buildbot/buildarea/3.10.cstratak-RHEL7-x86_64.refleak/build/Lib/multiprocessing/util.py", line 224, in __call__
res = self._callback(*self._args, **self._kwargs)
File "/home/buildbot/buildarea/3.10.cstratak-RHEL7-x86_64.refleak/build/Lib/multiprocessing/synchronize.py", line 87, in _cleanup
sem_unlink(name)
FileNotFoundError: [Errno 2] No such file or directory
Traceback (most recent call last):
File "/home/buildbot/buildarea/3.10.cstratak-RHEL7-x86_64.refleak/build/Lib/multiprocessing/util.py", line 300, in _run_finalizers
finalizer()
File "/home/buildbot/buildarea/3.10.cstratak-RHEL7-x86_64.refleak/build/Lib/multiprocessing/util.py", line 224, in __call__
res = self._callback(*self._args, **self._kwargs)
File "/home/buildbot/buildarea/3.10.cstratak-RHEL7-x86_64.refleak/build/Lib/multiprocessing/synchronize.py", line 87, in _cleanup
sem_unlink(name)
FileNotFoundError: [Errno 2] No such file or directory
Traceback (most recent call last):
File "/home/buildbot/buildarea/3.10.cstratak-RHEL7-x86_64.refleak/build/Lib/multiprocessing/util.py", line 300, in _run_finalizers
finalizer()
File "/home/buildbot/buildarea/3.10.cstratak-RHEL7-x86_64.refleak/build/Lib/multiprocessing/util.py", line 224, in __call__
res = self._callback(*self._args, **self._kwargs)
File "/home/buildbot/buildarea/3.10.cstratak-RHEL7-x86_64.refleak/build/Lib/multiprocessing/synchronize.py", line 87, in _cleanup
sem_unlink(name)
FileNotFoundError: [Errno 2] No such file or directory
Traceback (most recent call last):
File "/home/buildbot/buildarea/3.10.cstratak-RHEL7-x86_64.refleak/build/Lib/multiprocessing/util.py", line 300, in _run_finalizers
finalizer()
File "/home/buildbot/buildarea/3.10.cstratak-RHEL7-x86_64.refleak/build/Lib/multiprocessing/util.py", line 224, in __call__
res = self._callback(*self._args, **self._kwargs)
File "/home/buildbot/buildarea/3.10.cstratak-RHEL7-x86_64.refleak/build/Lib/multiprocessing/synchronize.py", line 87, in _cleanup
sem_unlink(name)
FileNotFoundError: [Errno 2] No such file or directory
./home/buildbot/buildarea/3.10.cstratak-RHEL7-x86_64.refleak/build/Lib/multiprocessing/resource_tracker.py:224: UserWarning: resource_tracker: There appear to be 6 leaked semaphore objects to clean up at shutdown
warnings.warn('resource_tracker: There appear to be %d '
Traceback (most recent call last):
File "/home/buildbot/buildarea/3.10.cstratak-RHEL7-x86_64.refleak/build/Lib/multiprocessing/util.py", line 300, in _run_finalizers
finalizer()
File "/home/buildbot/buildarea/3.10.cstratak-RHEL7-x86_64.refleak/build/Lib/multiprocessing/util.py", line 224, in __call__
res = self._callback(*self._args, **self._kwargs)
File "/home/buildbot/buildarea/3.10.cstratak-RHEL7-x86_64.refleak/build/Lib/multiprocessing/synchronize.py", line 87, in _cleanup
sem_unlink(name)
FileNotFoundError: [Errno 2] No such file or directory
Traceback (most recent call last):
File "/home/buildbot/buildarea/3.10.cstratak-RHEL7-x86_64.refleak/build/Lib/multiprocessing/util.py", line 300, in _run_finalizers
finalizer()
File "/home/buildbot/buildarea/3.10.cstratak-RHEL7-x86_64.refleak/build/Lib/multiprocessing/util.py", line 224, in __call__
res = self._callback(*self._args, **self._kwargs)
File "/home/buildbot/buildarea/3.10.cstratak-RHEL7-x86_64.refleak/build/Lib/multiprocessing/synchronize.py", line 87, in _cleanup
sem_unlink(name)
FileNotFoundError: [Errno 2] No such file or directory
Traceback (most recent call last):
File "/home/buildbot/buildarea/3.10.cstratak-RHEL7-x86_64.refleak/build/Lib/multiprocessing/util.py", line 300, in _run_finalizers
finalizer()
File "/home/buildbot/buildarea/3.10.cstratak-RHEL7-x86_64.refleak/build/Lib/multiprocessing/util.py", line 224, in __call__
res = self._callback(*self._args, **self._kwargs)
File "/home/buildbot/buildarea/3.10.cstratak-RHEL7-x86_64.refleak/build/Lib/multiprocessing/synchronize.py", line 87, in _cleanup
sem_unlink(name)
FileNotFoundError: [Errno 2] No such file or directory
Traceback (most recent call last):
File "/home/buildbot/buildarea/3.10.cstratak-RHEL7-x86_64.refleak/build/Lib/multiprocessing/util.py", line 300, in _run_finalizers
finalizer()
File "/home/buildbot/buildarea/3.10.cstratak-RHEL7-x86_64.refleak/build/Lib/multiprocessing/util.py", line 224, in __call__
res = self._callback(*self._args, **self._kwargs)
File "/home/buildbot/buildarea/3.10.cstratak-RHEL7-x86_64.refleak/build/Lib/multiprocessing/synchronize.py", line 87, in _cleanup
sem_unlink(name)
FileNotFoundError: [Errno 2] No such file or directory
Traceback (most recent call last):
File "/home/buildbot/buildarea/3.10.cstratak-RHEL7-x86_64.refleak/build/Lib/multiprocessing/util.py", line 300, in _run_finalizers
finalizer()
File "/home/buildbot/buildarea/3.10.cstratak-RHEL7-x86_64.refleak/build/Lib/multiprocessing/util.py", line 224, in __call__
res = self._callback(*self._args, **self._kwargs)
File "/home/buildbot/buildarea/3.10.cstratak-RHEL7-x86_64.refleak/build/Lib/multiprocessing/synchronize.py", line 87, in _cleanup
sem_unlink(name)
FileNotFoundError: [Errno 2] No such file or directory
Traceback (most recent call last):
File "/home/buildbot/buildarea/3.10.cstratak-RHEL7-x86_64.refleak/build/Lib/multiprocessing/util.py", line 300, in _run_finalizers
finalizer()
File "/home/buildbot/buildarea/3.10.cstratak-RHEL7-x86_64.refleak/build/Lib/multiprocessing/util.py", line 224, in __call__
res = self._callback(*self._args, **self._kwargs)
File "/home/buildbot/buildarea/3.10.cstratak-RHEL7-x86_64.refleak/build/Lib/multiprocessing/synchronize.py", line 87, in _cleanup
sem_unlink(name)
FileNotFoundError: [Errno 2] No such file or directory
./home/buildbot/buildarea/3.10.cstratak-RHEL7-x86_64.refleak/build/Lib/multiprocessing/resource_tracker.py:224: UserWarning: resource_tracker: There appear to be 6 leaked semaphore objects to clean up at shutdown
warnings.warn('resource_tracker: There appear to be %d '
Traceback (most recent call last):
File "/home/buildbot/buildarea/3.10.cstratak-RHEL7-x86_64.refleak/build/Lib/multiprocessing/util.py", line 300, in _run_finalizers
finalizer()
File "/home/buildbot/buildarea/3.10.cstratak-RHEL7-x86_64.refleak/build/Lib/multiprocessing/util.py", line 224, in __call__
res = self._callback(*self._args, **self._kwargs)
File "/home/buildbot/buildarea/3.10.cstratak-RHEL7-x86_64.refleak/build/Lib/multiprocessing/synchronize.py", line 87, in _cleanup
sem_unlink(name)
FileNotFoundError: [Errno 2] No such file or directory
Traceback (most recent call last):
File "/home/buildbot/buildarea/3.10.cstratak-RHEL7-x86_64.refleak/build/Lib/multiprocessing/util.py", line 300, in _run_finalizers
finalizer()
File "/home/buildbot/buildarea/3.10.cstratak-RHEL7-x86_64.refleak/build/Lib/multiprocessing/util.py", line 224, in __call__
res = self._callback(*self._args, **self._kwargs)
File "/home/buildbot/buildarea/3.10.cstratak-RHEL7-x86_64.refleak/build/Lib/multiprocessing/synchronize.py", line 87, in _cleanup
sem_unlink(name)
FileNotFoundError: [Errno 2] No such file or directory
Traceback (most recent call last):
File "/home/buildbot/buildarea/3.10.cstratak-RHEL7-x86_64.refleak/build/Lib/multiprocessing/util.py", line 300, in _run_finalizers
finalizer()
File "/home/buildbot/buildarea/3.10.cstratak-RHEL7-x86_64.refleak/build/Lib/multiprocessing/util.py", line 224, in __call__
res = self._callback(*self._args, **self._kwargs)
File "/home/buildbot/buildarea/3.10.cstratak-RHEL7-x86_64.refleak/build/Lib/multiprocessing/synchronize.py", line 87, in _cleanup
sem_unlink(name)
FileNotFoundError: [Errno 2] No such file or directory
Traceback (most recent call last):
File "/home/buildbot/buildarea/3.10.cstratak-RHEL7-x86_64.refleak/build/Lib/multiprocessing/util.py", line 300, in _run_finalizers
finalizer()
File "/home/buildbot/buildarea/3.10.cstratak-RHEL7-x86_64.refleak/build/Lib/multiprocessing/util.py", line 224, in __call__
res = self._callback(*self._args, **self._kwargs)
File "/home/buildbot/buildarea/3.10.cstratak-RHEL7-x86_64.refleak/build/Lib/multiprocessing/synchronize.py", line 87, in _cleanup
sem_unlink(name)
FileNotFoundError: [Errno 2] No such file or directory
Traceback (most recent call last):
File "/home/buildbot/buildarea/3.10.cstratak-RHEL7-x86_64.refleak/build/Lib/multiprocessing/util.py", line 300, in _run_finalizers
finalizer()
File "/home/buildbot/buildarea/3.10.cstratak-RHEL7-x86_64.refleak/build/Lib/multiprocessing/util.py", line 224, in __call__
res = self._callback(*self._args, **self._kwargs)
File "/home/buildbot/buildarea/3.10.cstratak-RHEL7-x86_64.refleak/build/Lib/multiprocessing/synchronize.py", line 87, in _cleanup
sem_unlink(name)
FileNotFoundError: [Errno 2] No such file or directory
Traceback (most recent call last):
File "/home/buildbot/buildarea/3.10.cstratak-RHEL7-x86_64.refleak/build/Lib/multiprocessing/util.py", line 300, in _run_finalizers
finalizer()
File "/home/buildbot/buildarea/3.10.cstratak-RHEL7-x86_64.refleak/build/Lib/multiprocessing/util.py", line 224, in __call__
res = self._callback(*self._args, **self._kwargs)
File "/home/buildbot/buildarea/3.10.cstratak-RHEL7-x86_64.refleak/build/Lib/multiprocessing/synchronize.py", line 87, in _cleanup
sem_unlink(name)
FileNotFoundError: [Errno 2] No such file or directory
./home/buildbot/buildarea/3.10.cstratak-RHEL7-x86_64.refleak/build/Lib/multiprocessing/resource_tracker.py:224: UserWarning: resource_tracker: There appear to be 6 leaked semaphore objects to clean up at shutdown
warnings.warn('resource_tracker: There appear to be %d '
Traceback (most recent call last):
File "/home/buildbot/buildarea/3.10.cstratak-RHEL7-x86_64.refleak/build/Lib/multiprocessing/util.py", line 300, in _run_finalizers
finalizer()
File "/home/buildbot/buildarea/3.10.cstratak-RHEL7-x86_64.refleak/build/Lib/multiprocessing/util.py", line 224, in __call__
res = self._callback(*self._args, **self._kwargs)
File "/home/buildbot/buildarea/3.10.cstratak-RHEL7-x86_64.refleak/build/Lib/multiprocessing/synchronize.py", line 87, in _cleanup
sem_unlink(name)
FileNotFoundError: [Errno 2] No such file or directory
Traceback (most recent call last):
File "/home/buildbot/buildarea/3.10.cstratak-RHEL7-x86_64.refleak/build/Lib/multiprocessing/util.py", line 300, in _run_finalizers
finalizer()
File "/home/buildbot/buildarea/3.10.cstratak-RHEL7-x86_64.refleak/build/Lib/multiprocessing/util.py", line 224, in __call__
res = self._callback(*self._args, **self._kwargs)
File "/home/buildbot/buildarea/3.10.cstratak-RHEL7-x86_64.refleak/build/Lib/multiprocessing/synchronize.py", line 87, in _cleanup
sem_unlink(name)
FileNotFoundError: [Errno 2] No such file or directory
Traceback (most recent call last):
File "/home/buildbot/buildarea/3.10.cstratak-RHEL7-x86_64.refleak/build/Lib/multiprocessing/util.py", line 300, in _run_finalizers
finalizer()
File "/home/buildbot/buildarea/3.10.cstratak-RHEL7-x86_64.refleak/build/Lib/multiprocessing/util.py", line 224, in __call__
res = self._callback(*self._args, **self._kwargs)
File "/home/buildbot/buildarea/3.10.cstratak-RHEL7-x86_64.refleak/build/Lib/multiprocessing/synchronize.py", line 87, in _cleanup
sem_unlink(name)
FileNotFoundError: [Errno 2] No such file or directory
Traceback (most recent call last):
File "/home/buildbot/buildarea/3.10.cstratak-RHEL7-x86_64.refleak/build/Lib/multiprocessing/util.py", line 300, in _run_finalizers
finalizer()
File "/home/buildbot/buildarea/3.10.cstratak-RHEL7-x86_64.refleak/build/Lib/multiprocessing/util.py", line 224, in __call__
res = self._callback(*self._args, **self._kwargs)
File "/home/buildbot/buildarea/3.10.cstratak-RHEL7-x86_64.refleak/build/Lib/multiprocessing/synchronize.py", line 87, in _cleanup
sem_unlink(name)
FileNotFoundError: [Errno 2] No such file or directory
Traceback (most recent call last):
File "/home/buildbot/buildarea/3.10.cstratak-RHEL7-x86_64.refleak/build/Lib/multiprocessing/util.py", line 300, in _run_finalizers
finalizer()
File "/home/buildbot/buildarea/3.10.cstratak-RHEL7-x86_64.refleak/build/Lib/multiprocessing/util.py", line 224, in __call__
res = self._callback(*self._args, **self._kwargs)
File "/home/buildbot/buildarea/3.10.cstratak-RHEL7-x86_64.refleak/build/Lib/multiprocessing/synchronize.py", line 87, in _cleanup
sem_unlink(name)
FileNotFoundError: [Errno 2] No such file or directory
Traceback (most recent call last):
File "/home/buildbot/buildarea/3.10.cstratak-RHEL7-x86_64.refleak/build/Lib/multiprocessing/util.py", line 300, in _run_finalizers
finalizer()
File "/home/buildbot/buildarea/3.10.cstratak-RHEL7-x86_64.refleak/build/Lib/multiprocessing/util.py", line 224, in __call__
res = self._callback(*self._args, **self._kwargs)
File "/home/buildbot/buildarea/3.10.cstratak-RHEL7-x86_64.refleak/build/Lib/multiprocessing/synchronize.py", line 87, in _cleanup
sem_unlink(name)
FileNotFoundError: [Errno 2] No such file or directory
./home/buildbot/buildarea/3.10.cstratak-RHEL7-x86_64.refleak/build/Lib/multiprocessing/resource_tracker.py:224: UserWarning: resource_tracker: There appear to be 6 leaked semaphore objects to clean up at shutdown
warnings.warn('resource_tracker: There appear to be %d '
Traceback (most recent call last):
File "/home/buildbot/buildarea/3.10.cstratak-RHEL7-x86_64.refleak/build/Lib/multiprocessing/util.py", line 300, in _run_finalizers
finalizer()
File "/home/buildbot/buildarea/3.10.cstratak-RHEL7-x86_64.refleak/build/Lib/multiprocessing/util.py", line 224, in __call__
res = self._callback(*self._args, **self._kwargs)
File "/home/buildbot/buildarea/3.10.cstratak-RHEL7-x86_64.refleak/build/Lib/multiprocessing/synchronize.py", line 87, in _cleanup
sem_unlink(name)
FileNotFoundError: [Errno 2] No such file or directory
Traceback (most recent call last):
File "/home/buildbot/buildarea/3.10.cstratak-RHEL7-x86_64.refleak/build/Lib/multiprocessing/util.py", line 300, in _run_finalizers
finalizer()
File "/home/buildbot/buildarea/3.10.cstratak-RHEL7-x86_64.refleak/build/Lib/multiprocessing/util.py", line 224, in __call__
res = self._callback(*self._args, **self._kwargs)
File "/home/buildbot/buildarea/3.10.cstratak-RHEL7-x86_64.refleak/build/Lib/multiprocessing/synchronize.py", line 87, in _cleanup
sem_unlink(name)
FileNotFoundError: [Errno 2] No such file or directory
Traceback (most recent call last):
File "/home/buildbot/buildarea/3.10.cstratak-RHEL7-x86_64.refleak/build/Lib/multiprocessing/util.py", line 300, in _run_finalizers
finalizer()
File "/home/buildbot/buildarea/3.10.cstratak-RHEL7-x86_64.refleak/build/Lib/multiprocessing/util.py", line 224, in __call__
res = self._callback(*self._args, **self._kwargs)
File "/home/buildbot/buildarea/3.10.cstratak-RHEL7-x86_64.refleak/build/Lib/multiprocessing/synchronize.py", line 87, in _cleanup
sem_unlink(name)
FileNotFoundError: [Errno 2] No such file or directory
Traceback (most recent call last):
File "/home/buildbot/buildarea/3.10.cstratak-RHEL7-x86_64.refleak/build/Lib/multiprocessing/util.py", line 300, in _run_finalizers
finalizer()
File "/home/buildbot/buildarea/3.10.cstratak-RHEL7-x86_64.refleak/build/Lib/multiprocessing/util.py", line 224, in __call__
res = self._callback(*self._args, **self._kwargs)
File "/home/buildbot/buildarea/3.10.cstratak-RHEL7-x86_64.refleak/build/Lib/multiprocessing/synchronize.py", line 87, in _cleanup
sem_unlink(name)
FileNotFoundError: [Errno 2] No such file or directory
Traceback (most recent call last):
File "/home/buildbot/buildarea/3.10.cstratak-RHEL7-x86_64.refleak/build/Lib/multiprocessing/util.py", line 300, in _run_finalizers
finalizer()
File "/home/buildbot/buildarea/3.10.cstratak-RHEL7-x86_64.refleak/build/Lib/multiprocessing/util.py", line 224, in __call__
res = self._callback(*self._args, **self._kwargs)
File "/home/buildbot/buildarea/3.10.cstratak-RHEL7-x86_64.refleak/build/Lib/multiprocessing/synchronize.py", line 87, in _cleanup
sem_unlink(name)
FileNotFoundError: [Errno 2] No such file or directory
Traceback (most recent call last):
File "/home/buildbot/buildarea/3.10.cstratak-RHEL7-x86_64.refleak/build/Lib/multiprocessing/util.py", line 300, in _run_finalizers
finalizer()
File "/home/buildbot/buildarea/3.10.cstratak-RHEL7-x86_64.refleak/build/Lib/multiprocessing/util.py", line 224, in __call__
res = self._callback(*self._args, **self._kwargs)
File "/home/buildbot/buildarea/3.10.cstratak-RHEL7-x86_64.refleak/build/Lib/multiprocessing/synchronize.py", line 87, in _cleanup
sem_unlink(name)
FileNotFoundError: [Errno 2] No such file or directory
.
Traceback (most recent call last):
File "/home/buildbot/buildarea/3.10.cstratak-RHEL7-x86_64.refleak/build/Lib/threading.py", line 973, in _bootstrap
self._bootstrap_inner()
File "/home/buildbot/buildarea/3.10.cstratak-RHEL7-x86_64.refleak/build/Lib/threading.py", line 1011, in _bootstrap_inner
_sys.settrace(_trace_hook)
RuntimeError: Cannot install a trace function while another trace function is being installed
..
Test report
===========
Sincerely,
-The Buildbot
1
0
☠ Buildbot (Python): python/cpython - failed test (failure) (3.13)
by buildbot@python.org July 25, 2024
by buildbot@python.org July 25, 2024
July 25, 2024
The Buildbot has detected a new failure on builder AMD64 Windows11 Bigmem 3.13 while building python/cpython.
Full details are available at:
https://buildbot.python.org/#/builders/1463/builds/273
Buildbot URL: https://buildbot.python.org/
Worker for this Build: ambv-bb-win11
Build Reason: <unknown>
Blamelist: Eric Snow <ericsnowcurrently(a)gmail.com>, Hugo van Kemenade <1324225+hugovk(a)users.noreply.github.com>, Miss Islington (bot) <31488909+miss-islington(a)users.noreply.github.com>, Serhiy Storchaka <storchaka(a)gmail.com>
BUILD FAILED: failed test (failure)
Summary of the results of the build (if available):
===================================================
==
Captured traceback
==================
Traceback (most recent call last):
File "R:\buildarea\3.13.ambv-bb-win11.bigmem\build\Lib\test\test_os.py", line 2846, in test_listmounts
self.assertSetEqual(
~~~~~~~~~~~~~~~~~~~^
set(mounts),
^^^^^^^^^^^^
self.known_mounts & set(mounts),
^^^^^^^^^^^^^^^^^^^^^^^^^^^^^^^^
)
^
AssertionError: Items in the first set but not the second:
'R:\\'
Test report
===========
Failed tests:
- test_os
Failed subtests:
- test_listmounts - test.test_os.Win32ListdriveTests.test_listmounts
Sincerely,
-The Buildbot
1
0
☠ Buildbot (Python): - failed compile (failure) (9dad694dc5c48811ee02cacbd2cb078b6d053004)
by buildbot@python.org July 25, 2024
by buildbot@python.org July 25, 2024
July 25, 2024
The Buildbot has detected a new failure on builder PPC64LE Fedora Rawhide Refleaks 3.12 while building Python.
Full details are available at:
https://buildbot.python.org/#/builders/1157/builds/423
Buildbot URL: https://buildbot.python.org/
Worker for this Build: cstratak-fedora-rawhide-ppc64le
Build Reason: <unknown>
Blamelist:
BUILD FAILED: failed compile (failure)
Summary of the results of the build (if available):
===================================================
Captured traceback
==================
remote: Enumerating objects: 35, done.
remote: Counting objects: 3% (1/31)
remote: Counting objects: 6% (2/31)
remote: Counting objects: 9% (3/31)
remote: Counting objects: 12% (4/31)
remote: Counting objects: 16% (5/31)
remote: Counting objects: 19% (6/31)
remote: Counting objects: 22% (7/31)
remote: Counting objects: 25% (8/31)
remote: Counting objects: 29% (9/31)
remote: Counting objects: 32% (10/31)
remote: Counting objects: 35% (11/31)
remote: Counting objects: 38% (12/31)
remote: Counting objects: 41% (13/31)
remote: Counting objects: 45% (14/31)
remote: Counting objects: 48% (15/31)
remote: Counting objects: 51% (16/31)
remote: Counting objects: 54% (17/31)
remote: Counting objects: 58% (18/31)
remote: Counting objects: 61% (19/31)
remote: Counting objects: 64% (20/31)
remote: Counting objects: 67% (21/31)
remote: Counting objects: 70% (22/31)
remote: Counting objects: 74% (23/31)
remote: Counting objects: 77% (24/31)
remote: Counting objects: 80% (25/31)
remote: Counting objects: 83% (26/31)
remote: Counting objects: 87% (27/31)
remote: Counting objects: 90% (28/31)
remote: Counting objects: 93% (29/31)
remote: Counting objects: 96% (30/31)
remote: Counting objects: 100% (31/31)
remote: Counting objects: 100% (31/31), done.
remote: Compressing objects: 4% (1/21)
remote: Compressing objects: 9% (2/21)
remote: Compressing objects: 14% (3/21)
remote: Compressing objects: 19% (4/21)
remote: Compressing objects: 23% (5/21)
remote: Compressing objects: 28% (6/21)
remote: Compressing objects: 33% (7/21)
remote: Compressing objects: 38% (8/21)
remote: Compressing objects: 42% (9/21)
remote: Compressing objects: 47% (10/21)
remote: Compressing objects: 52% (11/21)
remote: Compressing objects: 57% (12/21)
remote: Compressing objects: 61% (13/21)
remote: Compressing objects: 66% (14/21)
remote: Compressing objects: 71% (15/21)
remote: Compressing objects: 76% (16/21)
remote: Compressing objects: 80% (17/21)
remote: Compressing objects: 85% (18/21)
remote: Compressing objects: 90% (19/21)
remote: Compressing objects: 95% (20/21)
remote: Compressing objects: 100% (21/21)
remote: Compressing objects: 100% (21/21), done.
remote: Total 35 (delta 10), reused 17 (delta 10), pack-reused 4
From https://github.com/python/cpython
* branch 3.12 -> FETCH_HEAD
Note: switching to 'FETCH_HEAD'.
You are in 'detached HEAD' state. You can look around, make experimental
changes and commit them, and you can discard any commits you make in this
state without impacting any branches by switching back to a branch.
If you want to create a new branch to retain commits you create, you may
do so (now or later) by using -c with the switch command. Example:
git switch -c <new-branch-name>
Or undo this operation with:
git switch -
Turn off this advice by setting config variable advice.detachedHead to false
HEAD is now at 9dad694dc5 [3.12] GH-120754: Add more tests around seek + readall (GH-122103) (#122216)
Switched to and reset branch '3.12'
/tmp/ccBY2vxN.s: Assembler messages:
/tmp/ccBY2vxN.s: Fatal error: Python/bltinmodule.o: No space left on device
make: *** [Makefile:2743: Python/bltinmodule.o] Error 1
make: *** Waiting for unfinished jobs....
Assembler messages:
Fatal error: can't create Python/frame.o: No space left on device
make: *** [Makefile:2743: Python/frame.o] Error 1
Assembler messages:
Fatal error: can't create Python/flowgraph.o: No space left on device
make: *** [Makefile:2743: Python/flowgraph.o] Error 1
Assembler messages:
Fatal error: can't create Objects/typeobject.o: No space left on device
make: *** [Makefile:2743: Objects/typeobject.o] Error 1
Assembler messages:
Fatal error: can't create Python/compile.o: No space left on device
make: *** [Makefile:2743: Python/compile.o] Error 1
Assembler messages:
Fatal error: can't create Python/ceval.o: No space left on device
make: *** [Makefile:2743: Python/ceval.o] Error 1
Assembler messages:
Fatal error: can't create Objects/unicodeobject.o: No space left on device
make: *** [Makefile:2743: Objects/unicodeobject.o] Error 1
Assembler messages:
Fatal error: can't create Python/Python-ast.o: No space left on device
make: *** [Makefile:2743: Python/Python-ast.o] Error 1
Assembler messages:
Fatal error: can't create Parser/parser.o: No space left on device
make: *** [Makefile:2743: Parser/parser.o] Error 1
find: ‘build’: No such file or directory
find: ‘build’: No such file or directory
find: ‘build’: No such file or directory
find: ‘build’: No such file or directory
make: [Makefile:2834: clean-retain-profile] Error 1 (ignored)
Test report
===========
Sincerely,
-The BuildbotThe Buildbot has detected a new failure on builder PPC64LE Fedora Rawhide NoGIL refleaks 3.12 while building Python.
Full details are available at:
https://buildbot.python.org/#/builders/1521/builds/59
Buildbot URL: https://buildbot.python.org/
Worker for this Build: cstratak-fedora-rawhide-ppc64le
Build Reason: <unknown>
Blamelist:
BUILD FAILED: failed compile (failure)
Summary of the results of the build (if available):
===================================================
Captured traceback
==================
remote: Enumerating objects: 41, done.
remote: Counting objects: 2% (1/35)
remote: Counting objects: 5% (2/35)
remote: Counting objects: 8% (3/35)
remote: Counting objects: 11% (4/35)
remote: Counting objects: 14% (5/35)
remote: Counting objects: 17% (6/35)
remote: Counting objects: 20% (7/35)
remote: Counting objects: 22% (8/35)
remote: Counting objects: 25% (9/35)
remote: Counting objects: 28% (10/35)
remote: Counting objects: 31% (11/35)
remote: Counting objects: 34% (12/35)
remote: Counting objects: 37% (13/35)
remote: Counting objects: 40% (14/35)
remote: Counting objects: 42% (15/35)
remote: Counting objects: 45% (16/35)
remote: Counting objects: 48% (17/35)
remote: Counting objects: 51% (18/35)
remote: Counting objects: 54% (19/35)
remote: Counting objects: 57% (20/35)
remote: Counting objects: 60% (21/35)
remote: Counting objects: 62% (22/35)
remote: Counting objects: 65% (23/35)
remote: Counting objects: 68% (24/35)
remote: Counting objects: 71% (25/35)
remote: Counting objects: 74% (26/35)
remote: Counting objects: 77% (27/35)
remote: Counting objects: 80% (28/35)
remote: Counting objects: 82% (29/35)
remote: Counting objects: 85% (30/35)
remote: Counting objects: 88% (31/35)
remote: Counting objects: 91% (32/35)
remote: Counting objects: 94% (33/35)
remote: Counting objects: 97% (34/35)
remote: Counting objects: 100% (35/35)
remote: Counting objects: 100% (35/35), done.
remote: Compressing objects: 4% (1/22)
remote: Compressing objects: 9% (2/22)
remote: Compressing objects: 13% (3/22)
remote: Compressing objects: 18% (4/22)
remote: Compressing objects: 22% (5/22)
remote: Compressing objects: 27% (6/22)
remote: Compressing objects: 31% (7/22)
remote: Compressing objects: 36% (8/22)
remote: Compressing objects: 40% (9/22)
remote: Compressing objects: 45% (10/22)
remote: Compressing objects: 50% (11/22)
remote: Compressing objects: 54% (12/22)
remote: Compressing objects: 59% (13/22)
remote: Compressing objects: 63% (14/22)
remote: Compressing objects: 68% (15/22)
remote: Compressing objects: 72% (16/22)
remote: Compressing objects: 77% (17/22)
remote: Compressing objects: 81% (18/22)
remote: Compressing objects: 86% (19/22)
remote: Compressing objects: 90% (20/22)
remote: Compressing objects: 95% (21/22)
remote: Compressing objects: 100% (22/22)
remote: Compressing objects: 100% (22/22), done.
remote: Total 41 (delta 13), reused 20 (delta 13), pack-reused 6
From https://github.com/python/cpython
* branch 3.12 -> FETCH_HEAD
Note: switching to 'FETCH_HEAD'.
You are in 'detached HEAD' state. You can look around, make experimental
changes and commit them, and you can discard any commits you make in this
state without impacting any branches by switching back to a branch.
If you want to create a new branch to retain commits you create, you may
do so (now or later) by using -c with the switch command. Example:
git switch -c <new-branch-name>
Or undo this operation with:
git switch -
Turn off this advice by setting config variable advice.detachedHead to false
HEAD is now at 9dad694dc5 [3.12] GH-120754: Add more tests around seek + readall (GH-122103) (#122216)
Switched to and reset branch '3.12'
configure: WARNING: unrecognized options: --disable-gil
configure: WARNING: unrecognized options: --disable-gil
/tmp/ccJ3iWG3.s: Assembler messages:
/tmp/ccJ3iWG3.s: Fatal error: can't write 3944 bytes to section .debug_info of Python/bltinmodule.o: 'No space left on device'
/tmp/ccJ3iWG3.s: Fatal error: Python/bltinmodule.o: No such file or directory
make: *** [Makefile:2743: Python/bltinmodule.o] Error 1
make: *** Waiting for unfinished jobs....
Assembler messages:
Fatal error: can't create Python/future.o: No space left on device
make: *** [Makefile:2743: Python/future.o] Error 1
Assembler messages:
Fatal error: can't create Python/flowgraph.o: No space left on device
make: *** [Makefile:2743: Python/flowgraph.o] Error 1
Assembler messages:
Fatal error: can't create Objects/typeobject.o: No space left on device
make: *** [Makefile:2743: Objects/typeobject.o] Error 1
Assembler messages:
Fatal error: can't create Python/compile.o: No space left on device
make: *** [Makefile:2743: Python/compile.o] Error 1
Assembler messages:
Fatal error: can't create Python/getargs.o: No space left on device
make: *** [Makefile:2743: Python/getargs.o] Error 1
Assembler messages:
Fatal error: can't create Python/ceval.o: No space left on device
make: *** [Makefile:2743: Python/ceval.o] Error 1
Assembler messages:
Fatal error: can't create Python/Python-ast.o: No space left on device
make: *** [Makefile:2743: Python/Python-ast.o] Error 1
Assembler messages:
Fatal error: can't create Parser/parser.o: No space left on device
make: *** [Makefile:2743: Parser/parser.o] Error 1
Assembler messages:
Fatal error: can't create Objects/unicodeobject.o: No space left on device
make: *** [Makefile:2743: Objects/unicodeobject.o] Error 1
find: ‘build’: No such file or directory
find: ‘build’: No such file or directory
find: ‘build’: No such file or directory
find: ‘build’: No such file or directory
make: [Makefile:2834: clean-retain-profile] Error 1 (ignored)
Test report
===========
Sincerely,
-The Buildbot
1
0
☠ Buildbot (Python): python/cpython - failed test (failure) (main)
by buildbot@python.org July 25, 2024
by buildbot@python.org July 25, 2024
July 25, 2024
The Buildbot has detected a new failure on builder AMD64 Windows11 Bigmem 3.x while building python/cpython.
Full details are available at:
https://buildbot.python.org/#/builders/1079/builds/4444
Buildbot URL: https://buildbot.python.org/
Worker for this Build: ambv-bb-win11
Build Reason: <unknown>
Blamelist: Brandt Bucher <brandtbucher(a)microsoft.com>, Cody Maloney <cmaloney(a)users.noreply.github.com>, Dino Viehland <dinoviehland(a)meta.com>, Eric Snow <ericsnowcurrently(a)gmail.com>, Hugo van Kemenade <1324225+hugovk(a)users.noreply.github.com>, Irit Katriel <1055913+iritkatriel(a)users.noreply.github.com>, Jelle Zijlstra <jelle.zijlstra(a)gmail.com>, Mark Shannon <mark(a)hotpy.org>, Sam Gross <colesbury(a)gmail.com>, Serhiy Storchaka <storchaka(a)gmail.com>, Sviatoslav Sydorenko (Святослав Сидоренко) <wk.cvs.github(a)sydorenko.org.ua>, Tian Gao <gaogaotiantian(a)hotmail.com>, Xie Yanbo <xieyanbo(a)gmail.com>, sobolevn <mail(a)sobolevn.me>
BUILD FAILED: failed test (failure)
Summary of the results of the build (if available):
===================================================
==
Captured traceback
==================
Traceback (most recent call last):
File "R:\buildarea\3.x.ambv-bb-win11.bigmem\build\Lib\test\test_os.py", line 2892, in test_listmounts
self.assertSetEqual(
~~~~~~~~~~~~~~~~~~~^
set(mounts),
^^^^^^^^^^^^
self.known_mounts & set(mounts),
^^^^^^^^^^^^^^^^^^^^^^^^^^^^^^^^
)
^
AssertionError: Items in the first set but not the second:
'R:\\'
Test report
===========
Failed tests:
- test_os
Failed subtests:
- test_listmounts - test.test_os.Win32ListdriveTests.test_listmounts
Sincerely,
-The Buildbot
1
0
☠ Buildbot (Python): - failed compile (failure) (e91ef13861e88c27aed51a24e58d1dcc855a01dc)
by buildbot@python.org July 25, 2024
by buildbot@python.org July 25, 2024
July 25, 2024
The Buildbot has detected a new failure on builder PPC64LE Fedora Rawhide Refleaks 3.x while building Python.
Full details are available at:
https://buildbot.python.org/#/builders/300/builds/1152
Buildbot URL: https://buildbot.python.org/
Worker for this Build: cstratak-fedora-rawhide-ppc64le
Build Reason: <unknown>
Blamelist:
BUILD FAILED: failed compile (failure)
Summary of the results of the build (if available):
===================================================
Captured traceback
==================
remote: Enumerating objects: 166, done.
remote: Counting objects: 0% (1/146)
remote: Counting objects: 1% (2/146)
remote: Counting objects: 2% (3/146)
remote: Counting objects: 3% (5/146)
remote: Counting objects: 4% (6/146)
remote: Counting objects: 5% (8/146)
remote: Counting objects: 6% (9/146)
remote: Counting objects: 7% (11/146)
remote: Counting objects: 8% (12/146)
remote: Counting objects: 9% (14/146)
remote: Counting objects: 10% (15/146)
remote: Counting objects: 11% (17/146)
remote: Counting objects: 12% (18/146)
remote: Counting objects: 13% (19/146)
remote: Counting objects: 14% (21/146)
remote: Counting objects: 15% (22/146)
remote: Counting objects: 16% (24/146)
remote: Counting objects: 17% (25/146)
remote: Counting objects: 18% (27/146)
remote: Counting objects: 19% (28/146)
remote: Counting objects: 20% (30/146)
remote: Counting objects: 21% (31/146)
remote: Counting objects: 22% (33/146)
remote: Counting objects: 23% (34/146)
remote: Counting objects: 24% (36/146)
remote: Counting objects: 25% (37/146)
remote: Counting objects: 26% (38/146)
remote: Counting objects: 27% (40/146)
remote: Counting objects: 28% (41/146)
remote: Counting objects: 29% (43/146)
remote: Counting objects: 30% (44/146)
remote: Counting objects: 31% (46/146)
remote: Counting objects: 32% (47/146)
remote: Counting objects: 33% (49/146)
remote: Counting objects: 34% (50/146)
remote: Counting objects: 35% (52/146)
remote: Counting objects: 36% (53/146)
remote: Counting objects: 37% (55/146)
remote: Counting objects: 38% (56/146)
remote: Counting objects: 39% (57/146)
remote: Counting objects: 40% (59/146)
remote: Counting objects: 41% (60/146)
remote: Counting objects: 42% (62/146)
remote: Counting objects: 43% (63/146)
remote: Counting objects: 44% (65/146)
remote: Counting objects: 45% (66/146)
remote: Counting objects: 46% (68/146)
remote: Counting objects: 47% (69/146)
remote: Counting objects: 48% (71/146)
remote: Counting objects: 49% (72/146)
remote: Counting objects: 50% (73/146)
remote: Counting objects: 51% (75/146)
remote: Counting objects: 52% (76/146)
remote: Counting objects: 53% (78/146)
remote: Counting objects: 54% (79/146)
remote: Counting objects: 55% (81/146)
remote: Counting objects: 56% (82/146)
remote: Counting objects: 57% (84/146)
remote: Counting objects: 58% (85/146)
remote: Counting objects: 59% (87/146)
remote: Counting objects: 60% (88/146)
remote: Counting objects: 61% (90/146)
remote: Counting objects: 62% (91/146)
remote: Counting objects: 63% (92/146)
remote: Counting objects: 64% (94/146)
remote: Counting objects: 65% (95/146)
remote: Counting objects: 66% (97/146)
remote: Counting objects: 67% (98/146)
remote: Counting objects: 68% (100/146)
remote: Counting objects: 69% (101/146)
remote: Counting objects: 70% (103/146)
remote: Counting objects: 71% (104/146)
remote: Counting objects: 72% (106/146)
remote: Counting objects: 73% (107/146)
remote: Counting objects: 74% (109/146)
remote: Counting objects: 75% (110/146)
remote: Counting objects: 76% (111/146)
remote: Counting objects: 77% (113/146)
remote: Counting objects: 78% (114/146)
remote: Counting objects: 79% (116/146)
remote: Counting objects: 80% (117/146)
remote: Counting objects: 81% (119/146)
remote: Counting objects: 82% (120/146)
remote: Counting objects: 83% (122/146)
remote: Counting objects: 84% (123/146)
remote: Counting objects: 85% (125/146)
remote: Counting objects: 86% (126/146)
remote: Counting objects: 87% (128/146)
remote: Counting objects: 88% (129/146)
remote: Counting objects: 89% (130/146)
remote: Counting objects: 90% (132/146)
remote: Counting objects: 91% (133/146)
remote: Counting objects: 92% (135/146)
remote: Counting objects: 93% (136/146)
remote: Counting objects: 94% (138/146)
remote: Counting objects: 95% (139/146)
remote: Counting objects: 96% (141/146)
remote: Counting objects: 97% (142/146)
remote: Counting objects: 98% (144/146)
remote: Counting objects: 99% (145/146)
remote: Counting objects: 100% (146/146)
remote: Counting objects: 100% (146/146), done.
remote: Compressing objects: 3% (1/33)
remote: Compressing objects: 6% (2/33)
remote: Compressing objects: 9% (3/33)
remote: Compressing objects: 12% (4/33)
remote: Compressing objects: 15% (5/33)
remote: Compressing objects: 18% (6/33)
remote: Compressing objects: 21% (7/33)
remote: Compressing objects: 24% (8/33)
remote: Compressing objects: 27% (9/33)
remote: Compressing objects: 30% (10/33)
remote: Compressing objects: 33% (11/33)
remote: Compressing objects: 36% (12/33)
remote: Compressing objects: 39% (13/33)
remote: Compressing objects: 42% (14/33)
remote: Compressing objects: 45% (15/33)
remote: Compressing objects: 48% (16/33)
remote: Compressing objects: 51% (17/33)
remote: Compressing objects: 54% (18/33)
remote: Compressing objects: 57% (19/33)
remote: Compressing objects: 60% (20/33)
remote: Compressing objects: 63% (21/33)
remote: Compressing objects: 66% (22/33)
remote: Compressing objects: 69% (23/33)
remote: Compressing objects: 72% (24/33)
remote: Compressing objects: 75% (25/33)
remote: Compressing objects: 78% (26/33)
remote: Compressing objects: 81% (27/33)
remote: Compressing objects: 84% (28/33)
remote: Compressing objects: 87% (29/33)
remote: Compressing objects: 90% (30/33)
remote: Compressing objects: 93% (31/33)
remote: Compressing objects: 96% (32/33)
remote: Compressing objects: 100% (33/33)
remote: Compressing objects: 100% (33/33), done.
Receiving objects: 0% (1/166)
Receiving objects: 1% (2/166)
Receiving objects: 2% (4/166)
Receiving objects: 3% (5/166)
Receiving objects: 4% (7/166)
Receiving objects: 5% (9/166)
Receiving objects: 6% (10/166)
Receiving objects: 7% (12/166)
Receiving objects: 8% (14/166)
Receiving objects: 9% (15/166)
Receiving objects: 10% (17/166)
Receiving objects: 11% (19/166)
Receiving objects: 12% (20/166)
Receiving objects: 13% (22/166)
Receiving objects: 14% (24/166)
Receiving objects: 15% (25/166)
Receiving objects: 16% (27/166)
Receiving objects: 17% (29/166)
Receiving objects: 18% (30/166)
Receiving objects: 19% (32/166)
Receiving objects: 20% (34/166)
Receiving objects: 21% (35/166)
Receiving objects: 22% (37/166)
Receiving objects: 23% (39/166)
Receiving objects: 24% (40/166)
Receiving objects: 25% (42/166)
Receiving objects: 26% (44/166)
Receiving objects: 27% (45/166)
Receiving objects: 28% (47/166)
Receiving objects: 29% (49/166)
Receiving objects: 30% (50/166)
Receiving objects: 31% (52/166)
Receiving objects: 32% (54/166)
Receiving objects: 33% (55/166)
Receiving objects: 34% (57/166)
Receiving objects: 35% (59/166)
Receiving objects: 36% (60/166)
Receiving objects: 37% (62/166)
Receiving objects: 38% (64/166)
Receiving objects: 39% (65/166)
Receiving objects: 40% (67/166)
Receiving objects: 41% (69/166)
Receiving objects: 42% (70/166)
Receiving objects: 43% (72/166)
Receiving objects: 44% (74/166)
Receiving objects: 45% (75/166)
Receiving objects: 46% (77/166)
Receiving objects: 47% (79/166)
Receiving objects: 48% (80/166)
Receiving objects: 49% (82/166)
Receiving objects: 50% (83/166)
Receiving objects: 51% (85/166)
Receiving objects: 52% (87/166)
Receiving objects: 53% (88/166)
Receiving objects: 54% (90/166)
Receiving objects: 55% (92/166)
Receiving objects: 56% (93/166)
Receiving objects: 57% (95/166)
Receiving objects: 58% (97/166)
Receiving objects: 59% (98/166)
Receiving objects: 60% (100/166)
Receiving objects: 61% (102/166)
Receiving objects: 62% (103/166)
Receiving objects: 63% (105/166)
Receiving objects: 64% (107/166)
Receiving objects: 65% (108/166)
Receiving objects: 66% (110/166)
Receiving objects: 67% (112/166)
Receiving objects: 68% (113/166)
Receiving objects: 69% (115/166)
Receiving objects: 70% (117/166)
Receiving objects: 71% (118/166)
Receiving objects: 72% (120/166)
Receiving objects: 73% (122/166)
Receiving objects: 74% (123/166)
Receiving objects: 75% (125/166)
Receiving objects: 76% (127/166)
Receiving objects: 77% (128/166)
Receiving objects: 78% (130/166)
Receiving objects: 79% (132/166)
Receiving objects: 80% (133/166)
Receiving objects: 81% (135/166)
Receiving objects: 82% (137/166)
Receiving objects: 83% (138/166)
Receiving objects: 84% (140/166)
Receiving objects: 85% (142/166)
Receiving objects: 86% (143/166)
Receiving objects: 87% (145/166)
remote: Total 166 (delta 118), reused 124 (delta 113), pack-reused 20
Receiving objects: 88% (147/166)
Receiving objects: 89% (148/166)
Receiving objects: 90% (150/166)
Receiving objects: 91% (152/166)
Receiving objects: 92% (153/166)
Receiving objects: 93% (155/166)
Receiving objects: 94% (157/166)
Receiving objects: 95% (158/166)
Receiving objects: 96% (160/166)
Receiving objects: 97% (162/166)
Receiving objects: 98% (163/166)
Receiving objects: 99% (165/166)
Receiving objects: 100% (166/166)
Receiving objects: 100% (166/166), 291.49 KiB | 8.10 MiB/s, done.
Resolving deltas: 0% (0/118)
Resolving deltas: 1% (2/118)
Resolving deltas: 2% (3/118)
Resolving deltas: 3% (4/118)
Resolving deltas: 4% (5/118)
Resolving deltas: 5% (6/118)
Resolving deltas: 6% (8/118)
Resolving deltas: 7% (9/118)
Resolving deltas: 8% (10/118)
Resolving deltas: 9% (11/118)
Resolving deltas: 10% (12/118)
Resolving deltas: 11% (13/118)
Resolving deltas: 12% (15/118)
Resolving deltas: 13% (16/118)
Resolving deltas: 14% (17/118)
Resolving deltas: 15% (18/118)
Resolving deltas: 16% (19/118)
Resolving deltas: 17% (21/118)
Resolving deltas: 18% (22/118)
Resolving deltas: 19% (23/118)
Resolving deltas: 20% (24/118)
Resolving deltas: 21% (25/118)
Resolving deltas: 22% (26/118)
Resolving deltas: 23% (28/118)
Resolving deltas: 24% (29/118)
Resolving deltas: 25% (30/118)
Resolving deltas: 26% (31/118)
Resolving deltas: 27% (32/118)
Resolving deltas: 28% (34/118)
Resolving deltas: 29% (35/118)
Resolving deltas: 30% (36/118)
Resolving deltas: 31% (37/118)
Resolving deltas: 32% (38/118)
Resolving deltas: 33% (39/118)
Resolving deltas: 34% (41/118)
Resolving deltas: 35% (42/118)
Resolving deltas: 36% (43/118)
Resolving deltas: 37% (44/118)
Resolving deltas: 38% (45/118)
Resolving deltas: 39% (47/118)
Resolving deltas: 40% (48/118)
Resolving deltas: 41% (49/118)
Resolving deltas: 42% (50/118)
Resolving deltas: 43% (51/118)
Resolving deltas: 44% (52/118)
Resolving deltas: 45% (54/118)
Resolving deltas: 46% (55/118)
Resolving deltas: 47% (56/118)
Resolving deltas: 48% (57/118)
Resolving deltas: 49% (58/118)
Resolving deltas: 50% (59/118)
Resolving deltas: 51% (61/118)
Resolving deltas: 52% (62/118)
Resolving deltas: 53% (63/118)
Resolving deltas: 54% (64/118)
Resolving deltas: 55% (65/118)
Resolving deltas: 56% (67/118)
Resolving deltas: 57% (68/118)
Resolving deltas: 58% (69/118)
Resolving deltas: 59% (70/118)
Resolving deltas: 60% (71/118)
Resolving deltas: 61% (72/118)
Resolving deltas: 62% (74/118)
Resolving deltas: 63% (75/118)
Resolving deltas: 64% (76/118)
Resolving deltas: 65% (77/118)
Resolving deltas: 66% (78/118)
Resolving deltas: 67% (80/118)
Resolving deltas: 68% (81/118)
Resolving deltas: 69% (82/118)
Resolving deltas: 70% (83/118)
Resolving deltas: 71% (84/118)
Resolving deltas: 72% (85/118)
Resolving deltas: 73% (87/118)
Resolving deltas: 74% (88/118)
Resolving deltas: 75% (89/118)
Resolving deltas: 76% (90/118)
Resolving deltas: 77% (91/118)
Resolving deltas: 78% (93/118)
Resolving deltas: 79% (94/118)
Resolving deltas: 80% (95/118)
Resolving deltas: 81% (96/118)
Resolving deltas: 82% (97/118)
Resolving deltas: 83% (98/118)
Resolving deltas: 84% (100/118)
Resolving deltas: 85% (101/118)
Resolving deltas: 86% (102/118)
Resolving deltas: 87% (103/118)
Resolving deltas: 88% (104/118)
Resolving deltas: 89% (106/118)
Resolving deltas: 90% (107/118)
Resolving deltas: 91% (108/118)
Resolving deltas: 92% (109/118)
Resolving deltas: 93% (110/118)
Resolving deltas: 94% (111/118)
Resolving deltas: 95% (113/118)
Resolving deltas: 96% (114/118)
Resolving deltas: 97% (115/118)
Resolving deltas: 98% (116/118)
Resolving deltas: 99% (117/118)
Resolving deltas: 100% (118/118)
Resolving deltas: 100% (118/118), completed with 69 local objects.
From https://github.com/python/cpython
* branch main -> FETCH_HEAD
Note: switching to 'FETCH_HEAD'.
You are in 'detached HEAD' state. You can look around, make experimental
changes and commit them, and you can discard any commits you make in this
state without impacting any branches by switching back to a branch.
If you want to create a new branch to retain commits you create, you may
do so (now or later) by using -c with the switch command. Example:
git switch -c <new-branch-name>
Or undo this operation with:
git switch -
Turn off this advice by setting config variable advice.detachedHead to false
HEAD is now at e91ef13861 gh-122029: Log call events in sys.setprofile when it's a method with c function (GH-122072)
Switched to and reset branch 'main'
configure: WARNING: no system libmpdecimal found; falling back to bundled libmpdecimal (deprecated and scheduled for removal in Python 3.15)
/tmp/cc41eCjL.s: Assembler messages:
/tmp/cc41eCjL.s: Fatal error: can't write 450 bytes to section .debug_line of Objects/typeobject.o: 'No space left on device'
/tmp/cc41eCjL.s: Fatal error: Objects/typeobject.o: No such file or directory
make: *** [Makefile:3059: Objects/typeobject.o] Error 1
make: *** Waiting for unfinished jobs....
Assembler messages:
Fatal error: can't create Python/flowgraph.o: No space left on device
Assembler messages:
Fatal error: can't create Python/frozenmain.o: No space left on device
make: *** [Makefile:3059: Python/flowgraph.o] Error 1
make: *** [Makefile:3059: Python/frozenmain.o] Error 1
/tmp/ccGuAdUh.s: Assembler messages:
/tmp/ccGuAdUh.s: Fatal error: can't write 651 bytes to section .debug_line of Python/errors.o: 'No space left on device'
/tmp/ccGuAdUh.s: Fatal error: Python/errors.o: No such file or directory
make: *** [Makefile:3059: Python/errors.o] Error 1
Assembler messages:
Fatal error: can't create Python/compile.o: No space left on device
make: *** [Makefile:3059: Python/compile.o] Error 1
Assembler messages:
Fatal error: can't create Python/ceval.o: No space left on device
make: *** [Makefile:3059: Python/ceval.o] Error 1
Assembler messages:
Fatal error: can't create Parser/parser.o: No space left on device
make: *** [Makefile:3059: Parser/parser.o] Error 1
Assembler messages:
Fatal error: can't create Objects/unicodeobject.o: No space left on device
make: *** [Makefile:3059: Objects/unicodeobject.o] Error 1
Assembler messages:
Fatal error: can't create Python/Python-ast.o: No space left on device
make: *** [Makefile:3059: Python/Python-ast.o] Error 1
find: ‘build’: No such file or directory
find: ‘build’: No such file or directory
find: ‘build’: No such file or directory
find: ‘build’: No such file or directory
make: [Makefile:3150: clean-retain-profile] Error 1 (ignored)
Test report
===========
Sincerely,
-The BuildbotThe Buildbot has detected a new failure on builder PPC64LE Fedora Rawhide NoGIL refleaks 3.x while building Python.
Full details are available at:
https://buildbot.python.org/#/builders/1540/builds/50
Buildbot URL: https://buildbot.python.org/
Worker for this Build: cstratak-fedora-rawhide-ppc64le
Build Reason: <unknown>
Blamelist:
BUILD FAILED: failed compile (failure)
Summary of the results of the build (if available):
===================================================
Captured traceback
==================
remote: Enumerating objects: 166, done.
remote: Counting objects: 0% (1/146)
remote: Counting objects: 1% (2/146)
remote: Counting objects: 2% (3/146)
remote: Counting objects: 3% (5/146)
remote: Counting objects: 4% (6/146)
remote: Counting objects: 5% (8/146)
remote: Counting objects: 6% (9/146)
remote: Counting objects: 7% (11/146)
remote: Counting objects: 8% (12/146)
remote: Counting objects: 9% (14/146)
remote: Counting objects: 10% (15/146)
remote: Counting objects: 11% (17/146)
remote: Counting objects: 12% (18/146)
remote: Counting objects: 13% (19/146)
remote: Counting objects: 14% (21/146)
remote: Counting objects: 15% (22/146)
remote: Counting objects: 16% (24/146)
remote: Counting objects: 17% (25/146)
remote: Counting objects: 18% (27/146)
remote: Counting objects: 19% (28/146)
remote: Counting objects: 20% (30/146)
remote: Counting objects: 21% (31/146)
remote: Counting objects: 22% (33/146)
remote: Counting objects: 23% (34/146)
remote: Counting objects: 24% (36/146)
remote: Counting objects: 25% (37/146)
remote: Counting objects: 26% (38/146)
remote: Counting objects: 27% (40/146)
remote: Counting objects: 28% (41/146)
remote: Counting objects: 29% (43/146)
remote: Counting objects: 30% (44/146)
remote: Counting objects: 31% (46/146)
remote: Counting objects: 32% (47/146)
remote: Counting objects: 33% (49/146)
remote: Counting objects: 34% (50/146)
remote: Counting objects: 35% (52/146)
remote: Counting objects: 36% (53/146)
remote: Counting objects: 37% (55/146)
remote: Counting objects: 38% (56/146)
remote: Counting objects: 39% (57/146)
remote: Counting objects: 40% (59/146)
remote: Counting objects: 41% (60/146)
remote: Counting objects: 42% (62/146)
remote: Counting objects: 43% (63/146)
remote: Counting objects: 44% (65/146)
remote: Counting objects: 45% (66/146)
remote: Counting objects: 46% (68/146)
remote: Counting objects: 47% (69/146)
remote: Counting objects: 48% (71/146)
remote: Counting objects: 49% (72/146)
remote: Counting objects: 50% (73/146)
remote: Counting objects: 51% (75/146)
remote: Counting objects: 52% (76/146)
remote: Counting objects: 53% (78/146)
remote: Counting objects: 54% (79/146)
remote: Counting objects: 55% (81/146)
remote: Counting objects: 56% (82/146)
remote: Counting objects: 57% (84/146)
remote: Counting objects: 58% (85/146)
remote: Counting objects: 59% (87/146)
remote: Counting objects: 60% (88/146)
remote: Counting objects: 61% (90/146)
remote: Counting objects: 62% (91/146)
remote: Counting objects: 63% (92/146)
remote: Counting objects: 64% (94/146)
remote: Counting objects: 65% (95/146)
remote: Counting objects: 66% (97/146)
remote: Counting objects: 67% (98/146)
remote: Counting objects: 68% (100/146)
remote: Counting objects: 69% (101/146)
remote: Counting objects: 70% (103/146)
remote: Counting objects: 71% (104/146)
remote: Counting objects: 72% (106/146)
remote: Counting objects: 73% (107/146)
remote: Counting objects: 74% (109/146)
remote: Counting objects: 75% (110/146)
remote: Counting objects: 76% (111/146)
remote: Counting objects: 77% (113/146)
remote: Counting objects: 78% (114/146)
remote: Counting objects: 79% (116/146)
remote: Counting objects: 80% (117/146)
remote: Counting objects: 81% (119/146)
remote: Counting objects: 82% (120/146)
remote: Counting objects: 83% (122/146)
remote: Counting objects: 84% (123/146)
remote: Counting objects: 85% (125/146)
remote: Counting objects: 86% (126/146)
remote: Counting objects: 87% (128/146)
remote: Counting objects: 88% (129/146)
remote: Counting objects: 89% (130/146)
remote: Counting objects: 90% (132/146)
remote: Counting objects: 91% (133/146)
remote: Counting objects: 92% (135/146)
remote: Counting objects: 93% (136/146)
remote: Counting objects: 94% (138/146)
remote: Counting objects: 95% (139/146)
remote: Counting objects: 96% (141/146)
remote: Counting objects: 97% (142/146)
remote: Counting objects: 98% (144/146)
remote: Counting objects: 99% (145/146)
remote: Counting objects: 100% (146/146)
remote: Counting objects: 100% (146/146), done.
remote: Compressing objects: 2% (1/34)
remote: Compressing objects: 5% (2/34)
remote: Compressing objects: 8% (3/34)
remote: Compressing objects: 11% (4/34)
remote: Compressing objects: 14% (5/34)
remote: Compressing objects: 17% (6/34)
remote: Compressing objects: 20% (7/34)
remote: Compressing objects: 23% (8/34)
remote: Compressing objects: 26% (9/34)
remote: Compressing objects: 29% (10/34)
remote: Compressing objects: 32% (11/34)
remote: Compressing objects: 35% (12/34)
remote: Compressing objects: 38% (13/34)
remote: Compressing objects: 41% (14/34)
remote: Compressing objects: 44% (15/34)
remote: Compressing objects: 47% (16/34)
remote: Compressing objects: 50% (17/34)
remote: Compressing objects: 52% (18/34)
remote: Compressing objects: 55% (19/34)
remote: Compressing objects: 58% (20/34)
remote: Compressing objects: 61% (21/34)
remote: Compressing objects: 64% (22/34)
remote: Compressing objects: 67% (23/34)
remote: Compressing objects: 70% (24/34)
remote: Compressing objects: 73% (25/34)
remote: Compressing objects: 76% (26/34)
remote: Compressing objects: 79% (27/34)
remote: Compressing objects: 82% (28/34)
remote: Compressing objects: 85% (29/34)
remote: Compressing objects: 88% (30/34)
remote: Compressing objects: 91% (31/34)
remote: Compressing objects: 94% (32/34)
remote: Compressing objects: 97% (33/34)
remote: Compressing objects: 100% (34/34)
remote: Compressing objects: 100% (34/34), done.
Receiving objects: 0% (1/166)
Receiving objects: 1% (2/166)
Receiving objects: 2% (4/166)
Receiving objects: 3% (5/166)
Receiving objects: 4% (7/166)
Receiving objects: 5% (9/166)
Receiving objects: 6% (10/166)
Receiving objects: 7% (12/166)
Receiving objects: 8% (14/166)
Receiving objects: 9% (15/166)
Receiving objects: 10% (17/166)
Receiving objects: 11% (19/166)
Receiving objects: 12% (20/166)
Receiving objects: 13% (22/166)
Receiving objects: 14% (24/166)
Receiving objects: 15% (25/166)
Receiving objects: 16% (27/166)
Receiving objects: 17% (29/166)
Receiving objects: 18% (30/166)
Receiving objects: 19% (32/166)
Receiving objects: 20% (34/166)
Receiving objects: 21% (35/166)
Receiving objects: 22% (37/166)
Receiving objects: 23% (39/166)
Receiving objects: 24% (40/166)
Receiving objects: 25% (42/166)
Receiving objects: 26% (44/166)
Receiving objects: 27% (45/166)
Receiving objects: 28% (47/166)
Receiving objects: 29% (49/166)
Receiving objects: 30% (50/166)
Receiving objects: 31% (52/166)
Receiving objects: 32% (54/166)
Receiving objects: 33% (55/166)
Receiving objects: 34% (57/166)
Receiving objects: 35% (59/166)
Receiving objects: 36% (60/166)
Receiving objects: 37% (62/166)
Receiving objects: 38% (64/166)
Receiving objects: 39% (65/166)
Receiving objects: 40% (67/166)
Receiving objects: 41% (69/166)
Receiving objects: 42% (70/166)
Receiving objects: 43% (72/166)
Receiving objects: 44% (74/166)
Receiving objects: 45% (75/166)
Receiving objects: 46% (77/166)
Receiving objects: 47% (79/166)
Receiving objects: 48% (80/166)
Receiving objects: 49% (82/166)
Receiving objects: 50% (83/166)
Receiving objects: 51% (85/166)
Receiving objects: 52% (87/166)
Receiving objects: 53% (88/166)
Receiving objects: 54% (90/166)
Receiving objects: 55% (92/166)
Receiving objects: 56% (93/166)
Receiving objects: 57% (95/166)
Receiving objects: 58% (97/166)
Receiving objects: 59% (98/166)
Receiving objects: 60% (100/166)
Receiving objects: 61% (102/166)
Receiving objects: 62% (103/166)
Receiving objects: 63% (105/166)
Receiving objects: 64% (107/166)
Receiving objects: 65% (108/166)
Receiving objects: 66% (110/166)
Receiving objects: 67% (112/166)
Receiving objects: 68% (113/166)
Receiving objects: 69% (115/166)
Receiving objects: 70% (117/166)
Receiving objects: 71% (118/166)
Receiving objects: 72% (120/166)
Receiving objects: 73% (122/166)
Receiving objects: 74% (123/166)
Receiving objects: 75% (125/166)
Receiving objects: 76% (127/166)
Receiving objects: 77% (128/166)
Receiving objects: 78% (130/166)
Receiving objects: 79% (132/166)
Receiving objects: 80% (133/166)
Receiving objects: 81% (135/166)
Receiving objects: 82% (137/166)
Receiving objects: 83% (138/166)
Receiving objects: 84% (140/166)
Receiving objects: 85% (142/166)
Receiving objects: 86% (143/166)
Receiving objects: 87% (145/166)
Receiving objects: 88% (147/166)
Receiving objects: 89% (148/166)
Receiving objects: 90% (150/166)
Receiving objects: 91% (152/166)
Receiving objects: 92% (153/166)
Receiving objects: 93% (155/166)
Receiving objects: 94% (157/166)
Receiving objects: 95% (158/166)
Receiving objects: 96% (160/166)
Receiving objects: 97% (162/166)
remote: Total 166 (delta 117), reused 121 (delta 112), pack-reused 20
Receiving objects: 98% (163/166)
Receiving objects: 99% (165/166)
Receiving objects: 100% (166/166)
Receiving objects: 100% (166/166), 284.87 KiB | 8.90 MiB/s, done.
Resolving deltas: 0% (0/117)
Resolving deltas: 1% (2/117)
Resolving deltas: 4% (5/117)
Resolving deltas: 5% (6/117)
Resolving deltas: 6% (8/117)
Resolving deltas: 7% (9/117)
Resolving deltas: 8% (10/117)
Resolving deltas: 9% (11/117)
Resolving deltas: 10% (12/117)
Resolving deltas: 11% (13/117)
Resolving deltas: 12% (15/117)
Resolving deltas: 13% (16/117)
Resolving deltas: 14% (17/117)
Resolving deltas: 15% (18/117)
Resolving deltas: 16% (19/117)
Resolving deltas: 17% (20/117)
Resolving deltas: 18% (22/117)
Resolving deltas: 19% (23/117)
Resolving deltas: 20% (24/117)
Resolving deltas: 21% (25/117)
Resolving deltas: 22% (26/117)
Resolving deltas: 23% (27/117)
Resolving deltas: 24% (29/117)
Resolving deltas: 25% (30/117)
Resolving deltas: 26% (31/117)
Resolving deltas: 27% (32/117)
Resolving deltas: 28% (33/117)
Resolving deltas: 29% (34/117)
Resolving deltas: 30% (36/117)
Resolving deltas: 31% (37/117)
Resolving deltas: 32% (38/117)
Resolving deltas: 33% (39/117)
Resolving deltas: 34% (40/117)
Resolving deltas: 35% (41/117)
Resolving deltas: 36% (43/117)
Resolving deltas: 37% (44/117)
Resolving deltas: 38% (45/117)
Resolving deltas: 39% (46/117)
Resolving deltas: 40% (47/117)
Resolving deltas: 41% (48/117)
Resolving deltas: 42% (50/117)
Resolving deltas: 43% (51/117)
Resolving deltas: 44% (52/117)
Resolving deltas: 45% (53/117)
Resolving deltas: 46% (54/117)
Resolving deltas: 47% (55/117)
Resolving deltas: 48% (57/117)
Resolving deltas: 49% (58/117)
Resolving deltas: 50% (59/117)
Resolving deltas: 51% (60/117)
Resolving deltas: 52% (61/117)
Resolving deltas: 53% (63/117)
Resolving deltas: 54% (64/117)
Resolving deltas: 55% (65/117)
Resolving deltas: 56% (66/117)
Resolving deltas: 57% (67/117)
Resolving deltas: 58% (68/117)
Resolving deltas: 59% (70/117)
Resolving deltas: 60% (71/117)
Resolving deltas: 61% (72/117)
Resolving deltas: 62% (73/117)
Resolving deltas: 63% (74/117)
Resolving deltas: 64% (75/117)
Resolving deltas: 65% (77/117)
Resolving deltas: 66% (78/117)
Resolving deltas: 67% (79/117)
Resolving deltas: 68% (80/117)
Resolving deltas: 69% (81/117)
Resolving deltas: 70% (82/117)
Resolving deltas: 71% (84/117)
Resolving deltas: 72% (85/117)
Resolving deltas: 73% (86/117)
Resolving deltas: 74% (87/117)
Resolving deltas: 75% (88/117)
Resolving deltas: 76% (89/117)
Resolving deltas: 77% (91/117)
Resolving deltas: 78% (92/117)
Resolving deltas: 79% (93/117)
Resolving deltas: 80% (94/117)
Resolving deltas: 81% (95/117)
Resolving deltas: 82% (96/117)
Resolving deltas: 83% (98/117)
Resolving deltas: 84% (99/117)
Resolving deltas: 85% (100/117)
Resolving deltas: 86% (101/117)
Resolving deltas: 87% (102/117)
Resolving deltas: 88% (103/117)
Resolving deltas: 89% (105/117)
Resolving deltas: 90% (106/117)
Resolving deltas: 91% (107/117)
Resolving deltas: 92% (108/117)
Resolving deltas: 93% (109/117)
Resolving deltas: 94% (110/117)
Resolving deltas: 95% (112/117)
Resolving deltas: 96% (113/117)
Resolving deltas: 97% (114/117)
Resolving deltas: 98% (115/117)
Resolving deltas: 99% (116/117)
Resolving deltas: 100% (117/117)
Resolving deltas: 100% (117/117), completed with 69 local objects.
From https://github.com/python/cpython
* branch main -> FETCH_HEAD
Note: switching to 'FETCH_HEAD'.
You are in 'detached HEAD' state. You can look around, make experimental
changes and commit them, and you can discard any commits you make in this
state without impacting any branches by switching back to a branch.
If you want to create a new branch to retain commits you create, you may
do so (now or later) by using -c with the switch command. Example:
git switch -c <new-branch-name>
Or undo this operation with:
git switch -
Turn off this advice by setting config variable advice.detachedHead to false
HEAD is now at e91ef13861 gh-122029: Log call events in sys.setprofile when it's a method with c function (GH-122072)
Switched to and reset branch 'main'
configure: WARNING: no system libmpdecimal found; falling back to bundled libmpdecimal (deprecated and scheduled for removal in Python 3.15)
/tmp/ccppofi4.s: Assembler messages:
/tmp/ccppofi4.s: Fatal error: can't write 3947 bytes to section .debug_info of Python/frame.o: 'No space left on device'
/tmp/ccppofi4.s: Fatal error: Python/frame.o: No such file or directory
make: *** [Makefile:3059: Python/frame.o] Error 1
make: *** Waiting for unfinished jobs....
Assembler messages:
Fatal error: can't create Python/crossinterp.o: No space left on device
make: *** [Makefile:3059: Python/crossinterp.o] Error 1
/tmp/ccIlNriX.s: Assembler messages:
/tmp/ccIlNriX.s: Fatal error: can't write 220 bytes to section .text of Objects/typeobject.o: 'No space left on device'
/tmp/ccIlNriX.s: Fatal error: Objects/typeobject.o: No such file or directory
make: *** [Makefile:3059: Objects/typeobject.o] Error 1
Assembler messages:
Fatal error: can't create Python/future.o: No space left on device
make: *** [Makefile:3059: Python/future.o] Error 1
Assembler messages:
Fatal error: can't create Python/frozenmain.o: No space left on device
make: *** [Makefile:3059: Python/frozenmain.o] Error 1
Assembler messages:
Fatal error: can't create Python/compile.o: No space left on device
make: *** [Makefile:3059: Python/compile.o] Error 1
Assembler messages:
Fatal error: can't create Parser/parser.o: No space left on device
make: *** [Makefile:3059: Parser/parser.o] Error 1
Assembler messages:
Fatal error: can't create Python/ceval.o: No space left on device
make: *** [Makefile:3059: Python/ceval.o] Error 1
Assembler messages:
Fatal error: can't create Objects/unicodeobject.o: No space left on device
make: *** [Makefile:3059: Objects/unicodeobject.o] Error 1
Assembler messages:
Fatal error: can't create Python/Python-ast.o: No space left on device
make: *** [Makefile:3059: Python/Python-ast.o] Error 1
find: ‘build’: No such file or directory
find: ‘build’: No such file or directory
find: ‘build’: No such file or directory
find: ‘build’: No such file or directory
make: [Makefile:3150: clean-retain-profile] Error 1 (ignored)
Test report
===========
Sincerely,
-The Buildbot
1
0
☠ Buildbot (Python): - failed test (failure) (timed out) (9e9c71d09e68b42fd1b251af6e4bfde697fe9b57)
by buildbot@python.org July 24, 2024
by buildbot@python.org July 24, 2024
July 24, 2024
The Buildbot has detected a new failure on builder AMD64 Fedora Rawhide NoGIL refleaks 3.9 while building Python.
Full details are available at:
https://buildbot.python.org/#/builders/1530/builds/62
Buildbot URL: https://buildbot.python.org/
Worker for this Build: cstratak-fedora-rawhide-x86_64
Build Reason: <unknown>
Blamelist:
BUILD FAILED: failed test (failure) (timed out)
Summary of the results of the build (if available):
===================================================
==
Captured traceback
==================
Traceback (most recent call last):
File "/home/buildbot/buildarea/3.9.cstratak-fedora-rawhide-x86_64.refleak.nogil/build/Lib/multiprocessing/resource_tracker.py", line 201, in main
cache[rtype].remove(name)
KeyError: '/psm_c0ef993f'
.Traceback (most recent call last):
File "/home/buildbot/buildarea/3.9.cstratak-fedora-rawhide-x86_64.refleak.nogil/build/Lib/multiprocessing/resource_tracker.py", line 201, in main
cache[rtype].remove(name)
KeyError: '/psm_7dd4a196'
.Traceback (most recent call last):
File "/home/buildbot/buildarea/3.9.cstratak-fedora-rawhide-x86_64.refleak.nogil/build/Lib/multiprocessing/resource_tracker.py", line 201, in main
cache[rtype].remove(name)
KeyError: '/psm_878344f3'
.Traceback (most recent call last):
File "/home/buildbot/buildarea/3.9.cstratak-fedora-rawhide-x86_64.refleak.nogil/build/Lib/multiprocessing/resource_tracker.py", line 201, in main
cache[rtype].remove(name)
KeyError: '/psm_273a6cdb'
.Traceback (most recent call last):
File "/home/buildbot/buildarea/3.9.cstratak-fedora-rawhide-x86_64.refleak.nogil/build/Lib/multiprocessing/resource_tracker.py", line 201, in main
cache[rtype].remove(name)
KeyError: '/psm_e26b67f9'
.Traceback (most recent call last):
File "/home/buildbot/buildarea/3.9.cstratak-fedora-rawhide-x86_64.refleak.nogil/build/Lib/multiprocessing/resource_tracker.py", line 201, in main
cache[rtype].remove(name)
KeyError: '/psm_724f1e88'
.
Traceback (most recent call last):
File "/home/buildbot/buildarea/3.9.cstratak-fedora-rawhide-x86_64.refleak.nogil/build/Lib/multiprocessing/resource_tracker.py", line 201, in main
cache[rtype].remove(name)
KeyError: '/psm_ba692d37'
.Traceback (most recent call last):
File "/home/buildbot/buildarea/3.9.cstratak-fedora-rawhide-x86_64.refleak.nogil/build/Lib/multiprocessing/resource_tracker.py", line 201, in main
cache[rtype].remove(name)
KeyError: '/psm_eff32445'
.Traceback (most recent call last):
File "/home/buildbot/buildarea/3.9.cstratak-fedora-rawhide-x86_64.refleak.nogil/build/Lib/multiprocessing/resource_tracker.py", line 201, in main
cache[rtype].remove(name)
KeyError: '/psm_e9ab0480'
.Traceback (most recent call last):
File "/home/buildbot/buildarea/3.9.cstratak-fedora-rawhide-x86_64.refleak.nogil/build/Lib/multiprocessing/resource_tracker.py", line 201, in main
cache[rtype].remove(name)
KeyError: '/psm_209a5644'
.
Traceback (most recent call last):
File "/home/buildbot/buildarea/3.9.cstratak-fedora-rawhide-x86_64.refleak.nogil/build/Lib/multiprocessing/util.py", line 300, in _run_finalizers
finalizer()
File "/home/buildbot/buildarea/3.9.cstratak-fedora-rawhide-x86_64.refleak.nogil/build/Lib/multiprocessing/util.py", line 224, in __call__
res = self._callback(*self._args, **self._kwargs)
File "/home/buildbot/buildarea/3.9.cstratak-fedora-rawhide-x86_64.refleak.nogil/build/Lib/multiprocessing/synchronize.py", line 87, in _cleanup
sem_unlink(name)
FileNotFoundError: [Errno 2] No such file or directory
Traceback (most recent call last):
File "/home/buildbot/buildarea/3.9.cstratak-fedora-rawhide-x86_64.refleak.nogil/build/Lib/multiprocessing/util.py", line 300, in _run_finalizers
finalizer()
File "/home/buildbot/buildarea/3.9.cstratak-fedora-rawhide-x86_64.refleak.nogil/build/Lib/multiprocessing/util.py", line 224, in __call__
res = self._callback(*self._args, **self._kwargs)
File "/home/buildbot/buildarea/3.9.cstratak-fedora-rawhide-x86_64.refleak.nogil/build/Lib/multiprocessing/synchronize.py", line 87, in _cleanup
sem_unlink(name)
FileNotFoundError: [Errno 2] No such file or directory
Traceback (most recent call last):
File "/home/buildbot/buildarea/3.9.cstratak-fedora-rawhide-x86_64.refleak.nogil/build/Lib/multiprocessing/util.py", line 300, in _run_finalizers
finalizer()
File "/home/buildbot/buildarea/3.9.cstratak-fedora-rawhide-x86_64.refleak.nogil/build/Lib/multiprocessing/util.py", line 224, in __call__
res = self._callback(*self._args, **self._kwargs)
File "/home/buildbot/buildarea/3.9.cstratak-fedora-rawhide-x86_64.refleak.nogil/build/Lib/multiprocessing/synchronize.py", line 87, in _cleanup
sem_unlink(name)
FileNotFoundError: [Errno 2] No such file or directory
Traceback (most recent call last):
File "/home/buildbot/buildarea/3.9.cstratak-fedora-rawhide-x86_64.refleak.nogil/build/Lib/multiprocessing/util.py", line 300, in _run_finalizers
finalizer()
File "/home/buildbot/buildarea/3.9.cstratak-fedora-rawhide-x86_64.refleak.nogil/build/Lib/multiprocessing/util.py", line 224, in __call__
res = self._callback(*self._args, **self._kwargs)
File "/home/buildbot/buildarea/3.9.cstratak-fedora-rawhide-x86_64.refleak.nogil/build/Lib/multiprocessing/synchronize.py", line 87, in _cleanup
sem_unlink(name)
FileNotFoundError: [Errno 2] No such file or directory
Traceback (most recent call last):
File "/home/buildbot/buildarea/3.9.cstratak-fedora-rawhide-x86_64.refleak.nogil/build/Lib/multiprocessing/util.py", line 300, in _run_finalizers
finalizer()
File "/home/buildbot/buildarea/3.9.cstratak-fedora-rawhide-x86_64.refleak.nogil/build/Lib/multiprocessing/util.py", line 224, in __call__
res = self._callback(*self._args, **self._kwargs)
File "/home/buildbot/buildarea/3.9.cstratak-fedora-rawhide-x86_64.refleak.nogil/build/Lib/multiprocessing/synchronize.py", line 87, in _cleanup
sem_unlink(name)
FileNotFoundError: [Errno 2] No such file or directory
Traceback (most recent call last):
File "/home/buildbot/buildarea/3.9.cstratak-fedora-rawhide-x86_64.refleak.nogil/build/Lib/multiprocessing/util.py", line 300, in _run_finalizers
finalizer()
File "/home/buildbot/buildarea/3.9.cstratak-fedora-rawhide-x86_64.refleak.nogil/build/Lib/multiprocessing/util.py", line 224, in __call__
res = self._callback(*self._args, **self._kwargs)
File "/home/buildbot/buildarea/3.9.cstratak-fedora-rawhide-x86_64.refleak.nogil/build/Lib/multiprocessing/synchronize.py", line 87, in _cleanup
sem_unlink(name)
FileNotFoundError: [Errno 2] No such file or directory
./home/buildbot/buildarea/3.9.cstratak-fedora-rawhide-x86_64.refleak.nogil/build/Lib/multiprocessing/resource_tracker.py:216: UserWarning: resource_tracker: There appear to be 6 leaked semaphore objects to clean up at shutdown
warnings.warn('resource_tracker: There appear to be %d '
Traceback (most recent call last):
File "/home/buildbot/buildarea/3.9.cstratak-fedora-rawhide-x86_64.refleak.nogil/build/Lib/multiprocessing/util.py", line 300, in _run_finalizers
finalizer()
File "/home/buildbot/buildarea/3.9.cstratak-fedora-rawhide-x86_64.refleak.nogil/build/Lib/multiprocessing/util.py", line 224, in __call__
res = self._callback(*self._args, **self._kwargs)
File "/home/buildbot/buildarea/3.9.cstratak-fedora-rawhide-x86_64.refleak.nogil/build/Lib/multiprocessing/synchronize.py", line 87, in _cleanup
sem_unlink(name)
FileNotFoundError: [Errno 2] No such file or directory
Traceback (most recent call last):
File "/home/buildbot/buildarea/3.9.cstratak-fedora-rawhide-x86_64.refleak.nogil/build/Lib/multiprocessing/util.py", line 300, in _run_finalizers
finalizer()
File "/home/buildbot/buildarea/3.9.cstratak-fedora-rawhide-x86_64.refleak.nogil/build/Lib/multiprocessing/util.py", line 224, in __call__
res = self._callback(*self._args, **self._kwargs)
File "/home/buildbot/buildarea/3.9.cstratak-fedora-rawhide-x86_64.refleak.nogil/build/Lib/multiprocessing/synchronize.py", line 87, in _cleanup
sem_unlink(name)
FileNotFoundError: [Errno 2] No such file or directory
Traceback (most recent call last):
File "/home/buildbot/buildarea/3.9.cstratak-fedora-rawhide-x86_64.refleak.nogil/build/Lib/multiprocessing/util.py", line 300, in _run_finalizers
finalizer()
File "/home/buildbot/buildarea/3.9.cstratak-fedora-rawhide-x86_64.refleak.nogil/build/Lib/multiprocessing/util.py", line 224, in __call__
res = self._callback(*self._args, **self._kwargs)
File "/home/buildbot/buildarea/3.9.cstratak-fedora-rawhide-x86_64.refleak.nogil/build/Lib/multiprocessing/synchronize.py", line 87, in _cleanup
sem_unlink(name)
FileNotFoundError: [Errno 2] No such file or directory
Traceback (most recent call last):
File "/home/buildbot/buildarea/3.9.cstratak-fedora-rawhide-x86_64.refleak.nogil/build/Lib/multiprocessing/util.py", line 300, in _run_finalizers
finalizer()
File "/home/buildbot/buildarea/3.9.cstratak-fedora-rawhide-x86_64.refleak.nogil/build/Lib/multiprocessing/util.py", line 224, in __call__
res = self._callback(*self._args, **self._kwargs)
File "/home/buildbot/buildarea/3.9.cstratak-fedora-rawhide-x86_64.refleak.nogil/build/Lib/multiprocessing/synchronize.py", line 87, in _cleanup
sem_unlink(name)
FileNotFoundError: [Errno 2] No such file or directory
Traceback (most recent call last):
File "/home/buildbot/buildarea/3.9.cstratak-fedora-rawhide-x86_64.refleak.nogil/build/Lib/multiprocessing/util.py", line 300, in _run_finalizers
finalizer()
File "/home/buildbot/buildarea/3.9.cstratak-fedora-rawhide-x86_64.refleak.nogil/build/Lib/multiprocessing/util.py", line 224, in __call__
res = self._callback(*self._args, **self._kwargs)
File "/home/buildbot/buildarea/3.9.cstratak-fedora-rawhide-x86_64.refleak.nogil/build/Lib/multiprocessing/synchronize.py", line 87, in _cleanup
sem_unlink(name)
FileNotFoundError: [Errno 2] No such file or directory
Traceback (most recent call last):
File "/home/buildbot/buildarea/3.9.cstratak-fedora-rawhide-x86_64.refleak.nogil/build/Lib/multiprocessing/util.py", line 300, in _run_finalizers
finalizer()
File "/home/buildbot/buildarea/3.9.cstratak-fedora-rawhide-x86_64.refleak.nogil/build/Lib/multiprocessing/util.py", line 224, in __call__
res = self._callback(*self._args, **self._kwargs)
File "/home/buildbot/buildarea/3.9.cstratak-fedora-rawhide-x86_64.refleak.nogil/build/Lib/multiprocessing/synchronize.py", line 87, in _cleanup
sem_unlink(name)
FileNotFoundError: [Errno 2] No such file or directory
./home/buildbot/buildarea/3.9.cstratak-fedora-rawhide-x86_64.refleak.nogil/build/Lib/multiprocessing/resource_tracker.py:216: UserWarning: resource_tracker: There appear to be 6 leaked semaphore objects to clean up at shutdown
warnings.warn('resource_tracker: There appear to be %d '
Traceback (most recent call last):
File "/home/buildbot/buildarea/3.9.cstratak-fedora-rawhide-x86_64.refleak.nogil/build/Lib/multiprocessing/util.py", line 300, in _run_finalizers
finalizer()
File "/home/buildbot/buildarea/3.9.cstratak-fedora-rawhide-x86_64.refleak.nogil/build/Lib/multiprocessing/util.py", line 224, in __call__
res = self._callback(*self._args, **self._kwargs)
File "/home/buildbot/buildarea/3.9.cstratak-fedora-rawhide-x86_64.refleak.nogil/build/Lib/multiprocessing/synchronize.py", line 87, in _cleanup
sem_unlink(name)
FileNotFoundError: [Errno 2] No such file or directory
Traceback (most recent call last):
File "/home/buildbot/buildarea/3.9.cstratak-fedora-rawhide-x86_64.refleak.nogil/build/Lib/multiprocessing/util.py", line 300, in _run_finalizers
finalizer()
File "/home/buildbot/buildarea/3.9.cstratak-fedora-rawhide-x86_64.refleak.nogil/build/Lib/multiprocessing/util.py", line 224, in __call__
res = self._callback(*self._args, **self._kwargs)
File "/home/buildbot/buildarea/3.9.cstratak-fedora-rawhide-x86_64.refleak.nogil/build/Lib/multiprocessing/synchronize.py", line 87, in _cleanup
sem_unlink(name)
FileNotFoundError: [Errno 2] No such file or directory
Traceback (most recent call last):
File "/home/buildbot/buildarea/3.9.cstratak-fedora-rawhide-x86_64.refleak.nogil/build/Lib/multiprocessing/util.py", line 300, in _run_finalizers
finalizer()
File "/home/buildbot/buildarea/3.9.cstratak-fedora-rawhide-x86_64.refleak.nogil/build/Lib/multiprocessing/util.py", line 224, in __call__
res = self._callback(*self._args, **self._kwargs)
File "/home/buildbot/buildarea/3.9.cstratak-fedora-rawhide-x86_64.refleak.nogil/build/Lib/multiprocessing/synchronize.py", line 87, in _cleanup
sem_unlink(name)
FileNotFoundError: [Errno 2] No such file or directory
Traceback (most recent call last):
File "/home/buildbot/buildarea/3.9.cstratak-fedora-rawhide-x86_64.refleak.nogil/build/Lib/multiprocessing/util.py", line 300, in _run_finalizers
finalizer()
File "/home/buildbot/buildarea/3.9.cstratak-fedora-rawhide-x86_64.refleak.nogil/build/Lib/multiprocessing/util.py", line 224, in __call__
res = self._callback(*self._args, **self._kwargs)
File "/home/buildbot/buildarea/3.9.cstratak-fedora-rawhide-x86_64.refleak.nogil/build/Lib/multiprocessing/synchronize.py", line 87, in _cleanup
sem_unlink(name)
FileNotFoundError: [Errno 2] No such file or directory
Traceback (most recent call last):
File "/home/buildbot/buildarea/3.9.cstratak-fedora-rawhide-x86_64.refleak.nogil/build/Lib/multiprocessing/util.py", line 300, in _run_finalizers
finalizer()
File "/home/buildbot/buildarea/3.9.cstratak-fedora-rawhide-x86_64.refleak.nogil/build/Lib/multiprocessing/util.py", line 224, in __call__
res = self._callback(*self._args, **self._kwargs)
File "/home/buildbot/buildarea/3.9.cstratak-fedora-rawhide-x86_64.refleak.nogil/build/Lib/multiprocessing/synchronize.py", line 87, in _cleanup
sem_unlink(name)
FileNotFoundError: [Errno 2] No such file or directory
Traceback (most recent call last):
File "/home/buildbot/buildarea/3.9.cstratak-fedora-rawhide-x86_64.refleak.nogil/build/Lib/multiprocessing/util.py", line 300, in _run_finalizers
finalizer()
File "/home/buildbot/buildarea/3.9.cstratak-fedora-rawhide-x86_64.refleak.nogil/build/Lib/multiprocessing/util.py", line 224, in __call__
res = self._callback(*self._args, **self._kwargs)
File "/home/buildbot/buildarea/3.9.cstratak-fedora-rawhide-x86_64.refleak.nogil/build/Lib/multiprocessing/synchronize.py", line 87, in _cleanup
sem_unlink(name)
FileNotFoundError: [Errno 2] No such file or directory
./home/buildbot/buildarea/3.9.cstratak-fedora-rawhide-x86_64.refleak.nogil/build/Lib/multiprocessing/resource_tracker.py:216: UserWarning: resource_tracker: There appear to be 6 leaked semaphore objects to clean up at shutdown
warnings.warn('resource_tracker: There appear to be %d '
Traceback (most recent call last):
File "/home/buildbot/buildarea/3.9.cstratak-fedora-rawhide-x86_64.refleak.nogil/build/Lib/multiprocessing/util.py", line 300, in _run_finalizers
finalizer()
File "/home/buildbot/buildarea/3.9.cstratak-fedora-rawhide-x86_64.refleak.nogil/build/Lib/multiprocessing/util.py", line 224, in __call__
res = self._callback(*self._args, **self._kwargs)
File "/home/buildbot/buildarea/3.9.cstratak-fedora-rawhide-x86_64.refleak.nogil/build/Lib/multiprocessing/synchronize.py", line 87, in _cleanup
sem_unlink(name)
FileNotFoundError: [Errno 2] No such file or directory
Traceback (most recent call last):
File "/home/buildbot/buildarea/3.9.cstratak-fedora-rawhide-x86_64.refleak.nogil/build/Lib/multiprocessing/util.py", line 300, in _run_finalizers
finalizer()
File "/home/buildbot/buildarea/3.9.cstratak-fedora-rawhide-x86_64.refleak.nogil/build/Lib/multiprocessing/util.py", line 224, in __call__
res = self._callback(*self._args, **self._kwargs)
File "/home/buildbot/buildarea/3.9.cstratak-fedora-rawhide-x86_64.refleak.nogil/build/Lib/multiprocessing/synchronize.py", line 87, in _cleanup
sem_unlink(name)
FileNotFoundError: [Errno 2] No such file or directory
Traceback (most recent call last):
File "/home/buildbot/buildarea/3.9.cstratak-fedora-rawhide-x86_64.refleak.nogil/build/Lib/multiprocessing/util.py", line 300, in _run_finalizers
finalizer()
File "/home/buildbot/buildarea/3.9.cstratak-fedora-rawhide-x86_64.refleak.nogil/build/Lib/multiprocessing/util.py", line 224, in __call__
res = self._callback(*self._args, **self._kwargs)
File "/home/buildbot/buildarea/3.9.cstratak-fedora-rawhide-x86_64.refleak.nogil/build/Lib/multiprocessing/synchronize.py", line 87, in _cleanup
sem_unlink(name)
FileNotFoundError: [Errno 2] No such file or directory
Traceback (most recent call last):
File "/home/buildbot/buildarea/3.9.cstratak-fedora-rawhide-x86_64.refleak.nogil/build/Lib/multiprocessing/util.py", line 300, in _run_finalizers
finalizer()
File "/home/buildbot/buildarea/3.9.cstratak-fedora-rawhide-x86_64.refleak.nogil/build/Lib/multiprocessing/util.py", line 224, in __call__
res = self._callback(*self._args, **self._kwargs)
File "/home/buildbot/buildarea/3.9.cstratak-fedora-rawhide-x86_64.refleak.nogil/build/Lib/multiprocessing/synchronize.py", line 87, in _cleanup
sem_unlink(name)
FileNotFoundError: [Errno 2] No such file or directory
Traceback (most recent call last):
File "/home/buildbot/buildarea/3.9.cstratak-fedora-rawhide-x86_64.refleak.nogil/build/Lib/multiprocessing/util.py", line 300, in _run_finalizers
finalizer()
File "/home/buildbot/buildarea/3.9.cstratak-fedora-rawhide-x86_64.refleak.nogil/build/Lib/multiprocessing/util.py", line 224, in __call__
res = self._callback(*self._args, **self._kwargs)
File "/home/buildbot/buildarea/3.9.cstratak-fedora-rawhide-x86_64.refleak.nogil/build/Lib/multiprocessing/synchronize.py", line 87, in _cleanup
sem_unlink(name)
FileNotFoundError: [Errno 2] No such file or directory
Traceback (most recent call last):
File "/home/buildbot/buildarea/3.9.cstratak-fedora-rawhide-x86_64.refleak.nogil/build/Lib/multiprocessing/util.py", line 300, in _run_finalizers
finalizer()
File "/home/buildbot/buildarea/3.9.cstratak-fedora-rawhide-x86_64.refleak.nogil/build/Lib/multiprocessing/util.py", line 224, in __call__
res = self._callback(*self._args, **self._kwargs)
File "/home/buildbot/buildarea/3.9.cstratak-fedora-rawhide-x86_64.refleak.nogil/build/Lib/multiprocessing/synchronize.py", line 87, in _cleanup
sem_unlink(name)
FileNotFoundError: [Errno 2] No such file or directory
./home/buildbot/buildarea/3.9.cstratak-fedora-rawhide-x86_64.refleak.nogil/build/Lib/multiprocessing/resource_tracker.py:216: UserWarning: resource_tracker: There appear to be 6 leaked semaphore objects to clean up at shutdown
warnings.warn('resource_tracker: There appear to be %d '
Traceback (most recent call last):
File "/home/buildbot/buildarea/3.9.cstratak-fedora-rawhide-x86_64.refleak.nogil/build/Lib/multiprocessing/util.py", line 300, in _run_finalizers
finalizer()
File "/home/buildbot/buildarea/3.9.cstratak-fedora-rawhide-x86_64.refleak.nogil/build/Lib/multiprocessing/util.py", line 224, in __call__
res = self._callback(*self._args, **self._kwargs)
File "/home/buildbot/buildarea/3.9.cstratak-fedora-rawhide-x86_64.refleak.nogil/build/Lib/multiprocessing/synchronize.py", line 87, in _cleanup
sem_unlink(name)
FileNotFoundError: [Errno 2] No such file or directory
Traceback (most recent call last):
File "/home/buildbot/buildarea/3.9.cstratak-fedora-rawhide-x86_64.refleak.nogil/build/Lib/multiprocessing/util.py", line 300, in _run_finalizers
finalizer()
File "/home/buildbot/buildarea/3.9.cstratak-fedora-rawhide-x86_64.refleak.nogil/build/Lib/multiprocessing/util.py", line 224, in __call__
res = self._callback(*self._args, **self._kwargs)
File "/home/buildbot/buildarea/3.9.cstratak-fedora-rawhide-x86_64.refleak.nogil/build/Lib/multiprocessing/synchronize.py", line 87, in _cleanup
sem_unlink(name)
FileNotFoundError: [Errno 2] No such file or directory
Traceback (most recent call last):
File "/home/buildbot/buildarea/3.9.cstratak-fedora-rawhide-x86_64.refleak.nogil/build/Lib/multiprocessing/util.py", line 300, in _run_finalizers
finalizer()
File "/home/buildbot/buildarea/3.9.cstratak-fedora-rawhide-x86_64.refleak.nogil/build/Lib/multiprocessing/util.py", line 224, in __call__
res = self._callback(*self._args, **self._kwargs)
File "/home/buildbot/buildarea/3.9.cstratak-fedora-rawhide-x86_64.refleak.nogil/build/Lib/multiprocessing/synchronize.py", line 87, in _cleanup
sem_unlink(name)
FileNotFoundError: [Errno 2] No such file or directory
Traceback (most recent call last):
File "/home/buildbot/buildarea/3.9.cstratak-fedora-rawhide-x86_64.refleak.nogil/build/Lib/multiprocessing/util.py", line 300, in _run_finalizers
finalizer()
File "/home/buildbot/buildarea/3.9.cstratak-fedora-rawhide-x86_64.refleak.nogil/build/Lib/multiprocessing/util.py", line 224, in __call__
res = self._callback(*self._args, **self._kwargs)
File "/home/buildbot/buildarea/3.9.cstratak-fedora-rawhide-x86_64.refleak.nogil/build/Lib/multiprocessing/synchronize.py", line 87, in _cleanup
sem_unlink(name)
FileNotFoundError: [Errno 2] No such file or directory
Traceback (most recent call last):
File "/home/buildbot/buildarea/3.9.cstratak-fedora-rawhide-x86_64.refleak.nogil/build/Lib/multiprocessing/util.py", line 300, in _run_finalizers
finalizer()
File "/home/buildbot/buildarea/3.9.cstratak-fedora-rawhide-x86_64.refleak.nogil/build/Lib/multiprocessing/util.py", line 224, in __call__
res = self._callback(*self._args, **self._kwargs)
File "/home/buildbot/buildarea/3.9.cstratak-fedora-rawhide-x86_64.refleak.nogil/build/Lib/multiprocessing/synchronize.py", line 87, in _cleanup
sem_unlink(name)
FileNotFoundError: [Errno 2] No such file or directory
Traceback (most recent call last):
File "/home/buildbot/buildarea/3.9.cstratak-fedora-rawhide-x86_64.refleak.nogil/build/Lib/multiprocessing/util.py", line 300, in _run_finalizers
finalizer()
File "/home/buildbot/buildarea/3.9.cstratak-fedora-rawhide-x86_64.refleak.nogil/build/Lib/multiprocessing/util.py", line 224, in __call__
res = self._callback(*self._args, **self._kwargs)
File "/home/buildbot/buildarea/3.9.cstratak-fedora-rawhide-x86_64.refleak.nogil/build/Lib/multiprocessing/synchronize.py", line 87, in _cleanup
sem_unlink(name)
FileNotFoundError: [Errno 2] No such file or directory
./home/buildbot/buildarea/3.9.cstratak-fedora-rawhide-x86_64.refleak.nogil/build/Lib/multiprocessing/resource_tracker.py:216: UserWarning: resource_tracker: There appear to be 6 leaked semaphore objects to clean up at shutdown
warnings.warn('resource_tracker: There appear to be %d '
Traceback (most recent call last):
File "/home/buildbot/buildarea/3.9.cstratak-fedora-rawhide-x86_64.refleak.nogil/build/Lib/multiprocessing/util.py", line 300, in _run_finalizers
finalizer()
File "/home/buildbot/buildarea/3.9.cstratak-fedora-rawhide-x86_64.refleak.nogil/build/Lib/multiprocessing/util.py", line 224, in __call__
res = self._callback(*self._args, **self._kwargs)
File "/home/buildbot/buildarea/3.9.cstratak-fedora-rawhide-x86_64.refleak.nogil/build/Lib/multiprocessing/synchronize.py", line 87, in _cleanup
sem_unlink(name)
FileNotFoundError: [Errno 2] No such file or directory
Traceback (most recent call last):
File "/home/buildbot/buildarea/3.9.cstratak-fedora-rawhide-x86_64.refleak.nogil/build/Lib/multiprocessing/util.py", line 300, in _run_finalizers
finalizer()
File "/home/buildbot/buildarea/3.9.cstratak-fedora-rawhide-x86_64.refleak.nogil/build/Lib/multiprocessing/util.py", line 224, in __call__
res = self._callback(*self._args, **self._kwargs)
File "/home/buildbot/buildarea/3.9.cstratak-fedora-rawhide-x86_64.refleak.nogil/build/Lib/multiprocessing/synchronize.py", line 87, in _cleanup
sem_unlink(name)
FileNotFoundError: [Errno 2] No such file or directory
Traceback (most recent call last):
File "/home/buildbot/buildarea/3.9.cstratak-fedora-rawhide-x86_64.refleak.nogil/build/Lib/multiprocessing/util.py", line 300, in _run_finalizers
finalizer()
File "/home/buildbot/buildarea/3.9.cstratak-fedora-rawhide-x86_64.refleak.nogil/build/Lib/multiprocessing/util.py", line 224, in __call__
res = self._callback(*self._args, **self._kwargs)
File "/home/buildbot/buildarea/3.9.cstratak-fedora-rawhide-x86_64.refleak.nogil/build/Lib/multiprocessing/synchronize.py", line 87, in _cleanup
sem_unlink(name)
FileNotFoundError: [Errno 2] No such file or directory
Traceback (most recent call last):
File "/home/buildbot/buildarea/3.9.cstratak-fedora-rawhide-x86_64.refleak.nogil/build/Lib/multiprocessing/util.py", line 300, in _run_finalizers
finalizer()
File "/home/buildbot/buildarea/3.9.cstratak-fedora-rawhide-x86_64.refleak.nogil/build/Lib/multiprocessing/util.py", line 224, in __call__
res = self._callback(*self._args, **self._kwargs)
File "/home/buildbot/buildarea/3.9.cstratak-fedora-rawhide-x86_64.refleak.nogil/build/Lib/multiprocessing/synchronize.py", line 87, in _cleanup
sem_unlink(name)
FileNotFoundError: [Errno 2] No such file or directory
Traceback (most recent call last):
File "/home/buildbot/buildarea/3.9.cstratak-fedora-rawhide-x86_64.refleak.nogil/build/Lib/multiprocessing/util.py", line 300, in _run_finalizers
finalizer()
File "/home/buildbot/buildarea/3.9.cstratak-fedora-rawhide-x86_64.refleak.nogil/build/Lib/multiprocessing/util.py", line 224, in __call__
res = self._callback(*self._args, **self._kwargs)
File "/home/buildbot/buildarea/3.9.cstratak-fedora-rawhide-x86_64.refleak.nogil/build/Lib/multiprocessing/synchronize.py", line 87, in _cleanup
sem_unlink(name)
FileNotFoundError: [Errno 2] No such file or directory
Traceback (most recent call last):
File "/home/buildbot/buildarea/3.9.cstratak-fedora-rawhide-x86_64.refleak.nogil/build/Lib/multiprocessing/util.py", line 300, in _run_finalizers
finalizer()
File "/home/buildbot/buildarea/3.9.cstratak-fedora-rawhide-x86_64.refleak.nogil/build/Lib/multiprocessing/util.py", line 224, in __call__
res = self._callback(*self._args, **self._kwargs)
File "/home/buildbot/buildarea/3.9.cstratak-fedora-rawhide-x86_64.refleak.nogil/build/Lib/multiprocessing/synchronize.py", line 87, in _cleanup
sem_unlink(name)
FileNotFoundError: [Errno 2] No such file or directory
.
Traceback (most recent call last):
File "/home/buildbot/buildarea/3.9.cstratak-fedora-rawhide-x86_64.refleak.nogil/build/Lib/multiprocessing/resource_tracker.py", line 201, in main
cache[rtype].remove(name)
KeyError: '/psm_3febf29b'
.Traceback (most recent call last):
File "/home/buildbot/buildarea/3.9.cstratak-fedora-rawhide-x86_64.refleak.nogil/build/Lib/multiprocessing/resource_tracker.py", line 201, in main
cache[rtype].remove(name)
KeyError: '/psm_880a0505'
.Traceback (most recent call last):
File "/home/buildbot/buildarea/3.9.cstratak-fedora-rawhide-x86_64.refleak.nogil/build/Lib/multiprocessing/resource_tracker.py", line 201, in main
cache[rtype].remove(name)
KeyError: '/psm_e2b1a433'
.Traceback (most recent call last):
File "/home/buildbot/buildarea/3.9.cstratak-fedora-rawhide-x86_64.refleak.nogil/build/Lib/multiprocessing/resource_tracker.py", line 201, in main
cache[rtype].remove(name)
KeyError: '/psm_d1f580bc'
..Traceback (most recent call last):
File "/home/buildbot/buildarea/3.9.cstratak-fedora-rawhide-x86_64.refleak.nogil/build/Lib/multiprocessing/resource_tracker.py", line 201, in main
cache[rtype].remove(name)
KeyError: '/psm_7a6fb119'
.
Test report
===========
Failed tests:
- test_socket
Sincerely,
-The BuildbotThe Buildbot has detected a new failure on builder PPC64LE Fedora Rawhide Refleaks 3.9 while building Python.
Full details are available at:
https://buildbot.python.org/#/builders/147/builds/1180
Buildbot URL: https://buildbot.python.org/
Worker for this Build: cstratak-fedora-rawhide-ppc64le
Build Reason: <unknown>
Blamelist:
BUILD FAILED: failed compile (failure)
Summary of the results of the build (if available):
===================================================
Captured traceback
==================
From https://github.com/python/cpython
* branch 3.9 -> FETCH_HEAD
Note: switching to 'FETCH_HEAD'.
You are in 'detached HEAD' state. You can look around, make experimental
changes and commit them, and you can discard any commits you make in this
state without impacting any branches by switching back to a branch.
If you want to create a new branch to retain commits you create, you may
do so (now or later) by using -c with the switch command. Example:
git switch -c <new-branch-name>
Or undo this operation with:
git switch -
Turn off this advice by setting config variable advice.detachedHead to false
HEAD is now at 9e9c71d09e [3.9] gh-121957: Emit audit events for python -i and python -m asyncio (GH-122120)
Switched to and reset branch '3.9'
Objects/longobject.c: In function ‘long_format_binary’:
Objects/longobject.c:2058:13: warning: ‘kind’ may be used uninitialized [-Wmaybe-uninitialized]
2058 | else if (kind == PyUnicode_1BYTE_KIND) {
| ^
Objects/longobject.c:1934:25: note: ‘kind’ was declared here
1934 | enum PyUnicode_Kind kind;
| ^~~~
Objects/longobject.c: In function ‘long_to_decimal_string_internal’:
Objects/longobject.c:1881:13: warning: ‘kind’ may be used uninitialized [-Wmaybe-uninitialized]
1881 | else if (kind == PyUnicode_1BYTE_KIND) {
| ^
Objects/longobject.c:1716:25: note: ‘kind’ was declared here
1716 | enum PyUnicode_Kind kind;
| ^~~~
./Modules/signalmodule.c: In function ‘signal_siginterrupt_impl’:
./Modules/signalmodule.c:663:5: warning: ‘siginterrupt’ is deprecated: Use sigaction with SA_RESTART instead [-Wdeprecated-declarations]
663 | if (siginterrupt(signalnum, flag)<0) {
| ^~
In file included from ./Modules/signalmodule.c:28:
/usr/include/signal.h:324:12: note: declared here
324 | extern int siginterrupt (int __sig, int __interrupt) __THROW
| ^~~~~~~~~~~~
./Modules/_threadmodule.c: In function ‘local_clear’:
./Modules/_threadmodule.c:812:20: warning: unused variable ‘tstate’ [-Wunused-variable]
812 | PyThreadState *tstate;
| ^~~~~~
/tmp/ccaogyaH.s: Assembler messages:
/tmp/ccaogyaH.s: Fatal error: can't write 3947 bytes to section .debug_info of Objects/unicodeobject.o: 'No space left on device'
/tmp/ccaogyaH.s: Fatal error: Objects/unicodeobject.o: No such file or directory
make: *** [Makefile:1803: Objects/unicodeobject.o] Error 1
make: *** Waiting for unfinished jobs....
/tmp/ccAaeCBp.s: Assembler messages:
/tmp/ccAaeCBp.s: Fatal error: can't write 387 bytes to section .rodata of Modules/posixmodule.o: 'No space left on device'
/tmp/ccAaeCBp.s: Fatal error: Modules/posixmodule.o: No such file or directory
make: *** [Makefile:2003: Modules/posixmodule.o] Error 1
find: ‘build’: No such file or directory
find: ‘build’: No such file or directory
find: ‘build’: No such file or directory
find: ‘build’: No such file or directory
make: [Makefile:1888: clean-retain-profile] Error 1 (ignored)
Test report
===========
Sincerely,
-The BuildbotThe Buildbot has detected a new failure on builder PPC64LE Fedora Rawhide NoGIL refleaks 3.9 while building Python.
Full details are available at:
https://buildbot.python.org/#/builders/1545/builds/58
Buildbot URL: https://buildbot.python.org/
Worker for this Build: cstratak-fedora-rawhide-ppc64le
Build Reason: <unknown>
Blamelist:
BUILD FAILED: failed compile (failure)
Summary of the results of the build (if available):
===================================================
Captured traceback
==================
From https://github.com/python/cpython
* branch 3.9 -> FETCH_HEAD
Note: switching to 'FETCH_HEAD'.
You are in 'detached HEAD' state. You can look around, make experimental
changes and commit them, and you can discard any commits you make in this
state without impacting any branches by switching back to a branch.
If you want to create a new branch to retain commits you create, you may
do so (now or later) by using -c with the switch command. Example:
git switch -c <new-branch-name>
Or undo this operation with:
git switch -
Turn off this advice by setting config variable advice.detachedHead to false
HEAD is now at 9e9c71d09e [3.9] gh-121957: Emit audit events for python -i and python -m asyncio (GH-122120)
Switched to and reset branch '3.9'
configure: WARNING: unrecognized options: --disable-gil
configure: WARNING: unrecognized options: --disable-gil
Objects/longobject.c: In function ‘long_format_binary’:
Objects/longobject.c:2058:13: warning: ‘kind’ may be used uninitialized [-Wmaybe-uninitialized]
2058 | else if (kind == PyUnicode_1BYTE_KIND) {
| ^
Objects/longobject.c:1934:25: note: ‘kind’ was declared here
1934 | enum PyUnicode_Kind kind;
| ^~~~
Objects/longobject.c: In function ‘long_to_decimal_string_internal’:
Objects/longobject.c:1881:13: warning: ‘kind’ may be used uninitialized [-Wmaybe-uninitialized]
1881 | else if (kind == PyUnicode_1BYTE_KIND) {
| ^
Objects/longobject.c:1716:25: note: ‘kind’ was declared here
1716 | enum PyUnicode_Kind kind;
| ^~~~
./Modules/signalmodule.c: In function ‘signal_siginterrupt_impl’:
./Modules/signalmodule.c:663:5: warning: ‘siginterrupt’ is deprecated: Use sigaction with SA_RESTART instead [-Wdeprecated-declarations]
663 | if (siginterrupt(signalnum, flag)<0) {
| ^~
In file included from ./Modules/signalmodule.c:28:
/usr/include/signal.h:324:12: note: declared here
324 | extern int siginterrupt (int __sig, int __interrupt) __THROW
| ^~~~~~~~~~~~
./Modules/_threadmodule.c: In function ‘local_clear’:
./Modules/_threadmodule.c:812:20: warning: unused variable ‘tstate’ [-Wunused-variable]
812 | PyThreadState *tstate;
| ^~~~~~
/tmp/ccCPPLdP.s: Assembler messages:
/tmp/ccCPPLdP.s: Fatal error: can't write 644 bytes to section .text of Objects/unicodeobject.o: 'No space left on device'
/tmp/ccCPPLdP.s: Fatal error: Objects/unicodeobject.o: No such file or directory
make: *** [Makefile:1803: Objects/unicodeobject.o] Error 1
make: *** Waiting for unfinished jobs....
/tmp/ccyfgF8t.s: Assembler messages:
/tmp/ccyfgF8t.s: Fatal error: can't write 3945 bytes to section .debug_info of Modules/posixmodule.o: 'No space left on device'
/tmp/ccyfgF8t.s: Fatal error: Modules/posixmodule.o: No such file or directory
make: *** [Makefile:2003: Modules/posixmodule.o] Error 1
find: ‘build’: No such file or directory
find: ‘build’: No such file or directory
find: ‘build’: No such file or directory
find: ‘build’: No such file or directory
make: [Makefile:1888: clean-retain-profile] Error 1 (ignored)
Test report
===========
Sincerely,
-The Buildbot
1
0