Buildbot-status
Threads by month
- ----- 2026 -----
- September
- August
- July
- June
- May
- April
- March
- February
- January
- ----- 2025 -----
- December
- November
- October
- September
- August
- July
- June
- May
- April
- March
- February
- January
- ----- 2024 -----
- December
- November
- October
- September
- August
- July
- June
- May
- April
- March
- February
- January
- ----- 2023 -----
- December
- November
- October
- September
- August
- July
- June
- May
- April
- March
- February
- January
- ----- 2022 -----
- December
- November
- October
- September
- August
- July
- June
- May
- April
- March
- February
- January
- ----- 2021 -----
- December
- November
- October
- September
- August
- July
- June
- May
- April
- March
- February
- January
- ----- 2020 -----
- December
- November
- October
- September
- August
- July
- June
- May
- April
- March
- February
- January
- ----- 2019 -----
- December
- November
- October
- September
- August
- July
- June
- May
- April
- March
- February
- January
- ----- 2018 -----
- December
- November
- October
- September
- August
- July
- June
- May
- April
- March
- February
- January
- ----- 2017 -----
- December
- November
- October
- September
- August
- July
- June
- May
September 2024
- 1 participants
- 159 discussions
☠ Buildbot (Python): python/cpython - failed test (failure) (timed out) (3.12)
by buildbot@python.org Sept. 24, 2024
by buildbot@python.org Sept. 24, 2024
Sept. 24, 2024
The Buildbot has detected a new failure on builder AMD64 Windows11 Refleaks 3.12 while building python/cpython.
Full details are available at:
https://buildbot.python.org/#/builders/1103/builds/523
Buildbot URL: https://buildbot.python.org/
Worker for this Build: ware-win11
Build Reason: <unknown>
Blamelist: Jason R. Coombs <jaraco(a)jaraco.com>, Miss Islington (bot) <31488909+miss-islington(a)users.noreply.github.com>
BUILD FAILED: failed test (failure) (timed out)
Summary of the results of the build (if available):
===================================================
Captured traceback
==================
Traceback (most recent call last):
File "b:\uildarea\3.12.ware-win11.refleak\build\Lib\test\_test_multiprocessing.py", line 1512, in test_notify
self.assertReturnsIfImplemented(2, get_value, woken)
File "b:\uildarea\3.12.ware-win11.refleak\build\Lib\test\_test_multiprocessing.py", line 268, in assertReturnsIfImplemented
return self.assertEqual(value, res)
^^^^^^^^^^^^^^^^^^^^^^^^^^^^
AssertionError: 2 != 1
Test report
===========
Failed subtests:
- test_notify - test.test_multiprocessing_spawn.test_threads.WithThreadsTestCondition.test_notify
Sincerely,
-The Buildbot
1
0
☠ Buildbot (Python): python/cpython - failed test (failure) (main)
by buildbot@python.org Sept. 24, 2024
by buildbot@python.org Sept. 24, 2024
Sept. 24, 2024
The Buildbot has detected a new failure on builder AMD64 Windows Server 2022 NoGIL 3.x while building python/cpython.
Full details are available at:
https://buildbot.python.org/#/builders/1241/builds/3300
Buildbot URL: https://buildbot.python.org/
Worker for this Build: itamaro-win64-srv-22-aws
Build Reason: <unknown>
Blamelist: Savannah Ostrowski <savannahostrowski(a)gmail.com>, Victor Stinner <vstinner(a)python.org>, sobolevn <mail(a)sobolevn.me>
BUILD FAILED: failed test (failure)
Summary of the results of the build (if available):
===================================================
==
Captured traceback
==================
Traceback (most recent call last):
File "C:\Users\Administrator\buildarea\3.x.itamaro-win64-srv-22-aws.x64.nogil\build\Lib\test\_test_multiprocessing.py", line 5186, in test_wait_integer
self.assertTrue(sem.acquire(timeout=20))
~~~~~~~~~~~~~~~^^^^^^^^^^^^^^^^^^^^^^^^^
AssertionError: False is not true
Traceback (most recent call last):
File "C:\Users\Administrator\buildarea\3.x.itamaro-win64-srv-22-aws.x64.nogil\build\Lib\test\_test_multiprocessing.py", line 6045, in test_condition
self.run_worker(self._test_condition, o)
~~~~~~~~~~~~~~~^^^^^^^^^^^^^^^^^^^^^^^^^
File "C:\Users\Administrator\buildarea\3.x.itamaro-win64-srv-22-aws.x64.nogil\build\Lib\test\_test_multiprocessing.py", line 5990, in run_worker
self.wait_proc_exit()
~~~~~~~~~~~~~~~~~~~^^
File "C:\Users\Administrator\buildarea\3.x.itamaro-win64-srv-22-aws.x64.nogil\build\Lib\test\_test_multiprocessing.py", line 5972, in wait_proc_exit
join_process(self.proc)
~~~~~~~~~~~~^^^^^^^^^^^
File "C:\Users\Administrator\buildarea\3.x.itamaro-win64-srv-22-aws.x64.nogil\build\Lib\test\_test_multiprocessing.py", line 104, in join_process
threading_helper.join_thread(process)
~~~~~~~~~~~~~~~~~~~~~~~~~~~~^^^^^^^^^
File "C:\Users\Administrator\buildarea\3.x.itamaro-win64-srv-22-aws.x64.nogil\build\Lib\test\support\threading_helper.py", line 116, in join_thread
raise AssertionError(msg)
AssertionError: failed to join the thread in 30.0 seconds
Traceback (most recent call last):
File "<string>", line 1, in <module>
from multiprocessing.spawn import spawn_main; spawn_main(parent_pid=7424, pipe_handle=592)
~~~~~~~~~~^^^^^^^^^^^^^^^^^^^^^^^^^^^^^^^^^^
File "C:\Users\Administrator\buildarea\3.x.itamaro-win64-srv-22-aws.x64.nogil\build\Lib\multiprocessing\spawn.py", line 113, in spawn_main
new_handle = reduction.duplicate(pipe_handle,
source_process=source_process)
File "C:\Users\Administrator\buildarea\3.x.itamaro-win64-srv-22-aws.x64.nogil\build\Lib\multiprocessing\reduction.py", line 79, in duplicate
return _winapi.DuplicateHandle(
~~~~~~~~~~~~~~~~~~~~~~~^
source_process, handle, target_process,
^^^^^^^^^^^^^^^^^^^^^^^^^^^^^^^^^^^^^^^
0, inheritable, _winapi.DUPLICATE_SAME_ACCESS)
^^^^^^^^^^^^^^^^^^^^^^^^^^^^^^^^^^^^^^^^^^^^^^
PermissionError: [WinError 5] Access is denied
Traceback (most recent call last):
File "<string>", line 1, in <module>
from multiprocessing.spawn import spawn_main; spawn_main(parent_pid=7424, pipe_handle=564)
~~~~~~~~~~^^^^^^^^^^^^^^^^^^^^^^^^^^^^^^^^^^
File "C:\Users\Administrator\buildarea\3.x.itamaro-win64-srv-22-aws.x64.nogil\build\Lib\multiprocessing\spawn.py", line 113, in spawn_main
new_handle = reduction.duplicate(pipe_handle,
source_process=source_process)
File "C:\Users\Administrator\buildarea\3.x.itamaro-win64-srv-22-aws.x64.nogil\build\Lib\multiprocessing\reduction.py", line 79, in duplicate
return _winapi.DuplicateHandle(
~~~~~~~~~~~~~~~~~~~~~~~^
source_process, handle, target_process,
^^^^^^^^^^^^^^^^^^^^^^^^^^^^^^^^^^^^^^^
0, inheritable, _winapi.DUPLICATE_SAME_ACCESS)
^^^^^^^^^^^^^^^^^^^^^^^^^^^^^^^^^^^^^^^^^^^^^^
PermissionError: [WinError 5] Access is denied
Traceback (most recent call last):
File "<string>", line 1, in <module>
from multiprocessing.spawn import spawn_main; spawn_main(parent_pid=7424, pipe_handle=528)
~~~~~~~~~~^^^^^^^^^^^^^^^^^^^^^^^^^^^^^^^^^^
File "C:\Users\Administrator\buildarea\3.x.itamaro-win64-srv-22-aws.x64.nogil\build\Lib\multiprocessing\spawn.py", line 113, in spawn_main
new_handle = reduction.duplicate(pipe_handle,
source_process=source_process)
File "C:\Users\Administrator\buildarea\3.x.itamaro-win64-srv-22-aws.x64.nogil\build\Lib\multiprocessing\reduction.py", line 79, in duplicate
return _winapi.DuplicateHandle(
~~~~~~~~~~~~~~~~~~~~~~~^
source_process, handle, target_process,
^^^^^^^^^^^^^^^^^^^^^^^^^^^^^^^^^^^^^^^
0, inheritable, _winapi.DUPLICATE_SAME_ACCESS)
^^^^^^^^^^^^^^^^^^^^^^^^^^^^^^^^^^^^^^^^^^^^^^
PermissionError: [WinError 5] Access is denied
Traceback (most recent call last):
File "<string>", line 1, in <module>
from multiprocessing.spawn import spawn_main; spawn_main(parent_pid=7424, pipe_handle=524)
~~~~~~~~~~^^^^^^^^^^^^^^^^^^^^^^^^^^^^^^^^^^
File "C:\Users\Administrator\buildarea\3.x.itamaro-win64-srv-22-aws.x64.nogil\build\Lib\multiprocessing\spawn.py", line 113, in spawn_main
new_handle = reduction.duplicate(pipe_handle,
source_process=source_process)
File "C:\Users\Administrator\buildarea\3.x.itamaro-win64-srv-22-aws.x64.nogil\build\Lib\multiprocessing\reduction.py", line 79, in duplicate
return _winapi.DuplicateHandle(
~~~~~~~~~~~~~~~~~~~~~~~^
source_process, handle, target_process,
^^^^^^^^^^^^^^^^^^^^^^^^^^^^^^^^^^^^^^^
0, inheritable, _winapi.DUPLICATE_SAME_ACCESS)
^^^^^^^^^^^^^^^^^^^^^^^^^^^^^^^^^^^^^^^^^^^^^^
PermissionError: [WinError 5] Access is denied
FAIL
Traceback (most recent call last):
File "C:\Users\Administrator\buildarea\3.x.itamaro-win64-srv-22-aws.x64.nogil\build\Lib\test\_test_multiprocessing.py", line 6175, in test_value
self.run_worker(self._test_value, o)
~~~~~~~~~~~~~~~^^^^^^^^^^^^^^^^^^^^^
File "C:\Users\Administrator\buildarea\3.x.itamaro-win64-srv-22-aws.x64.nogil\build\Lib\test\_test_multiprocessing.py", line 5990, in run_worker
self.wait_proc_exit()
~~~~~~~~~~~~~~~~~~~^^
File "C:\Users\Administrator\buildarea\3.x.itamaro-win64-srv-22-aws.x64.nogil\build\Lib\test\_test_multiprocessing.py", line 5972, in wait_proc_exit
join_process(self.proc)
~~~~~~~~~~~~^^^^^^^^^^^
File "C:\Users\Administrator\buildarea\3.x.itamaro-win64-srv-22-aws.x64.nogil\build\Lib\test\_test_multiprocessing.py", line 104, in join_process
threading_helper.join_thread(process)
~~~~~~~~~~~~~~~~~~~~~~~~~~~~^^^^^^^^^
File "C:\Users\Administrator\buildarea\3.x.itamaro-win64-srv-22-aws.x64.nogil\build\Lib\test\support\threading_helper.py", line 116, in join_thread
raise AssertionError(msg)
AssertionError: failed to join the thread in 30.0 seconds
Traceback (most recent call last):
File "C:\Users\Administrator\buildarea\3.x.itamaro-win64-srv-22-aws.x64.nogil\build\Lib\multiprocessing\process.py", line 313, in _bootstrap
self.run()
~~~~~~~~^^
File "C:\Users\Administrator\buildarea\3.x.itamaro-win64-srv-22-aws.x64.nogil\build\Lib\multiprocessing\process.py", line 108, in run
self._target(*self._args, **self._kwargs)
~~~~~~~~~~~~^^^^^^^^^^^^^^^^^^^^^^^^^^^^^
File "C:\Users\Administrator\buildarea\3.x.itamaro-win64-srv-22-aws.x64.nogil\build\Lib\test\_test_multiprocessing.py", line 1864, in task
self.f(*self.args)
~~~~~~^^^^^^^^^^^^
File "C:\Users\Administrator\buildarea\3.x.itamaro-win64-srv-22-aws.x64.nogil\build\Lib\test\_test_multiprocessing.py", line 1954, in _test_wait_return_f
res = barrier.wait()
File "C:\Users\Administrator\buildarea\3.x.itamaro-win64-srv-22-aws.x64.nogil\build\Lib\threading.py", line 720, in wait
self._enter() # Block while the barrier drains.
~~~~~~~~~~~^^
File "C:\Users\Administrator\buildarea\3.x.itamaro-win64-srv-22-aws.x64.nogil\build\Lib\threading.py", line 744, in _enter
raise BrokenBarrierError
threading.BrokenBarrierError
Process Process-43:
Traceback (most recent call last):
File "C:\Users\Administrator\buildarea\3.x.itamaro-win64-srv-22-aws.x64.nogil\build\Lib\multiprocessing\process.py", line 313, in _bootstrap
self.run()
~~~~~~~~^^
File "C:\Users\Administrator\buildarea\3.x.itamaro-win64-srv-22-aws.x64.nogil\build\Lib\multiprocessing\process.py", line 108, in run
self._target(*self._args, **self._kwargs)
~~~~~~~~~~~~^^^^^^^^^^^^^^^^^^^^^^^^^^^^^
File "C:\Users\Administrator\buildarea\3.x.itamaro-win64-srv-22-aws.x64.nogil\build\Lib\test\_test_multiprocessing.py", line 1864, in task
self.f(*self.args)
~~~~~~^^^^^^^^^^^^
File "C:\Users\Administrator\buildarea\3.x.itamaro-win64-srv-22-aws.x64.nogil\build\Lib\test\_test_multiprocessing.py", line 1954, in _test_wait_return_f
res = barrier.wait()
File "C:\Users\Administrator\buildarea\3.x.itamaro-win64-srv-22-aws.x64.nogil\build\Lib\threading.py", line 720, in wait
self._enter() # Block while the barrier drains.
~~~~~~~~~~~^^
File "C:\Users\Administrator\buildarea\3.x.itamaro-win64-srv-22-aws.x64.nogil\build\Lib\threading.py", line 744, in _enter
raise BrokenBarrierError
threading.BrokenBarrierError
Process Process-44:
Traceback (most recent call last):
File "C:\Users\Administrator\buildarea\3.x.itamaro-win64-srv-22-aws.x64.nogil\build\Lib\multiprocessing\process.py", line 313, in _bootstrap
self.run()
~~~~~~~~^^
File "C:\Users\Administrator\buildarea\3.x.itamaro-win64-srv-22-aws.x64.nogil\build\Lib\multiprocessing\process.py", line 108, in run
self._target(*self._args, **self._kwargs)
~~~~~~~~~~~~^^^^^^^^^^^^^^^^^^^^^^^^^^^^^
File "C:\Users\Administrator\buildarea\3.x.itamaro-win64-srv-22-aws.x64.nogil\build\Lib\test\_test_multiprocessing.py", line 1864, in task
self.f(*self.args)
~~~~~~^^^^^^^^^^^^
File "C:\Users\Administrator\buildarea\3.x.itamaro-win64-srv-22-aws.x64.nogil\build\Lib\test\_test_multiprocessing.py", line 1954, in _test_wait_return_f
res = barrier.wait()
File "C:\Users\Administrator\buildarea\3.x.itamaro-win64-srv-22-aws.x64.nogil\build\Lib\threading.py", line 720, in wait
self._enter() # Block while the barrier drains.
~~~~~~~~~~~^^
File "C:\Users\Administrator\buildarea\3.x.itamaro-win64-srv-22-aws.x64.nogil\build\Lib\threading.py", line 744, in _enter
raise BrokenBarrierError
threading.BrokenBarrierError
Process Process-41:
Traceback (most recent call last):
File "C:\Users\Administrator\buildarea\3.x.itamaro-win64-srv-22-aws.x64.nogil\build\Lib\multiprocessing\process.py", line 313, in _bootstrap
self.run()
~~~~~~~~^^
File "C:\Users\Administrator\buildarea\3.x.itamaro-win64-srv-22-aws.x64.nogil\build\Lib\multiprocessing\process.py", line 108, in run
self._target(*self._args, **self._kwargs)
~~~~~~~~~~~~^^^^^^^^^^^^^^^^^^^^^^^^^^^^^
File "C:\Users\Administrator\buildarea\3.x.itamaro-win64-srv-22-aws.x64.nogil\build\Lib\test\_test_multiprocessing.py", line 1864, in task
self.f(*self.args)
~~~~~~^^^^^^^^^^^^
File "C:\Users\Administrator\buildarea\3.x.itamaro-win64-srv-22-aws.x64.nogil\build\Lib\test\_test_multiprocessing.py", line 1954, in _test_wait_return_f
res = barrier.wait()
File "C:\Users\Administrator\buildarea\3.x.itamaro-win64-srv-22-aws.x64.nogil\build\Lib\threading.py", line 720, in wait
self._enter() # Block while the barrier drains.
~~~~~~~~~~~^^
File "C:\Users\Administrator\buildarea\3.x.itamaro-win64-srv-22-aws.x64.nogil\build\Lib\threading.py", line 744, in _enter
raise BrokenBarrierError
threading.BrokenBarrierError
ERROR
Traceback (most recent call last):
File "C:\Users\Administrator\buildarea\3.x.itamaro-win64-srv-22-aws.x64.nogil\build\Lib\multiprocessing\process.py", line 313, in _bootstrap
self.run()
~~~~~~~~^^
File "C:\Users\Administrator\buildarea\3.x.itamaro-win64-srv-22-aws.x64.nogil\build\Lib\multiprocessing\process.py", line 108, in run
self._target(*self._args, **self._kwargs)
~~~~~~~~~~~~^^^^^^^^^^^^^^^^^^^^^^^^^^^^^
File "C:\Users\Administrator\buildarea\3.x.itamaro-win64-srv-22-aws.x64.nogil\build\Lib\test\_test_multiprocessing.py", line 1864, in task
self.f(*self.args)
~~~~~~^^^^^^^^^^^^
File "C:\Users\Administrator\buildarea\3.x.itamaro-win64-srv-22-aws.x64.nogil\build\Lib\test\_test_multiprocessing.py", line 1929, in multipass
barrier.wait()
~~~~~~~~~~~~^^
File "C:\Users\Administrator\buildarea\3.x.itamaro-win64-srv-22-aws.x64.nogil\build\Lib\threading.py", line 720, in wait
self._enter() # Block while the barrier drains.
~~~~~~~~~~~^^
File "C:\Users\Administrator\buildarea\3.x.itamaro-win64-srv-22-aws.x64.nogil\build\Lib\threading.py", line 744, in _enter
raise BrokenBarrierError
threading.BrokenBarrierError
Process Process-23:
Traceback (most recent call last):
File "C:\Users\Administrator\buildarea\3.x.itamaro-win64-srv-22-aws.x64.nogil\build\Lib\multiprocessing\process.py", line 313, in _bootstrap
self.run()
~~~~~~~~^^
File "C:\Users\Administrator\buildarea\3.x.itamaro-win64-srv-22-aws.x64.nogil\build\Lib\multiprocessing\process.py", line 108, in run
self._target(*self._args, **self._kwargs)
~~~~~~~~~~~~^^^^^^^^^^^^^^^^^^^^^^^^^^^^^
File "C:\Users\Administrator\buildarea\3.x.itamaro-win64-srv-22-aws.x64.nogil\build\Lib\test\_test_multiprocessing.py", line 1864, in task
self.f(*self.args)
~~~~~~^^^^^^^^^^^^
File "C:\Users\Administrator\buildarea\3.x.itamaro-win64-srv-22-aws.x64.nogil\build\Lib\test\_test_multiprocessing.py", line 1929, in multipass
barrier.wait()
~~~~~~~~~~~~^^
File "C:\Users\Administrator\buildarea\3.x.itamaro-win64-srv-22-aws.x64.nogil\build\Lib\threading.py", line 720, in wait
self._enter() # Block while the barrier drains.
~~~~~~~~~~~^^
File "C:\Users\Administrator\buildarea\3.x.itamaro-win64-srv-22-aws.x64.nogil\build\Lib\threading.py", line 744, in _enter
raise BrokenBarrierError
threading.BrokenBarrierError
Process Process-21:
Traceback (most recent call last):
File "C:\Users\Administrator\buildarea\3.x.itamaro-win64-srv-22-aws.x64.nogil\build\Lib\multiprocessing\process.py", line 313, in _bootstrap
self.run()
~~~~~~~~^^
File "C:\Users\Administrator\buildarea\3.x.itamaro-win64-srv-22-aws.x64.nogil\build\Lib\multiprocessing\process.py", line 108, in run
self._target(*self._args, **self._kwargs)
~~~~~~~~~~~~^^^^^^^^^^^^^^^^^^^^^^^^^^^^^
File "C:\Users\Administrator\buildarea\3.x.itamaro-win64-srv-22-aws.x64.nogil\build\Lib\test\_test_multiprocessing.py", line 1864, in task
self.f(*self.args)
~~~~~~^^^^^^^^^^^^
File "C:\Users\Administrator\buildarea\3.x.itamaro-win64-srv-22-aws.x64.nogil\build\Lib\test\_test_multiprocessing.py", line 1929, in multipass
barrier.wait()
~~~~~~~~~~~~^^
File "C:\Users\Administrator\buildarea\3.x.itamaro-win64-srv-22-aws.x64.nogil\build\Lib\threading.py", line 720, in wait
self._enter() # Block while the barrier drains.
~~~~~~~~~~~^^
File "C:\Users\Administrator\buildarea\3.x.itamaro-win64-srv-22-aws.x64.nogil\build\Lib\threading.py", line 744, in _enter
raise BrokenBarrierError
threading.BrokenBarrierError
Process Process-22:
Traceback (most recent call last):
File "C:\Users\Administrator\buildarea\3.x.itamaro-win64-srv-22-aws.x64.nogil\build\Lib\multiprocessing\process.py", line 313, in _bootstrap
self.run()
~~~~~~~~^^
File "C:\Users\Administrator\buildarea\3.x.itamaro-win64-srv-22-aws.x64.nogil\build\Lib\multiprocessing\process.py", line 108, in run
self._target(*self._args, **self._kwargs)
~~~~~~~~~~~~^^^^^^^^^^^^^^^^^^^^^^^^^^^^^
File "C:\Users\Administrator\buildarea\3.x.itamaro-win64-srv-22-aws.x64.nogil\build\Lib\test\_test_multiprocessing.py", line 1864, in task
self.f(*self.args)
~~~~~~^^^^^^^^^^^^
File "C:\Users\Administrator\buildarea\3.x.itamaro-win64-srv-22-aws.x64.nogil\build\Lib\test\_test_multiprocessing.py", line 1929, in multipass
barrier.wait()
~~~~~~~~~~~~^^
File "C:\Users\Administrator\buildarea\3.x.itamaro-win64-srv-22-aws.x64.nogil\build\Lib\threading.py", line 720, in wait
self._enter() # Block while the barrier drains.
~~~~~~~~~~~^^
File "C:\Users\Administrator\buildarea\3.x.itamaro-win64-srv-22-aws.x64.nogil\build\Lib\threading.py", line 744, in _enter
raise BrokenBarrierError
threading.BrokenBarrierError
ERROR
Traceback (test.test_zipimport.UncompressedZipImportTestCase.testTraceback) ... ok
Traceback (most recent call last):
File "C:\Users\Administrator\buildarea\3.x.itamaro-win64-srv-22-aws.x64.nogil\build\Lib\test\_test_multiprocessing.py", line 6064, in test_pool
self.run_worker(self._test_pool, o)
~~~~~~~~~~~~~~~^^^^^^^^^^^^^^^^^^^^
File "C:\Users\Administrator\buildarea\3.x.itamaro-win64-srv-22-aws.x64.nogil\build\Lib\test\_test_multiprocessing.py", line 5990, in run_worker
self.wait_proc_exit()
~~~~~~~~~~~~~~~~~~~^^
File "C:\Users\Administrator\buildarea\3.x.itamaro-win64-srv-22-aws.x64.nogil\build\Lib\test\_test_multiprocessing.py", line 5972, in wait_proc_exit
join_process(self.proc)
~~~~~~~~~~~~^^^^^^^^^^^
File "C:\Users\Administrator\buildarea\3.x.itamaro-win64-srv-22-aws.x64.nogil\build\Lib\test\_test_multiprocessing.py", line 104, in join_process
threading_helper.join_thread(process)
~~~~~~~~~~~~~~~~~~~~~~~~~~~~^^^^^^^^^
File "C:\Users\Administrator\buildarea\3.x.itamaro-win64-srv-22-aws.x64.nogil\build\Lib\test\support\threading_helper.py", line 116, in join_thread
raise AssertionError(msg)
AssertionError: failed to join the thread in 30.0 seconds
Traceback (most recent call last):
File "C:\Users\Administrator\buildarea\3.x.itamaro-win64-srv-22-aws.x64.nogil\build\Lib\test\_test_multiprocessing.py", line 6080, in test_queue
self.run_worker(self._test_queue, o)
~~~~~~~~~~~~~~~^^^^^^^^^^^^^^^^^^^^^
File "C:\Users\Administrator\buildarea\3.x.itamaro-win64-srv-22-aws.x64.nogil\build\Lib\test\_test_multiprocessing.py", line 5990, in run_worker
self.wait_proc_exit()
~~~~~~~~~~~~~~~~~~~^^
File "C:\Users\Administrator\buildarea\3.x.itamaro-win64-srv-22-aws.x64.nogil\build\Lib\test\_test_multiprocessing.py", line 5972, in wait_proc_exit
join_process(self.proc)
~~~~~~~~~~~~^^^^^^^^^^^
File "C:\Users\Administrator\buildarea\3.x.itamaro-win64-srv-22-aws.x64.nogil\build\Lib\test\_test_multiprocessing.py", line 104, in join_process
threading_helper.join_thread(process)
~~~~~~~~~~~~~~~~~~~~~~~~~~~~^^^^^^^^^
File "C:\Users\Administrator\buildarea\3.x.itamaro-win64-srv-22-aws.x64.nogil\build\Lib\test\support\threading_helper.py", line 116, in join_thread
raise AssertionError(msg)
AssertionError: failed to join the thread in 30.0 seconds
Traceback (most recent call last):
File "C:\Users\Administrator\buildarea\3.x.itamaro-win64-srv-22-aws.x64.nogil\build\Lib\multiprocessing\process.py", line 313, in _bootstrap
self.run()
~~~~~~~~^^
File "C:\Users\Administrator\buildarea\3.x.itamaro-win64-srv-22-aws.x64.nogil\build\Lib\multiprocessing\process.py", line 108, in run
self._target(*self._args, **self._kwargs)
~~~~~~~~~~~~^^^^^^^^^^^^^^^^^^^^^^^^^^^^^
File "C:\Users\Administrator\buildarea\3.x.itamaro-win64-srv-22-aws.x64.nogil\build\Lib\test\_test_multiprocessing.py", line 1864, in task
self.f(*self.args)
~~~~~~^^^^^^^^^^^^
File "C:\Users\Administrator\buildarea\3.x.itamaro-win64-srv-22-aws.x64.nogil\build\Lib\test\_test_multiprocessing.py", line 2009, in _test_reset_f
i = barrier.wait()
File "C:\Users\Administrator\buildarea\3.x.itamaro-win64-srv-22-aws.x64.nogil\build\Lib\threading.py", line 720, in wait
self._enter() # Block while the barrier drains.
~~~~~~~~~~~^^
File "C:\Users\Administrator\buildarea\3.x.itamaro-win64-srv-22-aws.x64.nogil\build\Lib\threading.py", line 744, in _enter
raise BrokenBarrierError
threading.BrokenBarrierError
Process Process-30:
Traceback (most recent call last):
File "C:\Users\Administrator\buildarea\3.x.itamaro-win64-srv-22-aws.x64.nogil\build\Lib\multiprocessing\process.py", line 313, in _bootstrap
self.run()
~~~~~~~~^^
File "C:\Users\Administrator\buildarea\3.x.itamaro-win64-srv-22-aws.x64.nogil\build\Lib\multiprocessing\process.py", line 108, in run
self._target(*self._args, **self._kwargs)
~~~~~~~~~~~~^^^^^^^^^^^^^^^^^^^^^^^^^^^^^
File "C:\Users\Administrator\buildarea\3.x.itamaro-win64-srv-22-aws.x64.nogil\build\Lib\test\_test_multiprocessing.py", line 1864, in task
self.f(*self.args)
~~~~~~^^^^^^^^^^^^
File "C:\Users\Administrator\buildarea\3.x.itamaro-win64-srv-22-aws.x64.nogil\build\Lib\test\_test_multiprocessing.py", line 2009, in _test_reset_f
i = barrier.wait()
File "C:\Users\Administrator\buildarea\3.x.itamaro-win64-srv-22-aws.x64.nogil\build\Lib\threading.py", line 720, in wait
self._enter() # Block while the barrier drains.
~~~~~~~~~~~^^
File "C:\Users\Administrator\buildarea\3.x.itamaro-win64-srv-22-aws.x64.nogil\build\Lib\threading.py", line 744, in _enter
raise BrokenBarrierError
threading.BrokenBarrierError
Process Process-29:
Process Process-31:
Traceback (most recent call last):
File "C:\Users\Administrator\buildarea\3.x.itamaro-win64-srv-22-aws.x64.nogil\build\Lib\multiprocessing\process.py", line 313, in _bootstrap
self.run()
~~~~~~~~^^
File "C:\Users\Administrator\buildarea\3.x.itamaro-win64-srv-22-aws.x64.nogil\build\Lib\multiprocessing\process.py", line 108, in run
self._target(*self._args, **self._kwargs)
~~~~~~~~~~~~^^^^^^^^^^^^^^^^^^^^^^^^^^^^^
File "C:\Users\Administrator\buildarea\3.x.itamaro-win64-srv-22-aws.x64.nogil\build\Lib\test\_test_multiprocessing.py", line 1864, in task
self.f(*self.args)
~~~~~~^^^^^^^^^^^^
File "C:\Users\Administrator\buildarea\3.x.itamaro-win64-srv-22-aws.x64.nogil\build\Lib\test\_test_multiprocessing.py", line 2009, in _test_reset_f
i = barrier.wait()
File "C:\Users\Administrator\buildarea\3.x.itamaro-win64-srv-22-aws.x64.nogil\build\Lib\threading.py", line 720, in wait
self._enter() # Block while the barrier drains.
~~~~~~~~~~~^^
File "C:\Users\Administrator\buildarea\3.x.itamaro-win64-srv-22-aws.x64.nogil\build\Lib\threading.py", line 744, in _enter
raise BrokenBarrierError
threading.BrokenBarrierError
Traceback (most recent call last):
File "C:\Users\Administrator\buildarea\3.x.itamaro-win64-srv-22-aws.x64.nogil\build\Lib\multiprocessing\process.py", line 313, in _bootstrap
self.run()
~~~~~~~~^^
File "C:\Users\Administrator\buildarea\3.x.itamaro-win64-srv-22-aws.x64.nogil\build\Lib\multiprocessing\process.py", line 108, in run
self._target(*self._args, **self._kwargs)
~~~~~~~~~~~~^^^^^^^^^^^^^^^^^^^^^^^^^^^^^
File "C:\Users\Administrator\buildarea\3.x.itamaro-win64-srv-22-aws.x64.nogil\build\Lib\test\_test_multiprocessing.py", line 1864, in task
self.f(*self.args)
~~~~~~^^^^^^^^^^^^
File "C:\Users\Administrator\buildarea\3.x.itamaro-win64-srv-22-aws.x64.nogil\build\Lib\test\_test_multiprocessing.py", line 2009, in _test_reset_f
i = barrier.wait()
File "C:\Users\Administrator\buildarea\3.x.itamaro-win64-srv-22-aws.x64.nogil\build\Lib\threading.py", line 720, in wait
self._enter() # Block while the barrier drains.
~~~~~~~~~~~^^
File "C:\Users\Administrator\buildarea\3.x.itamaro-win64-srv-22-aws.x64.nogil\build\Lib\threading.py", line 744, in _enter
raise BrokenBarrierError
threading.BrokenBarrierError
ERROR
Traceback (most recent call last):
File "C:\Users\Administrator\buildarea\3.x.itamaro-win64-srv-22-aws.x64.nogil\build\Lib\multiprocessing\process.py", line 313, in _bootstrap
self.run()
~~~~~~~~^^
File "C:\Users\Administrator\buildarea\3.x.itamaro-win64-srv-22-aws.x64.nogil\build\Lib\multiprocessing\process.py", line 108, in run
self._target(*self._args, **self._kwargs)
~~~~~~~~~~~~^^^^^^^^^^^^^^^^^^^^^^^^^^^^^
File "C:\Users\Administrator\buildarea\3.x.itamaro-win64-srv-22-aws.x64.nogil\build\Lib\test\_test_multiprocessing.py", line 1864, in task
self.f(*self.args)
~~~~~~^^^^^^^^^^^^
File "C:\Users\Administrator\buildarea\3.x.itamaro-win64-srv-22-aws.x64.nogil\build\Lib\test\_test_multiprocessing.py", line 2096, in _test_default_timeout_f
i = barrier.wait(cls.defaultTimeout)
File "C:\Users\Administrator\buildarea\3.x.itamaro-win64-srv-22-aws.x64.nogil\build\Lib\threading.py", line 720, in wait
self._enter() # Block while the barrier drains.
~~~~~~~~~~~^^
File "C:\Users\Administrator\buildarea\3.x.itamaro-win64-srv-22-aws.x64.nogil\build\Lib\threading.py", line 744, in _enter
raise BrokenBarrierError
threading.BrokenBarrierError
Process Process-25:
Traceback (most recent call last):
File "C:\Users\Administrator\buildarea\3.x.itamaro-win64-srv-22-aws.x64.nogil\build\Lib\multiprocessing\process.py", line 313, in _bootstrap
self.run()
~~~~~~~~^^
File "C:\Users\Administrator\buildarea\3.x.itamaro-win64-srv-22-aws.x64.nogil\build\Lib\multiprocessing\process.py", line 108, in run
self._target(*self._args, **self._kwargs)
~~~~~~~~~~~~^^^^^^^^^^^^^^^^^^^^^^^^^^^^^
File "C:\Users\Administrator\buildarea\3.x.itamaro-win64-srv-22-aws.x64.nogil\build\Lib\test\_test_multiprocessing.py", line 1864, in task
self.f(*self.args)
~~~~~~^^^^^^^^^^^^
File "C:\Users\Administrator\buildarea\3.x.itamaro-win64-srv-22-aws.x64.nogil\build\Lib\test\_test_multiprocessing.py", line 2096, in _test_default_timeout_f
i = barrier.wait(cls.defaultTimeout)
File "C:\Users\Administrator\buildarea\3.x.itamaro-win64-srv-22-aws.x64.nogil\build\Lib\threading.py", line 720, in wait
self._enter() # Block while the barrier drains.
~~~~~~~~~~~^^
File "C:\Users\Administrator\buildarea\3.x.itamaro-win64-srv-22-aws.x64.nogil\build\Lib\threading.py", line 744, in _enter
raise BrokenBarrierError
threading.BrokenBarrierError
Process Process-26:
Process Process-27:
Traceback (most recent call last):
File "C:\Users\Administrator\buildarea\3.x.itamaro-win64-srv-22-aws.x64.nogil\build\Lib\multiprocessing\process.py", line 313, in _bootstrap
self.run()
~~~~~~~~^^
File "C:\Users\Administrator\buildarea\3.x.itamaro-win64-srv-22-aws.x64.nogil\build\Lib\multiprocessing\process.py", line 108, in run
self._target(*self._args, **self._kwargs)
~~~~~~~~~~~~^^^^^^^^^^^^^^^^^^^^^^^^^^^^^
File "C:\Users\Administrator\buildarea\3.x.itamaro-win64-srv-22-aws.x64.nogil\build\Lib\test\_test_multiprocessing.py", line 1864, in task
self.f(*self.args)
~~~~~~^^^^^^^^^^^^
File "C:\Users\Administrator\buildarea\3.x.itamaro-win64-srv-22-aws.x64.nogil\build\Lib\test\_test_multiprocessing.py", line 2096, in _test_default_timeout_f
i = barrier.wait(cls.defaultTimeout)
File "C:\Users\Administrator\buildarea\3.x.itamaro-win64-srv-22-aws.x64.nogil\build\Lib\threading.py", line 720, in wait
self._enter() # Block while the barrier drains.
~~~~~~~~~~~^^
File "C:\Users\Administrator\buildarea\3.x.itamaro-win64-srv-22-aws.x64.nogil\build\Lib\threading.py", line 744, in _enter
raise BrokenBarrierError
threading.BrokenBarrierError
Traceback (most recent call last):
File "C:\Users\Administrator\buildarea\3.x.itamaro-win64-srv-22-aws.x64.nogil\build\Lib\multiprocessing\process.py", line 313, in _bootstrap
self.run()
~~~~~~~~^^
File "C:\Users\Administrator\buildarea\3.x.itamaro-win64-srv-22-aws.x64.nogil\build\Lib\multiprocessing\process.py", line 108, in run
self._target(*self._args, **self._kwargs)
~~~~~~~~~~~~^^^^^^^^^^^^^^^^^^^^^^^^^^^^^
File "C:\Users\Administrator\buildarea\3.x.itamaro-win64-srv-22-aws.x64.nogil\build\Lib\test\_test_multiprocessing.py", line 1864, in task
self.f(*self.args)
~~~~~~^^^^^^^^^^^^
File "C:\Users\Administrator\buildarea\3.x.itamaro-win64-srv-22-aws.x64.nogil\build\Lib\test\_test_multiprocessing.py", line 2096, in _test_default_timeout_f
i = barrier.wait(cls.defaultTimeout)
File "C:\Users\Administrator\buildarea\3.x.itamaro-win64-srv-22-aws.x64.nogil\build\Lib\threading.py", line 720, in wait
self._enter() # Block while the barrier drains.
~~~~~~~~~~~^^
File "C:\Users\Administrator\buildarea\3.x.itamaro-win64-srv-22-aws.x64.nogil\build\Lib\threading.py", line 744, in _enter
raise BrokenBarrierError
threading.BrokenBarrierError
ERROR
Traceback (most recent call last):
File "C:\Users\Administrator\buildarea\3.x.itamaro-win64-srv-22-aws.x64.nogil\build\Lib\test\_test_multiprocessing.py", line 6036, in test_bounded_semaphore
self.test_semaphore(sname="BoundedSemaphore")
~~~~~~~~~~~~~~~~~~~^^^^^^^^^^^^^^^^^^^^^^^^^^
File "C:\Users\Administrator\buildarea\3.x.itamaro-win64-srv-22-aws.x64.nogil\build\Lib\test\_test_multiprocessing.py", line 6032, in test_semaphore
self.run_worker(self._test_semaphore, o)
~~~~~~~~~~~~~~~^^^^^^^^^^^^^^^^^^^^^^^^^
File "C:\Users\Administrator\buildarea\3.x.itamaro-win64-srv-22-aws.x64.nogil\build\Lib\test\_test_multiprocessing.py", line 5990, in run_worker
self.wait_proc_exit()
~~~~~~~~~~~~~~~~~~~^^
File "C:\Users\Administrator\buildarea\3.x.itamaro-win64-srv-22-aws.x64.nogil\build\Lib\test\_test_multiprocessing.py", line 5972, in wait_proc_exit
join_process(self.proc)
~~~~~~~~~~~~^^^^^^^^^^^
File "C:\Users\Administrator\buildarea\3.x.itamaro-win64-srv-22-aws.x64.nogil\build\Lib\test\_test_multiprocessing.py", line 104, in join_process
threading_helper.join_thread(process)
~~~~~~~~~~~~~~~~~~~~~~~~~~~~^^^^^^^^^
File "C:\Users\Administrator\buildarea\3.x.itamaro-win64-srv-22-aws.x64.nogil\build\Lib\test\support\threading_helper.py", line 116, in join_thread
raise AssertionError(msg)
AssertionError: failed to join the thread in 30.0 seconds
Traceback (most recent call last):
File "C:\Users\Administrator\buildarea\3.x.itamaro-win64-srv-22-aws.x64.nogil\build\Lib\multiprocessing\process.py", line 313, in _bootstrap
self.run()
~~~~~~~~^^
File "C:\Users\Administrator\buildarea\3.x.itamaro-win64-srv-22-aws.x64.nogil\build\Lib\multiprocessing\process.py", line 108, in run
self._target(*self._args, **self._kwargs)
~~~~~~~~~~~~^^^^^^^^^^^^^^^^^^^^^^^^^^^^^
File "C:\Users\Administrator\buildarea\3.x.itamaro-win64-srv-22-aws.x64.nogil\build\Lib\test\_test_multiprocessing.py", line 1864, in task
self.f(*self.args)
~~~~~~^^^^^^^^^^^^
File "C:\Users\Administrator\buildarea\3.x.itamaro-win64-srv-22-aws.x64.nogil\build\Lib\test\_test_multiprocessing.py", line 1929, in multipass
barrier.wait()
~~~~~~~~~~~~^^
File "C:\Users\Administrator\buildarea\3.x.itamaro-win64-srv-22-aws.x64.nogil\build\Lib\threading.py", line 720, in wait
self._enter() # Block while the barrier drains.
~~~~~~~~~~~^^
File "C:\Users\Administrator\buildarea\3.x.itamaro-win64-srv-22-aws.x64.nogil\build\Lib\threading.py", line 744, in _enter
raise BrokenBarrierError
threading.BrokenBarrierError
Process Process-23:
Traceback (most recent call last):
File "C:\Users\Administrator\buildarea\3.x.itamaro-win64-srv-22-aws.x64.nogil\build\Lib\multiprocessing\process.py", line 313, in _bootstrap
self.run()
~~~~~~~~^^
File "C:\Users\Administrator\buildarea\3.x.itamaro-win64-srv-22-aws.x64.nogil\build\Lib\multiprocessing\process.py", line 108, in run
self._target(*self._args, **self._kwargs)
~~~~~~~~~~~~^^^^^^^^^^^^^^^^^^^^^^^^^^^^^
File "C:\Users\Administrator\buildarea\3.x.itamaro-win64-srv-22-aws.x64.nogil\build\Lib\test\_test_multiprocessing.py", line 1864, in task
self.f(*self.args)
~~~~~~^^^^^^^^^^^^
File "C:\Users\Administrator\buildarea\3.x.itamaro-win64-srv-22-aws.x64.nogil\build\Lib\test\_test_multiprocessing.py", line 1929, in multipass
barrier.wait()
~~~~~~~~~~~~^^
File "C:\Users\Administrator\buildarea\3.x.itamaro-win64-srv-22-aws.x64.nogil\build\Lib\threading.py", line 720, in wait
self._enter() # Block while the barrier drains.
~~~~~~~~~~~^^
File "C:\Users\Administrator\buildarea\3.x.itamaro-win64-srv-22-aws.x64.nogil\build\Lib\threading.py", line 744, in _enter
raise BrokenBarrierError
threading.BrokenBarrierError
Process Process-21:
Traceback (most recent call last):
File "C:\Users\Administrator\buildarea\3.x.itamaro-win64-srv-22-aws.x64.nogil\build\Lib\multiprocessing\process.py", line 313, in _bootstrap
self.run()
~~~~~~~~^^
File "C:\Users\Administrator\buildarea\3.x.itamaro-win64-srv-22-aws.x64.nogil\build\Lib\multiprocessing\process.py", line 108, in run
self._target(*self._args, **self._kwargs)
~~~~~~~~~~~~^^^^^^^^^^^^^^^^^^^^^^^^^^^^^
File "C:\Users\Administrator\buildarea\3.x.itamaro-win64-srv-22-aws.x64.nogil\build\Lib\test\_test_multiprocessing.py", line 1864, in task
self.f(*self.args)
~~~~~~^^^^^^^^^^^^
File "C:\Users\Administrator\buildarea\3.x.itamaro-win64-srv-22-aws.x64.nogil\build\Lib\test\_test_multiprocessing.py", line 1929, in multipass
barrier.wait()
~~~~~~~~~~~~^^
File "C:\Users\Administrator\buildarea\3.x.itamaro-win64-srv-22-aws.x64.nogil\build\Lib\threading.py", line 720, in wait
self._enter() # Block while the barrier drains.
~~~~~~~~~~~^^
File "C:\Users\Administrator\buildarea\3.x.itamaro-win64-srv-22-aws.x64.nogil\build\Lib\threading.py", line 744, in _enter
raise BrokenBarrierError
threading.BrokenBarrierError
Process Process-20:
Traceback (most recent call last):
File "C:\Users\Administrator\buildarea\3.x.itamaro-win64-srv-22-aws.x64.nogil\build\Lib\multiprocessing\process.py", line 313, in _bootstrap
self.run()
~~~~~~~~^^
File "C:\Users\Administrator\buildarea\3.x.itamaro-win64-srv-22-aws.x64.nogil\build\Lib\multiprocessing\process.py", line 108, in run
self._target(*self._args, **self._kwargs)
~~~~~~~~~~~~^^^^^^^^^^^^^^^^^^^^^^^^^^^^^
File "C:\Users\Administrator\buildarea\3.x.itamaro-win64-srv-22-aws.x64.nogil\build\Lib\test\_test_multiprocessing.py", line 1864, in task
self.f(*self.args)
~~~~~~^^^^^^^^^^^^
File "C:\Users\Administrator\buildarea\3.x.itamaro-win64-srv-22-aws.x64.nogil\build\Lib\test\_test_multiprocessing.py", line 1929, in multipass
barrier.wait()
~~~~~~~~~~~~^^
File "C:\Users\Administrator\buildarea\3.x.itamaro-win64-srv-22-aws.x64.nogil\build\Lib\threading.py", line 720, in wait
self._enter() # Block while the barrier drains.
~~~~~~~~~~~^^
File "C:\Users\Administrator\buildarea\3.x.itamaro-win64-srv-22-aws.x64.nogil\build\Lib\threading.py", line 744, in _enter
raise BrokenBarrierError
threading.BrokenBarrierError
ERROR
Traceback (test.test_zipimport.CompressedZipImportTestCase.testTraceback) ... ok
Test report
===========
Failed tests:
- test.test_multiprocessing_spawn.test_processes
- test_zipimport
- test_wmi
- test_math
- test.test_multiprocessing_spawn.test_misc
- test_statistics
- test_peg_generator
Failed subtests:
- test_queue - test.test_multiprocessing_spawn.test_misc.TestSyncManagerTypes.test_queue
- test_value - test.test_multiprocessing_spawn.test_misc.TestSyncManagerTypes.test_value
- test_condition - test.test_multiprocessing_spawn.test_misc.TestSyncManagerTypes.test_condition
- test_wait_integer - test.test_multiprocessing_spawn.test_misc.TestWait.test_wait_integer
- test_pool - test.test_multiprocessing_spawn.test_misc.TestSyncManagerTypes.test_pool
- test_bounded_semaphore - test.test_multiprocessing_spawn.test_misc.TestSyncManagerTypes.test_bounded_semaphore
Sincerely,
-The Buildbot
1
0
☠ Buildbot (Python): python/cpython - failed test (failure) (timed out) (3.13)
by buildbot@python.org Sept. 24, 2024
by buildbot@python.org Sept. 24, 2024
Sept. 24, 2024
The Buildbot has detected a new failure on builder aarch64 Android 3.13 while building python/cpython.
Full details are available at:
https://buildbot.python.org/#/builders/1590/builds/12
Buildbot URL: https://buildbot.python.org/
Worker for this Build: mhsmith-android-aarch64
Build Reason: <unknown>
Blamelist: Miss Islington (bot) <31488909+miss-islington(a)users.noreply.github.com>
BUILD FAILED: failed test (failure) (timed out)
Summary of the results of the build (if available):
===================================================
==
Captured traceback
==================
Traceback (most recent call last):
File "/data/user/0/org.python.testbed/files/python/lib/python3.13/test/test_android.py", line 424, in test_rate_limit
self.assertAlmostEqual(
~~~~~~~~~~~~~~~~~~~~~~^
write_bucketful(), MAX_KB_PER_SECOND,
^^^^^^^^^^^^^^^^^^^^^^^^^^^^^^^^^^^^^
delta=MAX_KB_PER_SECOND * 0.1
^^^^^^^^^^^^^^^^^^^^^^^^^^^^^
)
^
AssertionError: 89.082058296307 != 100 within 10.0 delta (10.917941703693003 difference)
Traceback (most recent call last):
File "/data/user/0/org.python.testbed/files/python/lib/python3.13/test/test_android.py", line 66, in assert_log
line = self.logcat_queue.get(timeout=(deadline - time()))
File "/data/user/0/org.python.testbed/files/python/lib/python3.13/queue.py", line 212, in get
raise Empty
_queue.Empty
Traceback (most recent call last):
File "/data/user/0/org.python.testbed/files/python/lib/python3.13/test/test_os.py", line 4340, in test_timerfd_poll
self.check_timerfd_poll(False)
~~~~~~~~~~~~~~~~~~~~~~~^^^^^^^
File "/data/user/0/org.python.testbed/files/python/lib/python3.13/test/test_os.py", line 4328, in check_timerfd_poll
self.assertEqual(self.read_count_signaled(fd), 1)
~~~~~~~~~~~~~~~~^^^^^^^^^^^^^^^^^^^^^^^^^^^^^^^^^
AssertionError: 2 != 1
Traceback (most recent call last):
File "/data/user/0/org.python.testbed/files/python/lib/python3.13/test/test_android.py", line 56, in setUp
self.assert_log("I", tag, message, skip=True, timeout=5)
~~~~~~~~~~~~~~~^^^^^^^^^^^^^^^^^^^^^^^^^^^^^^^^^^^^^^^^^
File "/data/user/0/org.python.testbed/files/python/lib/python3.13/test/test_android.py", line 68, in assert_log
self.fail(f"line not found: {expected!r}")
~~~~~~~~~^^^^^^^^^^^^^^^^^^^^^^^^^^^^^^^^^
AssertionError: line not found: 'test.test_android.TestAndroidOutput.test_rate_limit 1727202606.4314926'
Traceback (most recent call last):
File "/Library/Frameworks/Python.framework/Versions/3.12/lib/python3.12/asyncio/runners.py", line 118, in run
return self._loop.run_until_complete(task)
^^^^^^^^^^^^^^^^^^^^^^^^^^^^^^^^^^^
File "/Library/Frameworks/Python.framework/Versions/3.12/lib/python3.12/asyncio/base_events.py", line 687, in run_until_complete
return future.result()
^^^^^^^^^^^^^^^
File "/Volumes/InternalDisk/Users/android/buildarea/3.13.mhsmith-android-aarch64/build/Android/android.py", line 530, in run_testbed
async with asyncio.TaskGroup() as tg:
File "/Library/Frameworks/Python.framework/Versions/3.12/lib/python3.12/asyncio/taskgroups.py", line 134, in __aexit__
raise propagate_cancellation_error
File "/Library/Frameworks/Python.framework/Versions/3.12/lib/python3.12/asyncio/taskgroups.py", line 110, in __aexit__
await self._on_completed_fut
asyncio.exceptions.CancelledError
Test report
===========
Failed tests:
- test_os
- test_android
Failed subtests:
- test_rate_limit - test.test_android.TestAndroidOutput.test_rate_limit
- test_timerfd_poll - test.test_os.TimerfdTests.test_timerfd_poll
Sincerely,
-The BuildbotThe Buildbot has detected a new failure on builder AMD64 Windows Server 2022 NoGIL 3.13 while building python/cpython.
Full details are available at:
https://buildbot.python.org/#/builders/1488/builds/551
Buildbot URL: https://buildbot.python.org/
Worker for this Build: itamaro-win64-srv-22-aws
Build Reason: <unknown>
Blamelist: Adam Turner <9087854+AA-Turner(a)users.noreply.github.com>, Hugo van Kemenade <1324225+hugovk(a)users.noreply.github.com>, Miss Islington (bot) <31488909+miss-islington(a)users.noreply.github.com>, Petr Viktorin <encukou(a)gmail.com>
BUILD FAILED: failed test (failure)
Summary of the results of the build (if available):
===================================================
==
Captured traceback
==================
Traceback (most recent call last):
Warning -- File "C:\Users\Administrator\buildarea\3.13.itamaro-win64-srv-22-aws.x64.nogil\build\Lib\test\support\__init__.py", line 200, in _force_run
Warning -- return func(*args)
Warning -- PermissionError: [WinError 5] Access is denied: 'C:\\Users\\ADMINI~1\\AppData\\Local\\Temp\\2\\test_python_hrxwcifc\\tmpq9915b99\\Scripts\\python_d.exe'
Warning --
Warning -- During handling of the above exception, another exception occurred:
Warning --
Warning -- Traceback (most recent call last):
Warning -- File "C:\Users\Administrator\buildarea\3.13.itamaro-win64-srv-22-aws.x64.nogil\build\Lib\test\libregrtest\run_workers.py", line 393, in run
Warning -- mp_result = self._runtest(test_name)
Warning -- File "C:\Users\Administrator\buildarea\3.13.itamaro-win64-srv-22-aws.x64.nogil\build\Lib\test\libregrtest\run_workers.py", line 353, in _runtest
Warning -- retcode, tmp_files = self.run_tmp_files(worker_runtests,
Warning -- ~~~~~~~~~~~~~~~~~~^^^^^^^^^^^^^^^^^
Warning -- stdout_file.fileno())
Warning -- ^^^^^^^^^^^^^^^^^^^^^
Warning -- File "C:\Users\Administrator\buildarea\3.13.itamaro-win64-srv-22-aws.x64.nogil\build\Lib\test\libregrtest\run_workers.py", line 293, in run_tmp_files
Warning -- os_helper.rmtree(tmp_dir)
Warning -- ~~~~~~~~~~~~~~~~^^^^^^^^^
Warning -- File "C:\Users\Administrator\buildarea\3.13.itamaro-win64-srv-22-aws.x64.nogil\build\Lib\test\support\os_helper.py", line 465, in rmtree
Warning -- _rmtree(path)
Warning -- ~~~~~~~^^^^^^
Warning -- File "C:\Users\Administrator\buildarea\3.13.itamaro-win64-srv-22-aws.x64.nogil\build\Lib\test\support\os_helper.py", line 408, in _rmtree
Warning -- _waitfor(_rmtree_inner, path, waitall=True)
Warning -- ~~~~~~~~^^^^^^^^^^^^^^^^^^^^^^^^^^^^^^^^^^^
Warning -- File "C:\Users\Administrator\buildarea\3.13.itamaro-win64-srv-22-aws.x64.nogil\build\Lib\test\support\os_helper.py", line 353, in _waitfor
Warning -- func(pathname)
Warning -- ~~~~^^^^^^^^^^
Warning -- File "C:\Users\Administrator\buildarea\3.13.itamaro-win64-srv-22-aws.x64.nogil\build\Lib\test\support\os_helper.py", line 404, in _rmtree_inner
Warning -- _waitfor(_rmtree_inner, fullname, waitall=True)
Warning -- ~~~~~~~~^^^^^^^^^^^^^^^^^^^^^^^^^^^^^^^^^^^^^^^
Warning -- File "C:\Users\Administrator\buildarea\3.13.itamaro-win64-srv-22-aws.x64.nogil\build\Lib\test\support\os_helper.py", line 353, in _waitfor
Warning -- func(pathname)
Warning -- ~~~~^^^^^^^^^^
Warning -- File "C:\Users\Administrator\buildarea\3.13.itamaro-win64-srv-22-aws.x64.nogil\build\Lib\test\support\os_helper.py", line 404, in _rmtree_inner
Warning -- _waitfor(_rmtree_inner, fullname, waitall=True)
Warning -- ~~~~~~~~^^^^^^^^^^^^^^^^^^^^^^^^^^^^^^^^^^^^^^^
Warning -- File "C:\Users\Administrator\buildarea\3.13.itamaro-win64-srv-22-aws.x64.nogil\build\Lib\test\support\os_helper.py", line 353, in _waitfor
Warning -- func(pathname)
Warning -- ~~~~^^^^^^^^^^
Warning -- File "C:\Users\Administrator\buildarea\3.13.itamaro-win64-srv-22-aws.x64.nogil\build\Lib\test\support\os_helper.py", line 407, in _rmtree_inner
Warning -- _force_run(fullname, os.unlink, fullname)
Warning -- ~~~~~~~~~~^^^^^^^^^^^^^^^^^^^^^^^^^^^^^^^
Warning -- File "C:\Users\Administrator\buildarea\3.13.itamaro-win64-srv-22-aws.x64.nogil\build\Lib\test\support\__init__.py", line 211, in _force_run
Warning -- return func(*args)
Warning -- PermissionError: [WinError 5] Access is denied: 'C:\\Users\\ADMINI~1\\AppData\\Local\\Temp\\2\\test_python_hrxwcifc\\tmpq9915b99\\Scripts\\python_d.exe'
Kill <WorkerThread #1 running test=test.test_multiprocessing_spawn.test_processes pid=9056 time=18 min 26 sec> process
Kill <WorkerThread #2 running test=test_statistics pid=9640 time=11 min 35 sec> process
Kill <WorkerThread #4 running test=test_multiprocessing_main_handling pid=9568 time=3 min 21 sec> process
Kill <WorkerThread #5 running test=test_poplib pid=5964 time=36.2 sec> process
Kill <WorkerThread #6 running test=test_regrtest pid=4312 time=22 min> process
Kill <WorkerThread #7 running test=test_itertools pid=9556 time=46.1 sec> process
Kill <WorkerThread #8 running test=test_ucn pid=8464 time=1 min 8 sec> process
Kill <WorkerThread #9 running test=test_hashlib pid=10516 time=3 min 20 sec> process
Kill <WorkerThread #10 running test=test.test_asyncio.test_locks pid=7552 time=4.1 sec> process
Traceback (most recent call last):
File "C:\Users\Administrator\buildarea\3.13.itamaro-win64-srv-22-aws.x64.nogil\build\Lib\test\test_concurrent_futures\executor.py", line 71, in test_map_timeout
self.assertEqual([None, None], results)
~~~~~~~~~~~~~~~~^^^^^^^^^^^^^^^^^^^^^^^
AssertionError: Lists differ: [None, None] != []
Traceback (most recent call last):
File "C:\Users\Administrator\buildarea\3.13.itamaro-win64-srv-22-aws.x64.nogil\build\Lib\test\test_re.py", line 2497, in test_regression_gh94675
self.assertFalse(p.is_alive(), 'pattern.sub() timed out')
~~~~~~~~~~~~~~~~^^^^^^^^^^^^^^^^^^^^^^^^^^^^^^^^^^^^^^^^^
AssertionError: True is not false : pattern.sub() timed out
Traceback (most recent call last):
File "C:\Users\Administrator\buildarea\3.13.itamaro-win64-srv-22-aws.x64.nogil\build\Lib\test\libregrtest\single.py", line 181, in _runtest_env_changed_exc
_load_run_test(result, runtests)
~~~~~~~~~~~~~~^^^^^^^^^^^^^^^^^^
File "C:\Users\Administrator\buildarea\3.13.itamaro-win64-srv-22-aws.x64.nogil\build\Lib\test\libregrtest\single.py", line 128, in _load_run_test
test_mod = importlib.import_module(module_name)
File "C:\Users\Administrator\buildarea\3.13.itamaro-win64-srv-22-aws.x64.nogil\build\Lib\importlib\__init__.py", line 88, in import_module
return _bootstrap._gcd_import(name[level:], package, level)
~~~~~~~~~~~~~~~~~~~~~~^^^^^^^^^^^^^^^^^^^^^^^^^^^^^^
File "<frozen importlib._bootstrap>", line 1387, in _gcd_import
File "<frozen importlib._bootstrap>", line 1360, in _find_and_load
File "<frozen importlib._bootstrap>", line 1324, in _find_and_load_unlocked
ModuleNotFoundError: No module named 'test.<regrtest worker>'
Test report
===========
Failed tests:
- test.test_concurrent_futures.test_process_pool
- test_wmi
- <regrtest
- test_re
- worker>
Failed subtests:
- test_regression_gh94675 - test.test_re.ReTests.test_regression_gh94675
- test_map_timeout - test.test_concurrent_futures.test_process_pool.ProcessPoolSpawnProcessPoolExecutorTest.test_map_timeout
Sincerely,
-The Buildbot
1
0
☠ Buildbot (Python): python/cpython - failed test (failure) (3.13)
by buildbot@python.org Sept. 24, 2024
by buildbot@python.org Sept. 24, 2024
Sept. 24, 2024
The Buildbot has detected a new failure on builder aarch64 Android 3.13 while building python/cpython.
Full details are available at:
https://buildbot.python.org/#/builders/1590/builds/10
Buildbot URL: https://buildbot.python.org/
Worker for this Build: mhsmith-android-aarch64
Build Reason: <unknown>
Blamelist: Hugo van Kemenade <1324225+hugovk(a)users.noreply.github.com>, Miss Islington (bot) <31488909+miss-islington(a)users.noreply.github.com>
BUILD FAILED: failed test (failure)
Summary of the results of the build (if available):
===================================================
==
Captured traceback
==================
Traceback (most recent call last):
File "/data/user/0/org.python.testbed/files/python/lib/python3.13/test/test_signal.py", line 1342, in test_stress_delivery_simultaneous
for _ in support.sleeping_retry(support.SHORT_TIMEOUT):
~~~~~~~~~~~~~~~~~~~~~~^^^^^^^^^^^^^^^^^^^^^^^
File "/data/user/0/org.python.testbed/files/python/lib/python3.13/test/support/__init__.py", line 2481, in sleeping_retry
for _ in busy_retry(timeout, err_msg, error=error):
~~~~~~~~~~^^^^^^^^^^^^^^^^^^^^^^^^^^^^^^^
File "/data/user/0/org.python.testbed/files/python/lib/python3.13/test/support/__init__.py", line 2451, in busy_retry
raise AssertionError(msg)
AssertionError: timeout (30.2 seconds)
Traceback (most recent call last):
File "/data/user/0/org.python.testbed/files/python/lib/python3.13/test/test_signal.py", line 1342, in test_stress_delivery_simultaneous
for _ in support.sleeping_retry(support.SHORT_TIMEOUT):
~~~~~~~~~~~~~~~~~~~~~~^^^^^^^^^^^^^^^^^^^^^^^
File "/data/user/0/org.python.testbed/files/python/lib/python3.13/test/support/__init__.py", line 2481, in sleeping_retry
for _ in busy_retry(timeout, err_msg, error=error):
~~~~~~~~~~^^^^^^^^^^^^^^^^^^^^^^^^^^^^^^^
File "/data/user/0/org.python.testbed/files/python/lib/python3.13/test/support/__init__.py", line 2451, in busy_retry
raise AssertionError(msg)
AssertionError: timeout (30.3 seconds)
Test report
===========
Failed tests:
- test_signal
Sincerely,
-The Buildbot
1
0
☠ Buildbot (Python): python/cpython - failed test (failure) (main)
by buildbot@python.org Sept. 24, 2024
by buildbot@python.org Sept. 24, 2024
Sept. 24, 2024
The Buildbot has detected a new failure on builder AMD64 Fedora Rawhide NoGIL refleaks 3.x while building python/cpython.
Full details are available at:
https://buildbot.python.org/#/builders/1529/builds/163
Buildbot URL: https://buildbot.python.org/
Worker for this Build: cstratak-fedora-rawhide-x86_64
Build Reason: <unknown>
Blamelist: Adam Turner <9087854+AA-Turner(a)users.noreply.github.com>, Alex Waygood <Alex.Waygood(a)Gmail.com>, Brett Cannon <brett(a)python.org>, Bénédikt Tran <10796600+picnixz(a)users.noreply.github.com>, Donghee Na <donghee.na(a)python.org>, Furkan Onder <furkanonder(a)protonmail.com>, Hugo van Kemenade <1324225+hugovk(a)users.noreply.github.com>, Jason Fried <me(a)jasonfried.info>, Jelle Zijlstra <jelle.zijlstra(a)gmail.com>, Kirill Podoprigora <kirill.bast9(a)mail.ru>, Malcolm Smith <smith(a)chaquo.com>, Mark Shannon <mark(a)hotpy.org>, Petr Viktorin <encukou(a)gmail.com>, Sam James <sam(a)gentoo.org>, Savannah Ostrowski <savannahostrowski(a)gmail.com>, Serhiy Storchaka <storchaka(a)gmail.com>, Stanley <46876382+slateny(a)users.noreply.github.com>, Steve Dower <steve.dower(a)python.org>, Victor Stinner <vstinner(a)python.org>, Wulian <1055917385(a)qq.com>, Xie Yanbo <xieyanbo(a)gmail.com>, Y5 <124019959+y5c4l3(a)users.noreply.github.com>, decorator-factory <42166884+decorator-factory(a)users.noreply.github.com>, neonene
<53406459+neonene(a)users.noreply.github.com>, sobolevn <mail(a)sobolevn.me>
BUILD FAILED: failed test (failure)
Summary of the results of the build (if available):
===================================================
==
Captured traceback
==================
remote: Enumerating objects: 384, done.
remote: Counting objects: 0% (1/367)
remote: Counting objects: 1% (4/367)
remote: Counting objects: 2% (8/367)
remote: Counting objects: 3% (12/367)
remote: Counting objects: 4% (15/367)
remote: Counting objects: 5% (19/367)
remote: Counting objects: 6% (23/367)
remote: Counting objects: 7% (26/367)
remote: Counting objects: 8% (30/367)
remote: Counting objects: 9% (34/367)
remote: Counting objects: 10% (37/367)
remote: Counting objects: 11% (41/367)
remote: Counting objects: 12% (45/367)
remote: Counting objects: 13% (48/367)
remote: Counting objects: 14% (52/367)
remote: Counting objects: 15% (56/367)
remote: Counting objects: 16% (59/367)
remote: Counting objects: 17% (63/367)
remote: Counting objects: 18% (67/367)
remote: Counting objects: 19% (70/367)
remote: Counting objects: 20% (74/367)
remote: Counting objects: 21% (78/367)
remote: Counting objects: 22% (81/367)
remote: Counting objects: 23% (85/367)
remote: Counting objects: 24% (89/367)
remote: Counting objects: 25% (92/367)
remote: Counting objects: 26% (96/367)
remote: Counting objects: 27% (100/367)
remote: Counting objects: 28% (103/367)
remote: Counting objects: 29% (107/367)
remote: Counting objects: 30% (111/367)
remote: Counting objects: 31% (114/367)
remote: Counting objects: 32% (118/367)
remote: Counting objects: 33% (122/367)
remote: Counting objects: 34% (125/367)
remote: Counting objects: 35% (129/367)
remote: Counting objects: 36% (133/367)
remote: Counting objects: 37% (136/367)
remote: Counting objects: 38% (140/367)
remote: Counting objects: 39% (144/367)
remote: Counting objects: 40% (147/367)
remote: Counting objects: 41% (151/367)
remote: Counting objects: 42% (155/367)
remote: Counting objects: 43% (158/367)
remote: Counting objects: 44% (162/367)
remote: Counting objects: 45% (166/367)
remote: Counting objects: 46% (169/367)
remote: Counting objects: 47% (173/367)
remote: Counting objects: 48% (177/367)
remote: Counting objects: 49% (180/367)
remote: Counting objects: 50% (184/367)
remote: Counting objects: 51% (188/367)
remote: Counting objects: 52% (191/367)
remote: Counting objects: 53% (195/367)
remote: Counting objects: 54% (199/367)
remote: Counting objects: 55% (202/367)
remote: Counting objects: 56% (206/367)
remote: Counting objects: 57% (210/367)
remote: Counting objects: 58% (213/367)
remote: Counting objects: 59% (217/367)
remote: Counting objects: 60% (221/367)
remote: Counting objects: 61% (224/367)
remote: Counting objects: 62% (228/367)
remote: Counting objects: 63% (232/367)
remote: Counting objects: 64% (235/367)
remote: Counting objects: 65% (239/367)
remote: Counting objects: 66% (243/367)
remote: Counting objects: 67% (246/367)
remote: Counting objects: 68% (250/367)
remote: Counting objects: 69% (254/367)
remote: Counting objects: 70% (257/367)
remote: Counting objects: 71% (261/367)
remote: Counting objects: 72% (265/367)
remote: Counting objects: 73% (268/367)
remote: Counting objects: 74% (272/367)
remote: Counting objects: 75% (276/367)
remote: Counting objects: 76% (279/367)
remote: Counting objects: 77% (283/367)
remote: Counting objects: 78% (287/367)
remote: Counting objects: 79% (290/367)
remote: Counting objects: 80% (294/367)
remote: Counting objects: 81% (298/367)
remote: Counting objects: 82% (301/367)
remote: Counting objects: 83% (305/367)
remote: Counting objects: 84% (309/367)
remote: Counting objects: 85% (312/367)
remote: Counting objects: 86% (316/367)
remote: Counting objects: 87% (320/367)
remote: Counting objects: 88% (323/367)
remote: Counting objects: 89% (327/367)
remote: Counting objects: 90% (331/367)
remote: Counting objects: 91% (334/367)
remote: Counting objects: 92% (338/367)
remote: Counting objects: 93% (342/367)
remote: Counting objects: 94% (345/367)
remote: Counting objects: 95% (349/367)
remote: Counting objects: 96% (353/367)
remote: Counting objects: 97% (356/367)
remote: Counting objects: 98% (360/367)
remote: Counting objects: 99% (364/367)
remote: Counting objects: 100% (367/367)
remote: Counting objects: 100% (367/367), done.
remote: Compressing objects: 0% (1/236)
remote: Compressing objects: 1% (3/236)
remote: Compressing objects: 2% (5/236)
remote: Compressing objects: 3% (8/236)
remote: Compressing objects: 4% (10/236)
remote: Compressing objects: 5% (12/236)
remote: Compressing objects: 6% (15/236)
remote: Compressing objects: 7% (17/236)
remote: Compressing objects: 8% (19/236)
remote: Compressing objects: 9% (22/236)
remote: Compressing objects: 10% (24/236)
remote: Compressing objects: 11% (26/236)
remote: Compressing objects: 12% (29/236)
remote: Compressing objects: 13% (31/236)
remote: Compressing objects: 14% (34/236)
remote: Compressing objects: 15% (36/236)
remote: Compressing objects: 16% (38/236)
remote: Compressing objects: 17% (41/236)
remote: Compressing objects: 18% (43/236)
remote: Compressing objects: 19% (45/236)
remote: Compressing objects: 20% (48/236)
remote: Compressing objects: 21% (50/236)
remote: Compressing objects: 22% (52/236)
remote: Compressing objects: 23% (55/236)
remote: Compressing objects: 24% (57/236)
remote: Compressing objects: 25% (59/236)
remote: Compressing objects: 26% (62/236)
remote: Compressing objects: 27% (64/236)
remote: Compressing objects: 28% (67/236)
remote: Compressing objects: 29% (69/236)
remote: Compressing objects: 30% (71/236)
remote: Compressing objects: 31% (74/236)
remote: Compressing objects: 32% (76/236)
remote: Compressing objects: 33% (78/236)
remote: Compressing objects: 34% (81/236)
remote: Compressing objects: 35% (83/236)
remote: Compressing objects: 36% (85/236)
remote: Compressing objects: 37% (88/236)
remote: Compressing objects: 38% (90/236)
remote: Compressing objects: 39% (93/236)
remote: Compressing objects: 40% (95/236)
remote: Compressing objects: 41% (97/236)
remote: Compressing objects: 42% (100/236)
remote: Compressing objects: 43% (102/236)
remote: Compressing objects: 44% (104/236)
remote: Compressing objects: 45% (107/236)
remote: Compressing objects: 46% (109/236)
remote: Compressing objects: 47% (111/236)
remote: Compressing objects: 48% (114/236)
remote: Compressing objects: 49% (116/236)
remote: Compressing objects: 50% (118/236)
remote: Compressing objects: 51% (121/236)
remote: Compressing objects: 52% (123/236)
remote: Compressing objects: 53% (126/236)
remote: Compressing objects: 54% (128/236)
remote: Compressing objects: 55% (130/236)
remote: Compressing objects: 56% (133/236)
remote: Compressing objects: 57% (135/236)
remote: Compressing objects: 58% (137/236)
remote: Compressing objects: 59% (140/236)
remote: Compressing objects: 60% (142/236)
remote: Compressing objects: 61% (144/236)
remote: Compressing objects: 62% (147/236)
remote: Compressing objects: 63% (149/236)
remote: Compressing objects: 64% (152/236)
remote: Compressing objects: 65% (154/236)
remote: Compressing objects: 66% (156/236)
remote: Compressing objects: 67% (159/236)
remote: Compressing objects: 68% (161/236)
remote: Compressing objects: 69% (163/236)
remote: Compressing objects: 70% (166/236)
remote: Compressing objects: 71% (168/236)
remote: Compressing objects: 72% (170/236)
remote: Compressing objects: 73% (173/236)
remote: Compressing objects: 74% (175/236)
remote: Compressing objects: 75% (177/236)
remote: Compressing objects: 76% (180/236)
remote: Compressing objects: 77% (182/236)
remote: Compressing objects: 78% (185/236)
remote: Compressing objects: 79% (187/236)
remote: Compressing objects: 80% (189/236)
remote: Compressing objects: 81% (192/236)
remote: Compressing objects: 82% (194/236)
remote: Compressing objects: 83% (196/236)
remote: Compressing objects: 84% (199/236)
remote: Compressing objects: 85% (201/236)
remote: Compressing objects: 86% (203/236)
remote: Compressing objects: 87% (206/236)
remote: Compressing objects: 88% (208/236)
remote: Compressing objects: 89% (211/236)
remote: Compressing objects: 90% (213/236)
remote: Compressing objects: 91% (215/236)
remote: Compressing objects: 92% (218/236)
remote: Compressing objects: 93% (220/236)
remote: Compressing objects: 94% (222/236)
remote: Compressing objects: 95% (225/236)
remote: Compressing objects: 96% (227/236)
remote: Compressing objects: 97% (229/236)
remote: Compressing objects: 98% (232/236)
remote: Compressing objects: 99% (234/236)
remote: Compressing objects: 100% (236/236)
remote: Compressing objects: 100% (236/236), done.
Receiving objects: 0% (1/384)
Receiving objects: 1% (4/384)
Receiving objects: 2% (8/384)
Receiving objects: 3% (12/384)
Receiving objects: 4% (16/384)
Receiving objects: 5% (20/384)
Receiving objects: 6% (24/384)
Receiving objects: 7% (27/384)
Receiving objects: 8% (31/384)
Receiving objects: 9% (35/384)
Receiving objects: 10% (39/384)
Receiving objects: 11% (43/384)
Receiving objects: 12% (47/384)
Receiving objects: 13% (50/384)
Receiving objects: 14% (54/384)
Receiving objects: 15% (58/384)
Receiving objects: 16% (62/384)
Receiving objects: 17% (66/384)
Receiving objects: 18% (70/384)
Receiving objects: 19% (73/384)
Receiving objects: 20% (77/384)
Receiving objects: 21% (81/384)
Receiving objects: 22% (85/384)
Receiving objects: 23% (89/384)
Receiving objects: 24% (93/384)
Receiving objects: 25% (96/384)
Receiving objects: 26% (100/384)
Receiving objects: 27% (104/384)
Receiving objects: 28% (108/384)
Receiving objects: 29% (112/384)
Receiving objects: 30% (116/384)
Receiving objects: 31% (120/384)
Receiving objects: 32% (123/384)
Receiving objects: 33% (127/384)
Receiving objects: 34% (131/384)
Receiving objects: 35% (135/384)
Receiving objects: 36% (139/384)
Receiving objects: 37% (143/384)
Receiving objects: 38% (146/384)
Receiving objects: 39% (150/384)
Receiving objects: 40% (154/384)
Receiving objects: 41% (158/384)
Receiving objects: 42% (162/384)
Receiving objects: 43% (166/384)
Receiving objects: 44% (169/384)
Receiving objects: 45% (173/384)
Receiving objects: 46% (177/384)
Receiving objects: 47% (181/384)
Receiving objects: 48% (185/384)
Receiving objects: 49% (189/384)
Receiving objects: 50% (192/384)
Receiving objects: 51% (196/384)
Receiving objects: 52% (200/384)
Receiving objects: 53% (204/384)
Receiving objects: 54% (208/384)
Receiving objects: 55% (212/384)
Receiving objects: 56% (216/384)
Receiving objects: 57% (219/384)
Receiving objects: 58% (223/384)
Receiving objects: 59% (227/384)
Receiving objects: 60% (231/384)
Receiving objects: 61% (235/384)
Receiving objects: 62% (239/384)
Receiving objects: 63% (242/384)
Receiving objects: 64% (246/384)
Receiving objects: 65% (250/384)
Receiving objects: 66% (254/384)
Receiving objects: 67% (258/384)
Receiving objects: 68% (262/384)
Receiving objects: 69% (265/384)
Receiving objects: 70% (269/384)
Receiving objects: 71% (273/384)
Receiving objects: 72% (277/384)
Receiving objects: 73% (281/384)
Receiving objects: 74% (285/384)
Receiving objects: 75% (288/384)
Receiving objects: 76% (292/384)
Receiving objects: 77% (296/384)
Receiving objects: 78% (300/384)
Receiving objects: 79% (304/384)
Receiving objects: 80% (308/384)
Receiving objects: 81% (312/384)
Receiving objects: 82% (315/384)
Receiving objects: 83% (319/384)
Receiving objects: 84% (323/384)
Receiving objects: 85% (327/384)
Receiving objects: 86% (331/384)
Receiving objects: 87% (335/384)
Receiving objects: 88% (338/384)
Receiving objects: 89% (342/384)
Receiving objects: 90% (346/384)
Receiving objects: 91% (350/384)
Receiving objects: 92% (354/384)
Receiving objects: 93% (358/384)
Receiving objects: 94% (361/384)
Receiving objects: 95% (365/384)
Receiving objects: 96% (369/384)
Receiving objects: 97% (373/384)
remote: Total 384 (delta 230), reused 197 (delta 131), pack-reused 17 (from 1)
Receiving objects: 98% (377/384)
Receiving objects: 99% (381/384)
Receiving objects: 100% (384/384)
Receiving objects: 100% (384/384), 1.13 MiB | 5.02 MiB/s, done.
Resolving deltas: 0% (0/230)
Resolving deltas: 1% (3/230)
Resolving deltas: 2% (5/230)
Resolving deltas: 3% (7/230)
Resolving deltas: 4% (10/230)
Resolving deltas: 5% (12/230)
Resolving deltas: 6% (14/230)
Resolving deltas: 7% (17/230)
Resolving deltas: 8% (19/230)
Resolving deltas: 9% (21/230)
Resolving deltas: 10% (23/230)
Resolving deltas: 11% (26/230)
Resolving deltas: 12% (28/230)
Resolving deltas: 13% (30/230)
Resolving deltas: 14% (33/230)
Resolving deltas: 15% (35/230)
Resolving deltas: 16% (37/230)
Resolving deltas: 17% (40/230)
Resolving deltas: 18% (42/230)
Resolving deltas: 19% (44/230)
Resolving deltas: 20% (46/230)
Resolving deltas: 21% (49/230)
Resolving deltas: 22% (51/230)
Resolving deltas: 23% (53/230)
Resolving deltas: 24% (56/230)
Resolving deltas: 25% (58/230)
Resolving deltas: 26% (60/230)
Resolving deltas: 27% (63/230)
Resolving deltas: 28% (65/230)
Resolving deltas: 29% (67/230)
Resolving deltas: 30% (69/230)
Resolving deltas: 31% (72/230)
Resolving deltas: 32% (74/230)
Resolving deltas: 33% (76/230)
Resolving deltas: 34% (79/230)
Resolving deltas: 35% (81/230)
Resolving deltas: 36% (83/230)
Resolving deltas: 37% (86/230)
Resolving deltas: 38% (88/230)
Resolving deltas: 39% (90/230)
Resolving deltas: 40% (92/230)
Resolving deltas: 41% (96/230)
Resolving deltas: 42% (97/230)
Resolving deltas: 43% (99/230)
Resolving deltas: 44% (102/230)
Resolving deltas: 45% (104/230)
Resolving deltas: 46% (106/230)
Resolving deltas: 47% (109/230)
Resolving deltas: 48% (111/230)
Resolving deltas: 49% (113/230)
Resolving deltas: 50% (115/230)
Resolving deltas: 51% (118/230)
Resolving deltas: 52% (120/230)
Resolving deltas: 53% (122/230)
Resolving deltas: 54% (125/230)
Resolving deltas: 55% (127/230)
Resolving deltas: 56% (129/230)
Resolving deltas: 57% (132/230)
Resolving deltas: 58% (134/230)
Resolving deltas: 59% (136/230)
Resolving deltas: 60% (138/230)
Resolving deltas: 61% (141/230)
Resolving deltas: 62% (143/230)
Resolving deltas: 63% (145/230)
Resolving deltas: 64% (148/230)
Resolving deltas: 65% (150/230)
Resolving deltas: 66% (152/230)
Resolving deltas: 67% (155/230)
Resolving deltas: 68% (158/230)
Resolving deltas: 69% (159/230)
Resolving deltas: 70% (161/230)
Resolving deltas: 71% (164/230)
Resolving deltas: 72% (167/230)
Resolving deltas: 73% (168/230)
Resolving deltas: 74% (171/230)
Resolving deltas: 75% (173/230)
Resolving deltas: 76% (175/230)
Resolving deltas: 77% (178/230)
Resolving deltas: 78% (180/230)
Resolving deltas: 79% (182/230)
Resolving deltas: 80% (184/230)
Resolving deltas: 81% (187/230)
Resolving deltas: 82% (189/230)
Resolving deltas: 83% (191/230)
Resolving deltas: 84% (194/230)
Resolving deltas: 85% (196/230)
Resolving deltas: 86% (198/230)
Resolving deltas: 87% (201/230)
Resolving deltas: 88% (203/230)
Resolving deltas: 89% (205/230)
Resolving deltas: 90% (207/230)
Resolving deltas: 91% (210/230)
Resolving deltas: 92% (212/230)
Resolving deltas: 93% (214/230)
Resolving deltas: 94% (217/230)
Resolving deltas: 95% (219/230)
Resolving deltas: 96% (221/230)
Resolving deltas: 97% (224/230)
Resolving deltas: 98% (226/230)
Resolving deltas: 99% (228/230)
Resolving deltas: 100% (230/230)
Resolving deltas: 100% (230/230), completed with 59 local objects.
From https://github.com/python/cpython
* branch main -> FETCH_HEAD
Note: switching to 'e69ff34e81eceb69de6623205c87e0145f1831e4'.
You are in 'detached HEAD' state. You can look around, make experimental
changes and commit them, and you can discard any commits you make in this
state without impacting any branches by switching back to a branch.
If you want to create a new branch to retain commits you create, you may
do so (now or later) by using -c with the switch command. Example:
git switch -c <new-branch-name>
Or undo this operation with:
git switch -
Turn off this advice by setting config variable advice.detachedHead to false
HEAD is now at e69ff34e81e gh-65169: Clarify prog default in argparse (GH-31602)
Switched to and reset branch 'main'
configure: WARNING: no system libmpdecimal found; falling back to bundled libmpdecimal (deprecated and scheduled for removal in Python 3.15)
make: *** [Makefile:2311: buildbottest] Error 3
Test report
===========
Sincerely,
-The Buildbot
1
0
☠ Buildbot (Python): python/cpython - failed compile (failure) (main)
by buildbot@python.org Sept. 24, 2024
by buildbot@python.org Sept. 24, 2024
Sept. 24, 2024
The Buildbot has detected a new failure on builder PPC64LE CentOS9 LTO + PGO 3.x while building python/cpython.
Full details are available at:
https://buildbot.python.org/#/builders/885/builds/5314
Buildbot URL: https://buildbot.python.org/
Worker for this Build: cstratak-CentOS9-ppc64le
Build Reason: <unknown>
Blamelist: Jelle Zijlstra <jelle.zijlstra(a)gmail.com>, Serhiy Storchaka <storchaka(a)gmail.com>, Victor Stinner <vstinner(a)python.org>, Xie Yanbo <xieyanbo(a)gmail.com>, sobolevn <mail(a)sobolevn.me>
BUILD FAILED: failed compile (failure)
Summary of the results of the build (if available):
===================================================
Captured traceback
==================
remote: Enumerating objects: 105, done.
remote: Counting objects: 1% (1/97)
remote: Counting objects: 2% (2/97)
remote: Counting objects: 3% (3/97)
remote: Counting objects: 4% (4/97)
remote: Counting objects: 5% (5/97)
remote: Counting objects: 6% (6/97)
remote: Counting objects: 7% (7/97)
remote: Counting objects: 8% (8/97)
remote: Counting objects: 9% (9/97)
remote: Counting objects: 10% (10/97)
remote: Counting objects: 11% (11/97)
remote: Counting objects: 12% (12/97)
remote: Counting objects: 13% (13/97)
remote: Counting objects: 14% (14/97)
remote: Counting objects: 15% (15/97)
remote: Counting objects: 16% (16/97)
remote: Counting objects: 17% (17/97)
remote: Counting objects: 18% (18/97)
remote: Counting objects: 19% (19/97)
remote: Counting objects: 20% (20/97)
remote: Counting objects: 21% (21/97)
remote: Counting objects: 22% (22/97)
remote: Counting objects: 23% (23/97)
remote: Counting objects: 24% (24/97)
remote: Counting objects: 25% (25/97)
remote: Counting objects: 26% (26/97)
remote: Counting objects: 27% (27/97)
remote: Counting objects: 28% (28/97)
remote: Counting objects: 29% (29/97)
remote: Counting objects: 30% (30/97)
remote: Counting objects: 31% (31/97)
remote: Counting objects: 32% (32/97)
remote: Counting objects: 34% (33/97)
remote: Counting objects: 35% (34/97)
remote: Counting objects: 36% (35/97)
remote: Counting objects: 37% (36/97)
remote: Counting objects: 38% (37/97)
remote: Counting objects: 39% (38/97)
remote: Counting objects: 40% (39/97)
remote: Counting objects: 41% (40/97)
remote: Counting objects: 42% (41/97)
remote: Counting objects: 43% (42/97)
remote: Counting objects: 44% (43/97)
remote: Counting objects: 45% (44/97)
remote: Counting objects: 46% (45/97)
remote: Counting objects: 47% (46/97)
remote: Counting objects: 48% (47/97)
remote: Counting objects: 49% (48/97)
remote: Counting objects: 50% (49/97)
remote: Counting objects: 51% (50/97)
remote: Counting objects: 52% (51/97)
remote: Counting objects: 53% (52/97)
remote: Counting objects: 54% (53/97)
remote: Counting objects: 55% (54/97)
remote: Counting objects: 56% (55/97)
remote: Counting objects: 57% (56/97)
remote: Counting objects: 58% (57/97)
remote: Counting objects: 59% (58/97)
remote: Counting objects: 60% (59/97)
remote: Counting objects: 61% (60/97)
remote: Counting objects: 62% (61/97)
remote: Counting objects: 63% (62/97)
remote: Counting objects: 64% (63/97)
remote: Counting objects: 65% (64/97)
remote: Counting objects: 67% (65/97)
remote: Counting objects: 68% (66/97)
remote: Counting objects: 69% (67/97)
remote: Counting objects: 70% (68/97)
remote: Counting objects: 71% (69/97)
remote: Counting objects: 72% (70/97)
remote: Counting objects: 73% (71/97)
remote: Counting objects: 74% (72/97)
remote: Counting objects: 75% (73/97)
remote: Counting objects: 76% (74/97)
remote: Counting objects: 77% (75/97)
remote: Counting objects: 78% (76/97)
remote: Counting objects: 79% (77/97)
remote: Counting objects: 80% (78/97)
remote: Counting objects: 81% (79/97)
remote: Counting objects: 82% (80/97)
remote: Counting objects: 83% (81/97)
remote: Counting objects: 84% (82/97)
remote: Counting objects: 85% (83/97)
remote: Counting objects: 86% (84/97)
remote: Counting objects: 87% (85/97)
remote: Counting objects: 88% (86/97)
remote: Counting objects: 89% (87/97)
remote: Counting objects: 90% (88/97)
remote: Counting objects: 91% (89/97)
remote: Counting objects: 92% (90/97)
remote: Counting objects: 93% (91/97)
remote: Counting objects: 94% (92/97)
remote: Counting objects: 95% (93/97)
remote: Counting objects: 96% (94/97)
remote: Counting objects: 97% (95/97)
remote: Counting objects: 98% (96/97)
remote: Counting objects: 100% (97/97)
remote: Counting objects: 100% (97/97), done.
remote: Compressing objects: 1% (1/57)
remote: Compressing objects: 3% (2/57)
remote: Compressing objects: 5% (3/57)
remote: Compressing objects: 7% (4/57)
remote: Compressing objects: 8% (5/57)
remote: Compressing objects: 10% (6/57)
remote: Compressing objects: 12% (7/57)
remote: Compressing objects: 14% (8/57)
remote: Compressing objects: 15% (9/57)
remote: Compressing objects: 17% (10/57)
remote: Compressing objects: 19% (11/57)
remote: Compressing objects: 21% (12/57)
remote: Compressing objects: 22% (13/57)
remote: Compressing objects: 24% (14/57)
remote: Compressing objects: 26% (15/57)
remote: Compressing objects: 28% (16/57)
remote: Compressing objects: 29% (17/57)
remote: Compressing objects: 31% (18/57)
remote: Compressing objects: 33% (19/57)
remote: Compressing objects: 35% (20/57)
remote: Compressing objects: 36% (21/57)
remote: Compressing objects: 38% (22/57)
remote: Compressing objects: 40% (23/57)
remote: Compressing objects: 42% (24/57)
remote: Compressing objects: 43% (25/57)
remote: Compressing objects: 45% (26/57)
remote: Compressing objects: 47% (27/57)
remote: Compressing objects: 49% (28/57)
remote: Compressing objects: 50% (29/57)
remote: Compressing objects: 52% (30/57)
remote: Compressing objects: 54% (31/57)
remote: Compressing objects: 56% (32/57)
remote: Compressing objects: 57% (33/57)
remote: Compressing objects: 59% (34/57)
remote: Compressing objects: 61% (35/57)
remote: Compressing objects: 63% (36/57)
remote: Compressing objects: 64% (37/57)
remote: Compressing objects: 66% (38/57)
remote: Compressing objects: 68% (39/57)
remote: Compressing objects: 70% (40/57)
remote: Compressing objects: 71% (41/57)
remote: Compressing objects: 73% (42/57)
remote: Compressing objects: 75% (43/57)
remote: Compressing objects: 77% (44/57)
remote: Compressing objects: 78% (45/57)
remote: Compressing objects: 80% (46/57)
remote: Compressing objects: 82% (47/57)
remote: Compressing objects: 84% (48/57)
remote: Compressing objects: 85% (49/57)
remote: Compressing objects: 87% (50/57)
remote: Compressing objects: 89% (51/57)
remote: Compressing objects: 91% (52/57)
remote: Compressing objects: 92% (53/57)
remote: Compressing objects: 94% (54/57)
remote: Compressing objects: 96% (55/57)
remote: Compressing objects: 98% (56/57)
remote: Compressing objects: 100% (57/57)
remote: Compressing objects: 100% (57/57), done.
Receiving objects: 0% (1/105)
Receiving objects: 1% (2/105)
Receiving objects: 2% (3/105)
Receiving objects: 3% (4/105)
Receiving objects: 4% (5/105)
Receiving objects: 5% (6/105)
Receiving objects: 6% (7/105)
Receiving objects: 7% (8/105)
Receiving objects: 8% (9/105)
Receiving objects: 9% (10/105)
Receiving objects: 10% (11/105)
Receiving objects: 11% (12/105)
Receiving objects: 12% (13/105)
Receiving objects: 13% (14/105)
Receiving objects: 14% (15/105)
Receiving objects: 15% (16/105)
Receiving objects: 16% (17/105)
Receiving objects: 17% (18/105)
Receiving objects: 18% (19/105)
Receiving objects: 19% (20/105)
Receiving objects: 20% (21/105)
Receiving objects: 21% (23/105)
Receiving objects: 22% (24/105)
Receiving objects: 23% (25/105)
Receiving objects: 24% (26/105)
Receiving objects: 25% (27/105)
Receiving objects: 26% (28/105)
Receiving objects: 27% (29/105)
Receiving objects: 28% (30/105)
Receiving objects: 29% (31/105)
Receiving objects: 30% (32/105)
Receiving objects: 31% (33/105)
Receiving objects: 32% (34/105)
Receiving objects: 33% (35/105)
Receiving objects: 34% (36/105)
Receiving objects: 35% (37/105)
Receiving objects: 36% (38/105)
Receiving objects: 37% (39/105)
Receiving objects: 38% (40/105)
Receiving objects: 39% (41/105)
Receiving objects: 40% (42/105)
Receiving objects: 41% (44/105)
Receiving objects: 42% (45/105)
Receiving objects: 43% (46/105)
Receiving objects: 44% (47/105)
Receiving objects: 45% (48/105)
Receiving objects: 46% (49/105)
Receiving objects: 47% (50/105)
Receiving objects: 48% (51/105)
Receiving objects: 49% (52/105)
Receiving objects: 50% (53/105)
Receiving objects: 51% (54/105)
Receiving objects: 52% (55/105)
Receiving objects: 53% (56/105)
Receiving objects: 54% (57/105)
Receiving objects: 55% (58/105)
Receiving objects: 56% (59/105)
Receiving objects: 57% (60/105)
Receiving objects: 58% (61/105)
Receiving objects: 59% (62/105)
Receiving objects: 60% (63/105)
Receiving objects: 61% (65/105)
Receiving objects: 62% (66/105)
Receiving objects: 63% (67/105)
Receiving objects: 64% (68/105)
Receiving objects: 65% (69/105)
Receiving objects: 66% (70/105)
Receiving objects: 67% (71/105)
Receiving objects: 68% (72/105)
Receiving objects: 69% (73/105)
Receiving objects: 70% (74/105)
Receiving objects: 71% (75/105)
Receiving objects: 72% (76/105)
Receiving objects: 73% (77/105)
Receiving objects: 74% (78/105)
Receiving objects: 75% (79/105)
Receiving objects: 76% (80/105)
Receiving objects: 77% (81/105)
Receiving objects: 78% (82/105)
Receiving objects: 79% (83/105)
Receiving objects: 80% (84/105)
Receiving objects: 81% (86/105)
Receiving objects: 82% (87/105)
Receiving objects: 83% (88/105)
Receiving objects: 84% (89/105)
Receiving objects: 85% (90/105)
Receiving objects: 86% (91/105)
Receiving objects: 87% (92/105)
Receiving objects: 88% (93/105)
Receiving objects: 89% (94/105)
Receiving objects: 90% (95/105)
Receiving objects: 91% (96/105)
Receiving objects: 92% (97/105)
Receiving objects: 93% (98/105)
Receiving objects: 94% (99/105)
remote: Total 105 (delta 64), reused 51 (delta 40), pack-reused 8 (from 1)
Receiving objects: 95% (100/105)
Receiving objects: 96% (101/105)
Receiving objects: 97% (102/105)
Receiving objects: 98% (103/105)
Receiving objects: 99% (104/105)
Receiving objects: 100% (105/105)
Receiving objects: 100% (105/105), 201.31 KiB | 2.14 MiB/s, done.
Resolving deltas: 0% (0/64)
Resolving deltas: 4% (3/64)
Resolving deltas: 6% (4/64)
Resolving deltas: 7% (5/64)
Resolving deltas: 9% (6/64)
Resolving deltas: 10% (7/64)
Resolving deltas: 12% (8/64)
Resolving deltas: 14% (9/64)
Resolving deltas: 15% (10/64)
Resolving deltas: 17% (11/64)
Resolving deltas: 18% (12/64)
Resolving deltas: 20% (13/64)
Resolving deltas: 21% (14/64)
Resolving deltas: 23% (15/64)
Resolving deltas: 25% (16/64)
Resolving deltas: 26% (17/64)
Resolving deltas: 28% (18/64)
Resolving deltas: 29% (19/64)
Resolving deltas: 31% (20/64)
Resolving deltas: 32% (21/64)
Resolving deltas: 34% (22/64)
Resolving deltas: 35% (23/64)
Resolving deltas: 37% (24/64)
Resolving deltas: 39% (25/64)
Resolving deltas: 40% (26/64)
Resolving deltas: 42% (27/64)
Resolving deltas: 43% (28/64)
Resolving deltas: 45% (29/64)
Resolving deltas: 46% (30/64)
Resolving deltas: 48% (31/64)
Resolving deltas: 50% (32/64)
Resolving deltas: 51% (33/64)
Resolving deltas: 54% (35/64)
Resolving deltas: 56% (36/64)
Resolving deltas: 57% (37/64)
Resolving deltas: 59% (38/64)
Resolving deltas: 62% (40/64)
Resolving deltas: 67% (43/64)
Resolving deltas: 68% (44/64)
Resolving deltas: 70% (45/64)
Resolving deltas: 71% (46/64)
Resolving deltas: 73% (47/64)
Resolving deltas: 75% (48/64)
Resolving deltas: 76% (49/64)
Resolving deltas: 78% (50/64)
Resolving deltas: 79% (51/64)
Resolving deltas: 81% (52/64)
Resolving deltas: 82% (53/64)
Resolving deltas: 84% (54/64)
Resolving deltas: 85% (55/64)
Resolving deltas: 87% (56/64)
Resolving deltas: 89% (57/64)
Resolving deltas: 90% (58/64)
Resolving deltas: 92% (59/64)
Resolving deltas: 93% (60/64)
Resolving deltas: 95% (61/64)
Resolving deltas: 96% (62/64)
Resolving deltas: 98% (63/64)
Resolving deltas: 100% (64/64)
Resolving deltas: 100% (64/64), completed with 18 local objects.
From https://github.com/python/cpython
* branch main -> FETCH_HEAD
Note: switching to 'e670a113b5e1fcc3ce3bb9b5b4b1f126264ae21b'.
You are in 'detached HEAD' state. You can look around, make experimental
changes and commit them, and you can discard any commits you make in this
state without impacting any branches by switching back to a branch.
If you want to create a new branch to retain commits you create, you may
do so (now or later) by using -c with the switch command. Example:
git switch -c <new-branch-name>
Or undo this operation with:
git switch -
Turn off this advice by setting config variable advice.detachedHead to false
HEAD is now at e670a113b5e gh-123978: Remove broken time.thread_time() on NetBSD (GH-124116)
Switched to and reset branch 'main'
configure: WARNING: no system libmpdecimal found; falling back to bundled libmpdecimal (deprecated and scheduled for removal in Python 3.15)
find: ‘build’: No such file or directory
find: ‘build’: No such file or directory
find: ‘build’: No such file or directory
find: ‘build’: No such file or directory
make[2]: [Makefile:3181: clean-retain-profile] Error 1 (ignored)
Parser/pegen.c: In function ‘_PyPegen_fill_token’:
Parser/pegen.c:201:25: note: the layout of aggregates containing vectors with 8-byte alignment has changed in GCC 5
201 | parser_token->level = new_token->level;
| ~~~~~~~~~~~~~~~~~~~~^~~~~~~~~~~~~~~~~~
Objects/dictobject.c: In function ‘copy_values’:
Objects/dictobject.c:3942:29: note: the layout of aggregates containing vectors with 1-byte alignment has changed in GCC 5
3942 | newvalues->size = values->size;
| ~~~~~~^~~~~~
Python/flowgraph.c: In function ‘basicblock_add_jump’:
Python/flowgraph.c:197:1: note: the layout of aggregates containing vectors with 8-byte alignment has changed in GCC 5
197 | basicblock_add_jump(basicblock *b, int opcode, basicblock *target, location loc)
| ^~~~~~~~~~~~~~~~~~~
Python/preconfig.c: In function ‘_PyPreCmdline_SetConfig’:
Python/preconfig.c:165:27: note: the layout of aggregates containing vectors with 8-byte alignment has changed in GCC 5
165 | config->ATTR = cmdline->ATTR
| ^
./Modules/_sre/sre_lib.h: In function ‘sre_ucs1_match’:
./Modules/_sre/sre.c:274:16: note: the layout of aggregates containing vectors with 8-byte alignment has changed in GCC 5
274 | #define SRE(F) sre_ucs1_##F
| ^~~~~~~~~
./Modules/_interpqueuesmodule.c: In function ‘queuesmod_list_all’:
./Modules/_interpqueuesmodule.c:1542:1: note: the layout of aggregates containing vectors with 8-byte alignment has changed in GCC 5
1542 | queuesmod_list_all(PyObject *self, PyObject *Py_UNUSED(ignored))
| ^~~~~~~~~~~~~~~~~~
./Modules/_interpchannelsmodule.c: In function ‘_channelid_shared’:
./Modules/_interpchannelsmodule.c:2588:1: note: the layout of aggregates containing vectors with 8-byte alignment has changed in GCC 5
2588 | _channelid_shared(PyThreadState *tstate, PyObject *obj,
| ^~~~~~~~~~~~~~~~~
./Modules/_datetimemodule.c: In function ‘delta_positive’:
./Modules/_datetimemodule.c:2472:1: note: the layout of aggregates containing vectors with 8-byte alignment has changed in GCC 5
2472 | delta_positive(PyDateTime_Delta *self)
| ^~~~~~~~~~~~~~
In file included from ./Modules/_hacl/internal/../Hacl_Hash_Blake2b.h:34,
from ./Modules/_hacl/internal/Hacl_Hash_Blake2b.h:39,
from ./Modules/_hacl/internal/Hacl_Hash_Blake2s.h:39,
from ./Modules/_hacl/Hacl_Hash_Blake2s.c:26:
./Modules/_hacl/Hacl_Hash_Blake2s.c: In function ‘python_hashlib_Hacl_Hash_Blake2s_copy’:
./Modules/_hacl/internal/../python_hacl_namespaces.h:146:32: note: the layout of aggregates containing vectors with 2-byte alignment has changed in GCC 5
146 | #define Hacl_Hash_Blake2s_copy python_hashlib_Hacl_Hash_Blake2s_copy
| ^~~~~~~~~~~~~~~~~~~~~~~~~~~~~~~~~~~~~
In file included from ./Modules/_hacl/internal/../Hacl_Hash_Blake2b.h:34,
from ./Modules/_hacl/internal/Hacl_Hash_Blake2b.h:39,
from ./Modules/_hacl/Hacl_Hash_Blake2b.c:26:
./Modules/_hacl/Hacl_Hash_Blake2b.c: In function ‘python_hashlib_Hacl_Hash_Blake2b_copy’:
./Modules/_hacl/internal/../python_hacl_namespaces.h:109:32: note: the layout of aggregates containing vectors with 2-byte alignment has changed in GCC 5
109 | #define Hacl_Hash_Blake2b_copy python_hashlib_Hacl_Hash_Blake2b_copy
| ^~~~~~~~~~~~~~~~~~~~~~~~~~~~~~~~~~~~~
./Modules/expat/xmlparse.c: In function ‘parserCreate’:
./Modules/expat/xmlparse.c:1064:1: note: the layout of aggregates containing vectors with 4-byte alignment has changed in GCC 5
1064 | parserCreate(const XML_Char *encodingName,
| ^~~~~~~~~~~~
./Modules/socketmodule.c: In function ‘sock_sendmsg’:
./Modules/socketmodule.c:4667:1: note: the layout of aggregates containing vectors with 8-byte alignment has changed in GCC 5
4667 | sock_sendmsg(PySocketSockObject *s, PyObject *args)
| ^~~~~~~~~~~~
./Modules/_testinternalcapi.c: In function ‘reset_rare_event_counters’:
./Modules/_testinternalcapi.c:1944:1: note: the layout of aggregates containing vectors with 4-byte alignment has changed in GCC 5
1944 | reset_rare_event_counters(PyObject *self, PyObject *Py_UNUSED(type))
| ^~~~~~~~~~~~~~~~~~~~~~~~~
./Modules/_ctypes/_ctypes.c: In function ‘PyCSimpleType_init’:
./Modules/_ctypes/_ctypes.c:2174:1: note: the layout of aggregates containing vectors with 4-byte alignment has changed in GCC 5
2174 | PyCSimpleType_init(PyObject *self, PyObject *args, PyObject *kwds)
| ^~~~~~~~~~~~~~~~~~
./Modules/_testcapi/heaptype.c: In function ‘heapctypewithbuffer_getbuffer’:
./Modules/_testcapi/heaptype.c:721:21: note: the layout of aggregates containing vectors with 4-byte alignment has changed in GCC 5
721 | self->buffer[0] = '1';
| ~~~~~~~~~~~~~~~~^~~~~
./Modules/_interpchannelsmodule.c: In function ‘_channelid_shared’:
./Modules/_interpchannelsmodule.c:2588:1: note: the layout of aggregates containing vectors with 8-byte alignment has changed in GCC 5
2588 | _channelid_shared(PyThreadState *tstate, PyObject *obj,
| ^
./Modules/_interpqueuesmodule.c: In function ‘queuesmod_list_all’:
./Modules/_interpqueuesmodule.c:1542:1: note: the layout of aggregates containing vectors with 8-byte alignment has changed in GCC 5
1542 | queuesmod_list_all(PyObject *self, PyObject *Py_UNUSED(ignored))
| ^
./Modules/_datetimemodule.c: In function ‘delta_positive’:
./Modules/_datetimemodule.c:2472:1: note: the layout of aggregates containing vectors with 8-byte alignment has changed in GCC 5
2472 | delta_positive(PyDateTime_Delta *self)
| ^
./Modules/_testinternalcapi.c: In function ‘reset_rare_event_counters’:
./Modules/_testinternalcapi.c:1944:1: note: the layout of aggregates containing vectors with 4-byte alignment has changed in GCC 5
1944 | reset_rare_event_counters(PyObject *self, PyObject *Py_UNUSED(type))
| ^
./Modules/socketmodule.c: In function ‘sock_sendmsg’:
./Modules/socketmodule.c:4667:1: note: the layout of aggregates containing vectors with 8-byte alignment has changed in GCC 5
4667 | sock_sendmsg(PySocketSockObject *s, PyObject *args)
| ^
./Modules/_testcapi/heaptype.c: In function ‘heapctypewithbuffer_getbuffer’:
./Modules/_testcapi/heaptype.c:721:21: note: the layout of aggregates containing vectors with 4-byte alignment has changed in GCC 5
721 | self->buffer[0] = '1';
| ^
In file included from ./Modules/pyexpat.c:95:
./Modules/clinic/pyexpat.c.h: In function ‘pyexpat_xmlparser_ExternalEntityParserCreate’:
./Modules/clinic/pyexpat.c.h:250:1: note: the layout of aggregates containing vectors with 8-byte alignment has changed in GCC 5
250 | pyexpat_xmlparser_ExternalEntityParserCreate(xmlparseobject *self, PyTypeObject *cls, PyObject *const *args, Py_ssize_t nargs, PyObject *kwnames)
| ^~~~~~~~~~~~~~~~~~~~~~~~~~~~~~~~~~~~~~~~~~~~
./Modules/_ctypes/_ctypes.c: In function ‘PyCSimpleType_init’:
./Modules/_ctypes/_ctypes.c:2174:1: note: the layout of aggregates containing vectors with 4-byte alignment has changed in GCC 5
2174 | PyCSimpleType_init(PyObject *self, PyObject *args, PyObject *kwds)
| ^
./Modules/_hacl/Hacl_Hash_Blake2s.c: In function ‘python_hashlib_Hacl_Hash_Blake2s_info’:
./Modules/_hacl/Hacl_Hash_Blake2s.c:1262:5: note: the layout of aggregates containing vectors with 2-byte alignment has changed in GCC 5
1262 | ((Hacl_Hash_Blake2b_index){ .key_length = kk, .digest_length = nn, .last_node = last_node });
| ^
./Modules/expat/xmlparse.c: In function ‘parserCreate’:
./Modules/expat/xmlparse.c:1064:1: note: the layout of aggregates containing vectors with 4-byte alignment has changed in GCC 5
1064 | parserCreate(const XML_Char *encodingName,
| ^
Python/preconfig.c: In function ‘_PyPreCmdline_SetConfig’:
Python/preconfig.c:172:5: note: the layout of aggregates containing vectors with 8-byte alignment has changed in GCC 5
172 | COPY_ATTR(isolated);
| ^
Python/preconfig.c: In function ‘_PyPreCmdline_SetConfig’:
Python/preconfig.c:172:5: note: the layout of aggregates containing vectors with 8-byte alignment has changed in GCC 5
172 | COPY_ATTR(isolated);
| ^
Python/preconfig.c: In function ‘_PyPreCmdline_SetConfig’:
Python/preconfig.c:172:5: note: the layout of aggregates containing vectors with 8-byte alignment has changed in GCC 5
172 | COPY_ATTR(isolated);
| ^
Parser/pegen.c: In function ‘_PyPegen_fill_token’:
Parser/pegen.c:241:1: note: the layout of aggregates containing vectors with 8-byte alignment has changed in GCC 5
241 | _PyPegen_fill_token(Parser *p)
| ^~~~~~~~~~~~~~~~~~~
Objects/dictobject.c: In function ‘copy_values’:
Objects/dictobject.c:3942:29: note: the layout of aggregates containing vectors with 1-byte alignment has changed in GCC 5
3942 | newvalues->size = values->size;
| ~~~~~~^~~~~~
Python/flowgraph.c: In function ‘_PyCfgBuilder_Addop’:
Python/flowgraph.c:469:1: note: the layout of aggregates containing vectors with 8-byte alignment has changed in GCC 5
469 | _PyCfgBuilder_Addop(cfg_builder *g, int opcode, int oparg, location loc)
| ^~~~~~~~~~~~~~~~~~~
Python/preconfig.c: In function ‘_PyPreCmdline_SetConfig’:
Python/preconfig.c:165:27: note: the layout of aggregates containing vectors with 8-byte alignment has changed in GCC 5
165 | config->ATTR = cmdline->ATTR
| ^
./Modules/_sre/sre_lib.h: In function ‘sre_ucs1_match’:
./Modules/_sre/sre.c:274:16: note: the layout of aggregates containing vectors with 8-byte alignment has changed in GCC 5
274 | #define SRE(F) sre_ucs1_##F
| ^~~~~~~~~
./Modules/_io/textio.c: In function ‘textiowrapper_build_cookie’:
./Modules/_io/textio.c:2425:1: note: the layout of aggregates containing vectors with 8-byte alignment has changed in GCC 5
2425 | textiowrapper_build_cookie(cookie_type *cookie)
| ^~~~~~~~~~~~~~~~~~~~~~~~~~
./Modules/_interpchannelsmodule.c: In function ‘_channelid_shared’:
./Modules/_interpchannelsmodule.c:2588:1: note: the layout of aggregates containing vectors with 8-byte alignment has changed in GCC 5
2588 | _channelid_shared(PyThreadState *tstate, PyObject *obj,
| ^~~~~~~~~~~~~~~~~
./Modules/_interpqueuesmodule.c: In function ‘queuesmod_list_all’:
./Modules/_interpqueuesmodule.c:1542:1: note: the layout of aggregates containing vectors with 8-byte alignment has changed in GCC 5
1542 | queuesmod_list_all(PyObject *self, PyObject *Py_UNUSED(ignored))
| ^~~~~~~~~~~~~~~~~~
In function ‘word_to_string’,
inlined from ‘coeff_to_string’ at ./Modules/_decimal/libmpdec/io.c:411:13,
inlined from ‘_mpd_to_string’ at ./Modules/_decimal/libmpdec/io.c:612:18:
./Modules/_decimal/libmpdec/io.c:349:40: warning: writing 1 byte into a region of size 0 [-Wstringop-overflow=]
349 | if (s == dot) *s++ = '.'; *s++ = '0' + (char)(x / d); x %= d
| ~~~~~^~~~~~~~~~~~~~~~~~~~~
./Modules/_decimal/libmpdec/io.c:349:40: warning: writing 1 byte into a region of size 0 [-Wstringop-overflow=]
349 | if (s == dot) *s++ = '.'; *s++ = '0' + (char)(x / d); x %= d
| ~~~~~^~~~~~~~~~~~~~~~~~~~~
./Modules/_decimal/libmpdec/io.c:349:40: warning: writing 1 byte into a region of size 0 [-Wstringop-overflow=]
349 | if (s == dot) *s++ = '.'; *s++ = '0' + (char)(x / d); x %= d
| ~~~~~^~~~~~~~~~~~~~~~~~~~~
./Modules/_decimal/libmpdec/io.c:349:40: warning: writing 1 byte into a region of size 0 [-Wstringop-overflow=]
349 | if (s == dot) *s++ = '.'; *s++ = '0' + (char)(x / d); x %= d
| ~~~~~^~~~~~~~~~~~~~~~~~~~~
./Modules/_decimal/libmpdec/io.c:349:40: warning: writing 1 byte into a region of size 0 [-Wstringop-overflow=]
349 | if (s == dot) *s++ = '.'; *s++ = '0' + (char)(x / d); x %= d
| ~~~~~^~~~~~~~~~~~~~~~~~~~~
./Modules/_decimal/libmpdec/io.c:349:40: warning: writing 1 byte into a region of size 0 [-Wstringop-overflow=]
349 | if (s == dot) *s++ = '.'; *s++ = '0' + (char)(x / d); x %= d
| ~~~~~^~~~~~~~~~~~~~~~~~~~~
./Modules/_decimal/libmpdec/io.c:349:40: warning: writing 1 byte into a region of size 0 [-Wstringop-overflow=]
349 | if (s == dot) *s++ = '.'; *s++ = '0' + (char)(x / d); x %= d
| ~~~~~^~~~~~~~~~~~~~~~~~~~~
./Modules/_decimal/libmpdec/io.c:349:40: warning: writing 1 byte into a region of size 0 [-Wstringop-overflow=]
349 | if (s == dot) *s++ = '.'; *s++ = '0' + (char)(x / d); x %= d
| ~~~~~^~~~~~~~~~~~~~~~~~~~~
./Modules/_decimal/libmpdec/io.c:349:40: warning: writing 1 byte into a region of size 0 [-Wstringop-overflow=]
349 | if (s == dot) *s++ = '.'; *s++ = '0' + (char)(x / d); x %= d
| ~~~~~^~~~~~~~~~~~~~~~~~~~~
./Modules/_decimal/libmpdec/io.c:349:40: warning: writing 1 byte into a region of size 0 [-Wstringop-overflow=]
349 | if (s == dot) *s++ = '.'; *s++ = '0' + (char)(x / d); x %= d
| ~~~~~^~~~~~~~~~~~~~~~~~~~~
./Modules/_decimal/libmpdec/io.c:349:40: warning: writing 1 byte into a region of size 0 [-Wstringop-overflow=]
349 | if (s == dot) *s++ = '.'; *s++ = '0' + (char)(x / d); x %= d
| ~~~~~^~~~~~~~~~~~~~~~~~~~~
./Modules/_decimal/libmpdec/io.c:349:40: warning: writing 1 byte into a region of size 0 [-Wstringop-overflow=]
349 | if (s == dot) *s++ = '.'; *s++ = '0' + (char)(x / d); x %= d
| ~~~~~^~~~~~~~~~~~~~~~~~~~~
./Modules/_decimal/libmpdec/io.c:349:40: warning: writing 1 byte into a region of size 0 [-Wstringop-overflow=]
349 | if (s == dot) *s++ = '.'; *s++ = '0' + (char)(x / d); x %= d
| ~~~~~^~~~~~~~~~~~~~~~~~~~~
./Modules/_decimal/libmpdec/io.c:349:40: warning: writing 1 byte into a region of size 0 [-Wstringop-overflow=]
349 | if (s == dot) *s++ = '.'; *s++ = '0' + (char)(x / d); x %= d
| ~~~~~^~~~~~~~~~~~~~~~~~~~~
./Modules/_decimal/libmpdec/io.c:349:40: warning: writing 1 byte into a region of size 0 [-Wstringop-overflow=]
349 | if (s == dot) *s++ = '.'; *s++ = '0' + (char)(x / d); x %= d
| ~~~~~^~~~~~~~~~~~~~~~~~~~~
./Modules/_decimal/libmpdec/io.c:349:40: warning: writing 1 byte into a region of size 0 [-Wstringop-overflow=]
349 | if (s == dot) *s++ = '.'; *s++ = '0' + (char)(x / d); x %= d
| ~~~~~^~~~~~~~~~~~~~~~~~~~~
./Modules/_decimal/libmpdec/io.c:349:40: warning: writing 1 byte into a region of size 0 [-Wstringop-overflow=]
349 | if (s == dot) *s++ = '.'; *s++ = '0' + (char)(x / d); x %= d
| ~~~~~^~~~~~~~~~~~~~~~~~~~~
./Modules/_decimal/libmpdec/io.c:349:40: warning: writing 1 byte into a region of size 0 [-Wstringop-overflow=]
349 | if (s == dot) *s++ = '.'; *s++ = '0' + (char)(x / d); x %= d
| ~~~~~^~~~~~~~~~~~~~~~~~~~~
./Modules/_decimal/libmpdec/io.c:349:40: warning: writing 1 byte into a region of size 0 [-Wstringop-overflow=]
349 | if (s == dot) *s++ = '.'; *s++ = '0' + (char)(x / d); x %= d
| ~~~~~^~~~~~~~~~~~~~~~~~~~~
./Modules/_decimal/libmpdec/io.c:349:40: warning: writing 1 byte into a region of size 0 [-Wstringop-overflow=]
349 | if (s == dot) *s++ = '.'; *s++ = '0' + (char)(x / d); x %= d
| ~~~~~^~~~~~~~~~~~~~~~~~~~~
./Modules/_decimal/libmpdec/io.c:349:40: warning: writing 1 byte into a region of size 0 [-Wstringop-overflow=]
349 | if (s == dot) *s++ = '.'; *s++ = '0' + (char)(x / d); x %= d
| ~~~~~^~~~~~~~~~~~~~~~~~~~~
./Modules/_decimal/libmpdec/io.c:349:40: warning: writing 1 byte into a region of size 0 [-Wstringop-overflow=]
349 | if (s == dot) *s++ = '.'; *s++ = '0' + (char)(x / d); x %= d
| ~~~~~^~~~~~~~~~~~~~~~~~~~~
./Modules/_decimal/libmpdec/io.c:349:40: warning: writing 1 byte into a region of size 0 [-Wstringop-overflow=]
349 | if (s == dot) *s++ = '.'; *s++ = '0' + (char)(x / d); x %= d
| ~~~~~^~~~~~~~~~~~~~~~~~~~~
./Modules/_decimal/libmpdec/io.c:349:40: warning: writing 1 byte into a region of size 0 [-Wstringop-overflow=]
349 | if (s == dot) *s++ = '.'; *s++ = '0' + (char)(x / d); x %= d
| ~~~~~^~~~~~~~~~~~~~~~~~~~~
./Modules/_decimal/libmpdec/io.c:349:40: warning: writing 1 byte into a region of size 0 [-Wstringop-overflow=]
349 | if (s == dot) *s++ = '.'; *s++ = '0' + (char)(x / d); x %= d
| ~~~~~^~~~~~~~~~~~~~~~~~~~~
./Modules/_decimal/libmpdec/io.c:349:40: warning: writing 1 byte into a region of size 0 [-Wstringop-overflow=]
349 | if (s == dot) *s++ = '.'; *s++ = '0' + (char)(x / d); x %= d
| ~~~~~^~~~~~~~~~~~~~~~~~~~~
./Modules/_decimal/libmpdec/io.c:349:40: warning: writing 1 byte into a region of size 0 [-Wstringop-overflow=]
349 | if (s == dot) *s++ = '.'; *s++ = '0' + (char)(x / d); x %= d
| ~~~~~^~~~~~~~~~~~~~~~~~~~~
./Modules/_decimal/libmpdec/io.c:349:40: warning: writing 1 byte into a region of size 0 [-Wstringop-overflow=]
349 | if (s == dot) *s++ = '.'; *s++ = '0' + (char)(x / d); x %= d
| ~~~~~^~~~~~~~~~~~~~~~~~~~~
./Modules/_decimal/libmpdec/io.c:349:40: warning: writing 1 byte into a region of size 0 [-Wstringop-overflow=]
349 | if (s == dot) *s++ = '.'; *s++ = '0' + (char)(x / d); x %= d
| ~~~~~^~~~~~~~~~~~~~~~~~~~~
./Modules/_decimal/libmpdec/io.c:349:40: warning: writing 1 byte into a region of size 0 [-Wstringop-overflow=]
349 | if (s == dot) *s++ = '.'; *s++ = '0' + (char)(x / d); x %= d
| ~~~~~^~~~~~~~~~~~~~~~~~~~~
./Modules/_decimal/libmpdec/io.c:349:40: warning: writing 1 byte into a region of size 0 [-Wstringop-overflow=]
./Modules/_decimal/libmpdec/io.c:349:40: warning: writing 1 byte into a region of size 0 [-Wstringop-overflow=]
349 | if (s == dot) *s++ = '.'; *s++ = '0' + (char)(x / d); x %= d
| ~~~~~^~~~~~~~~~~~~~~~~~~~~
./Modules/_decimal/libmpdec/io.c:349:40: warning: writing 1 byte into a region of size 0 [-Wstringop-overflow=]
In function ‘word_to_string’,
inlined from ‘coeff_to_string’ at ./Modules/_decimal/libmpdec/io.c:411:13,
inlined from ‘_mpd_to_string’ at ./Modules/_decimal/libmpdec/io.c:608:18:
./Modules/_decimal/libmpdec/io.c:349:40: warning: writing 1 byte into a region of size 0 [-Wstringop-overflow=]
349 | if (s == dot) *s++ = '.'; *s++ = '0' + (char)(x / d); x %= d
| ~~~~~^~~~~~~~~~~~~~~~~~~~~
./Modules/_decimal/libmpdec/io.c:349:40: warning: writing 1 byte into a region of size 0 [-Wstringop-overflow=]
349 | if (s == dot) *s++ = '.'; *s++ = '0' + (char)(x / d); x %= d
| ~~~~~^~~~~~~~~~~~~~~~~~~~~
./Modules/_decimal/libmpdec/io.c:349:40: warning: writing 1 byte into a region of size 0 [-Wstringop-overflow=]
349 | if (s == dot) *s++ = '.'; *s++ = '0' + (char)(x / d); x %= d
| ~~~~~^~~~~~~~~~~~~~~~~~~~~
./Modules/_decimal/libmpdec/io.c:349:40: warning: writing 1 byte into a region of size 0 [-Wstringop-overflow=]
349 | if (s == dot) *s++ = '.'; *s++ = '0' + (char)(x / d); x %= d
| ~~~~~^~~~~~~~~~~~~~~~~~~~~
./Modules/_decimal/libmpdec/io.c:349:40: warning: writing 1 byte into a region of size 0 [-Wstringop-overflow=]
349 | if (s == dot) *s++ = '.'; *s++ = '0' + (char)(x / d); x %= d
| ~~~~~^~~~~~~~~~~~~~~~~~~~~
./Modules/_decimal/libmpdec/io.c:349:40: warning: writing 1 byte into a region of size 0 [-Wstringop-overflow=]
349 | if (s == dot) *s++ = '.'; *s++ = '0' + (char)(x / d); x %= d
| ~~~~~^~~~~~~~~~~~~~~~~~~~~
./Modules/_decimal/libmpdec/io.c:349:40: warning: writing 1 byte into a region of size 0 [-Wstringop-overflow=]
349 | if (s == dot) *s++ = '.'; *s++ = '0' + (char)(x / d); x %= d
| ~~~~~^~~~~~~~~~~~~~~~~~~~~
./Modules/_decimal/libmpdec/io.c:349:40: warning: writing 1 byte into a region of size 0 [-Wstringop-overflow=]
349 | if (s == dot) *s++ = '.'; *s++ = '0' + (char)(x / d); x %= d
| ~~~~~^~~~~~~~~~~~~~~~~~~~~
./Modules/_decimal/libmpdec/io.c:349:40: warning: writing 1 byte into a region of size 0 [-Wstringop-overflow=]
349 | if (s == dot) *s++ = '.'; *s++ = '0' + (char)(x / d); x %= d
| ~~~~~^~~~~~~~~~~~~~~~~~~~~
./Modules/_decimal/libmpdec/io.c:349:40: warning: writing 1 byte into a region of size 0 [-Wstringop-overflow=]
349 | if (s == dot) *s++ = '.'; *s++ = '0' + (char)(x / d); x %= d
| ~~~~~^~~~~~~~~~~~~~~~~~~~~
./Modules/_decimal/libmpdec/io.c:349:40: warning: writing 1 byte into a region of size 0 [-Wstringop-overflow=]
349 | if (s == dot) *s++ = '.'; *s++ = '0' + (char)(x / d); x %= d
| ~~~~~^~~~~~~~~~~~~~~~~~~~~
./Modules/_decimal/libmpdec/io.c:349:40: warning: writing 1 byte into a region of size 0 [-Wstringop-overflow=]
349 | if (s == dot) *s++ = '.'; *s++ = '0' + (char)(x / d); x %= d
| ~~~~~^~~~~~~~~~~~~~~~~~~~~
./Modules/_decimal/libmpdec/io.c:349:40: warning: writing 1 byte into a region of size 0 [-Wstringop-overflow=]
349 | if (s == dot) *s++ = '.'; *s++ = '0' + (char)(x / d); x %= d
| ~~~~~^~~~~~~~~~~~~~~~~~~~~
./Modules/_decimal/libmpdec/io.c:349:40: warning: writing 1 byte into a region of size 0 [-Wstringop-overflow=]
349 | if (s == dot) *s++ = '.'; *s++ = '0' + (char)(x / d); x %= d
| ~~~~~^~~~~~~~~~~~~~~~~~~~~
./Modules/_decimal/libmpdec/io.c:349:40: warning: writing 1 byte into a region of size 0 [-Wstringop-overflow=]
349 | if (s == dot) *s++ = '.'; *s++ = '0' + (char)(x / d); x %= d
| ~~~~~^~~~~~~~~~~~~~~~~~~~~
./Modules/_decimal/libmpdec/io.c:349:40: warning: writing 1 byte into a region of size 0 [-Wstringop-overflow=]
349 | if (s == dot) *s++ = '.'; *s++ = '0' + (char)(x / d); x %= d
| ~~~~~^~~~~~~~~~~~~~~~~~~~~
./Modules/_decimal/libmpdec/io.c:349:40: warning: writing 1 byte into a region of size 0 [-Wstringop-overflow=]
349 | if (s == dot) *s++ = '.'; *s++ = '0' + (char)(x / d); x %= d
| ~~~~~^~~~~~~~~~~~~~~~~~~~~
./Modules/_decimal/libmpdec/io.c:349:40: warning: writing 1 byte into a region of size 0 [-Wstringop-overflow=]
349 | if (s == dot) *s++ = '.'; *s++ = '0' + (char)(x / d); x %= d
| ~~~~~^~~~~~~~~~~~~~~~~~~~~
./Modules/_decimal/libmpdec/io.c:349:40: warning: writing 1 byte into a region of size 0 [-Wstringop-overflow=]
349 | if (s == dot) *s++ = '.'; *s++ = '0' + (char)(x / d); x %= d
| ~~~~~^~~~~~~~~~~~~~~~~~~~~
./Modules/_decimal/libmpdec/io.c:349:40: warning: writing 1 byte into a region of size 0 [-Wstringop-overflow=]
349 | if (s == dot) *s++ = '.'; *s++ = '0' + (char)(x / d); x %= d
| ~~~~~^~~~~~~~~~~~~~~~~~~~~
./Modules/_decimal/libmpdec/io.c:349:40: warning: writing 1 byte into a region of size 0 [-Wstringop-overflow=]
349 | if (s == dot) *s++ = '.'; *s++ = '0' + (char)(x / d); x %= d
| ~~~~~^~~~~~~~~~~~~~~~~~~~~
./Modules/_decimal/libmpdec/io.c:349:40: warning: writing 1 byte into a region of size 0 [-Wstringop-overflow=]
349 | if (s == dot) *s++ = '.'; *s++ = '0' + (char)(x / d); x %= d
| ~~~~~^~~~~~~~~~~~~~~~~~~~~
./Modules/_decimal/libmpdec/io.c:349:40: warning: writing 1 byte into a region of size 0 [-Wstringop-overflow=]
349 | if (s == dot) *s++ = '.'; *s++ = '0' + (char)(x / d); x %= d
| ~~~~~^~~~~~~~~~~~~~~~~~~~~
./Modules/_decimal/libmpdec/io.c:349:40: warning: writing 1 byte into a region of size 0 [-Wstringop-overflow=]
349 | if (s == dot) *s++ = '.'; *s++ = '0' + (char)(x / d); x %= d
| ~~~~~^~~~~~~~~~~~~~~~~~~~~
./Modules/_decimal/libmpdec/io.c:349:40: warning: writing 1 byte into a region of size 0 [-Wstringop-overflow=]
349 | if (s == dot) *s++ = '.'; *s++ = '0' + (char)(x / d); x %= d
| ~~~~~^~~~~~~~~~~~~~~~~~~~~
./Modules/_decimal/libmpdec/io.c:349:40: warning: writing 1 byte into a region of size 0 [-Wstringop-overflow=]
349 | if (s == dot) *s++ = '.'; *s++ = '0' + (char)(x / d); x %= d
| ~~~~~^~~~~~~~~~~~~~~~~~~~~
./Modules/_decimal/libmpdec/io.c:349:40: warning: writing 1 byte into a region of size 0 [-Wstringop-overflow=]
349 | if (s == dot) *s++ = '.'; *s++ = '0' + (char)(x / d); x %= d
| ~~~~~^~~~~~~~~~~~~~~~~~~~~
./Modules/_decimal/libmpdec/io.c:349:40: warning: writing 1 byte into a region of size 0 [-Wstringop-overflow=]
349 | if (s == dot) *s++ = '.'; *s++ = '0' + (char)(x / d); x %= d
| ~~~~~^~~~~~~~~~~~~~~~~~~~~
./Modules/_decimal/libmpdec/io.c:349:40: warning: writing 1 byte into a region of size 0 [-Wstringop-overflow=]
349 | if (s == dot) *s++ = '.'; *s++ = '0' + (char)(x / d); x %= d
| ~~~~~^~~~~~~~~~~~~~~~~~~~~
./Modules/_decimal/libmpdec/io.c:349:40: warning: writing 1 byte into a region of size 0 [-Wstringop-overflow=]
349 | if (s == dot) *s++ = '.'; *s++ = '0' + (char)(x / d); x %= d
| ~~~~~^~~~~~~~~~~~~~~~~~~~~
./Modules/_decimal/libmpdec/io.c:349:40: warning: writing 1 byte into a region of size 0 [-Wstringop-overflow=]
349 | if (s == dot) *s++ = '.'; *s++ = '0' + (char)(x / d); x %= d
| ~~~~~^~~~~~~~~~~~~~~~~~~~~
./Modules/_decimal/libmpdec/io.c:349:40: warning: writing 1 byte into a region of size 0 [-Wstringop-overflow=]
349 | if (s == dot) *s++ = '.'; *s++ = '0' + (char)(x / d); x %= d
| ~~~~~^~~~~~~~~~~~~~~~~~~~~
./Modules/_decimal/libmpdec/io.c:349:40: warning: writing 1 byte into a region of size 0 [-Wstringop-overflow=]
349 | if (s == dot) *s++ = '.'; *s++ = '0' + (char)(x / d); x %= d
| ~~~~~^~~~~~~~~~~~~~~~~~~~~
./Modules/expat/xmlparse.c: In function ‘parserCreate’:
./Modules/expat/xmlparse.c:1064:1: note: the layout of aggregates containing vectors with 4-byte alignment has changed in GCC 5
1064 | parserCreate(const XML_Char *encodingName,
| ^~~~~~~~~~~~
./Modules/_hacl/Hacl_Hash_Blake2b.c: In function ‘python_hashlib_Hacl_Hash_Blake2b_info’:
./Modules/_hacl/Hacl_Hash_Blake2b.c:1308:5: note: the layout of aggregates containing vectors with 2-byte alignment has changed in GCC 5
1308 | ((Hacl_Hash_Blake2b_index){ .key_length = kk, .digest_length = nn, .last_node = last_node });
| ^
./Modules/_hacl/Hacl_Hash_Blake2s.c: In function ‘python_hashlib_Hacl_Hash_Blake2s_info’:
./Modules/_hacl/Hacl_Hash_Blake2s.c:1262:5: note: the layout of aggregates containing vectors with 2-byte alignment has changed in GCC 5
1262 | ((Hacl_Hash_Blake2b_index){ .key_length = kk, .digest_length = nn, .last_node = last_node });
| ^
./Modules/_ctypes/_ctypes.c: In function ‘PyCSimpleType_init’:
./Modules/_ctypes/_ctypes.c:2174:1: note: the layout of aggregates containing vectors with 4-byte alignment has changed in GCC 5
2174 | PyCSimpleType_init(PyObject *self, PyObject *args, PyObject *kwds)
| ^~~~~~~~~~~~~~~~~~
./Modules/socketmodule.c: In function ‘sock_sendmsg’:
./Modules/socketmodule.c:4667:1: note: the layout of aggregates containing vectors with 8-byte alignment has changed in GCC 5
4667 | sock_sendmsg(PySocketSockObject *s, PyObject *args)
| ^~~~~~~~~~~~
./Modules/_testinternalcapi.c: In function ‘reset_rare_event_counters’:
./Modules/_testinternalcapi.c:1944:1: note: the layout of aggregates containing vectors with 4-byte alignment has changed in GCC 5
1944 | reset_rare_event_counters(PyObject *self, PyObject *Py_UNUSED(type))
| ^~~~~~~~~~~~~~~~~~~~~~~~~
./Modules/_testcapi/heaptype.c: In function ‘heapctypewithbuffer_getbuffer’:
./Modules/_testcapi/heaptype.c:721:21: note: the layout of aggregates containing vectors with 4-byte alignment has changed in GCC 5
721 | self->buffer[0] = '1';
| ~~~~~~~~~~~~~~~~^~~~~
./Modules/_interpchannelsmodule.c: In function ‘_channelid_shared’:
./Modules/_interpchannelsmodule.c:2588:1: note: the layout of aggregates containing vectors with 8-byte alignment has changed in GCC 5
2588 | _channelid_shared(PyThreadState *tstate, PyObject *obj,
| ^
./Modules/_interpqueuesmodule.c: In function ‘queuesmod_list_all’:
./Modules/_interpqueuesmodule.c:1542:1: note: the layout of aggregates containing vectors with 8-byte alignment has changed in GCC 5
1542 | queuesmod_list_all(PyObject *self, PyObject *Py_UNUSED(ignored))
| ^
./Modules/_ctypes/_ctypes.c: In function ‘PyCSimpleType_init’:
./Modules/_ctypes/_ctypes.c:2174:1: note: the layout of aggregates containing vectors with 4-byte alignment has changed in GCC 5
2174 | PyCSimpleType_init(PyObject *self, PyObject *args, PyObject *kwds)
| ^
./Modules/socketmodule.c: In function ‘sock_sendmsg’:
./Modules/socketmodule.c:4667:1: note: the layout of aggregates containing vectors with 8-byte alignment has changed in GCC 5
4667 | sock_sendmsg(PySocketSockObject *s, PyObject *args)
| ^
./Modules/_testinternalcapi.c: In function ‘reset_rare_event_counters’:
./Modules/_testinternalcapi.c:1944:1: note: the layout of aggregates containing vectors with 4-byte alignment has changed in GCC 5
1944 | reset_rare_event_counters(PyObject *self, PyObject *Py_UNUSED(type))
| ^
./Modules/_testcapi/heaptype.c: In function ‘heapctypewithbuffer_getbuffer’:
./Modules/_testcapi/heaptype.c:721:21: note: the layout of aggregates containing vectors with 4-byte alignment has changed in GCC 5
721 | self->buffer[0] = '1';
| ^
In file included from ./Modules/pyexpat.c:95:
./Modules/clinic/pyexpat.c.h: In function ‘pyexpat_xmlparser_ExternalEntityParserCreate’:
./Modules/clinic/pyexpat.c.h:250:1: note: the layout of aggregates containing vectors with 8-byte alignment has changed in GCC 5
250 | pyexpat_xmlparser_ExternalEntityParserCreate(xmlparseobject *self, PyTypeObject *cls, PyObject *const *args, Py_ssize_t nargs, PyObject *kwnames)
| ^~~~~~~~~~~~~~~~~~~~~~~~~~~~~~~~~~~~~~~~~~~~
./Modules/expat/xmlparse.c: In function ‘parserCreate’:
./Modules/expat/xmlparse.c:1064:1: note: the layout of aggregates containing vectors with 4-byte alignment has changed in GCC 5
1064 | parserCreate(const XML_Char *encodingName,
| ^
./Modules/clinic/blake2module.c.h: In function ‘_blake2_blake2b_copy’:
./Modules/clinic/blake2module.c.h:413:1: note: the layout of aggregates containing vectors with 2-byte alignment has changed in GCC 5
413 | _blake2_blake2b_copy(Blake2Object *self, PyObject *Py_UNUSED(ignored))
| ^
In function ‘word_to_string’,
inlined from ‘coeff_to_string’ at ./Modules/_decimal/libmpdec/io.c:411:13,
inlined from ‘_mpd_to_string’ at ./Modules/_decimal/libmpdec/io.c:608:18:
./Modules/_decimal/libmpdec/io.c:360:14: warning: writing 1 byte into a region of size 0 [-Wstringop-overflow=]
360 | case 15: EXTRACT_DIGIT(s, x, 100000000000000ULL, dot);
| ^
./Modules/_decimal/libmpdec/io.c:359:14: warning: writing 1 byte into a region of size 0 [-Wstringop-overflow=]
359 | case 16: EXTRACT_DIGIT(s, x, 1000000000000000ULL, dot);
| ^
./Modules/_decimal/libmpdec/io.c:360:14: warning: writing 1 byte into a region of size 0 [-Wstringop-overflow=]
360 | case 15: EXTRACT_DIGIT(s, x, 100000000000000ULL, dot);
| ^
./Modules/_decimal/libmpdec/io.c:361:14: warning: writing 1 byte into a region of size 0 [-Wstringop-overflow=]
361 | case 14: EXTRACT_DIGIT(s, x, 10000000000000ULL, dot);
| ^
./Modules/_decimal/libmpdec/io.c:358:14: warning: writing 1 byte into a region of size 0 [-Wstringop-overflow=]
358 | case 17: EXTRACT_DIGIT(s, x, 10000000000000000ULL, dot);
| ^
./Modules/_decimal/libmpdec/io.c:357:14: warning: writing 1 byte into a region of size 0 [-Wstringop-overflow=]
357 | case 18: EXTRACT_DIGIT(s, x, 100000000000000000ULL, dot);
| ^
./Modules/_decimal/libmpdec/io.c:358:14: warning: writing 1 byte into a region of size 0 [-Wstringop-overflow=]
358 | case 17: EXTRACT_DIGIT(s, x, 10000000000000000ULL, dot);
| ^
./Modules/_decimal/libmpdec/io.c:359:14: warning: writing 1 byte into a region of size 0 [-Wstringop-overflow=]
359 | case 16: EXTRACT_DIGIT(s, x, 1000000000000000ULL, dot);
| ^
./Modules/_decimal/libmpdec/io.c:362:14: warning: writing 1 byte into a region of size 0 [-Wstringop-overflow=]
362 | case 13: EXTRACT_DIGIT(s, x, 1000000000000ULL, dot);
| ^
./Modules/_decimal/libmpdec/io.c:361:14: warning: writing 1 byte into a region of size 0 [-Wstringop-overflow=]
361 | case 14: EXTRACT_DIGIT(s, x, 10000000000000ULL, dot);
| ^
./Modules/_decimal/libmpdec/io.c:362:14: warning: writing 1 byte into a region of size 0 [-Wstringop-overflow=]
362 | case 13: EXTRACT_DIGIT(s, x, 1000000000000ULL, dot);
| ^
./Modules/_decimal/libmpdec/io.c:363:14: warning: writing 1 byte into a region of size 0 [-Wstringop-overflow=]
363 | case 12: EXTRACT_DIGIT(s, x, 100000000000ULL, dot);
| ^
./Modules/_decimal/libmpdec/io.c:364:14: warning: writing 1 byte into a region of size 0 [-Wstringop-overflow=]
364 | case 11: EXTRACT_DIGIT(s, x, 10000000000ULL, dot);
| ^
./Modules/_decimal/libmpdec/io.c:363:14: warning: writing 1 byte into a region of size 0 [-Wstringop-overflow=]
363 | case 12: EXTRACT_DIGIT(s, x, 100000000000ULL, dot);
| ^
./Modules/_decimal/libmpdec/io.c:364:14: warning: writing 1 byte into a region of size 0 [-Wstringop-overflow=]
364 | case 11: EXTRACT_DIGIT(s, x, 10000000000ULL, dot);
| ^
./Modules/_decimal/libmpdec/io.c:366:14: warning: writing 1 byte into a region of size 0 [-Wstringop-overflow=]
366 | case 10: EXTRACT_DIGIT(s, x, 1000000000UL, dot);
| ^
./Modules/_decimal/libmpdec/io.c:367:14: warning: writing 1 byte into a region of size 0 [-Wstringop-overflow=]
367 | case 9: EXTRACT_DIGIT(s, x, 100000000UL, dot);
| ^
./Modules/_decimal/libmpdec/io.c:366:14: warning: writing 1 byte into a region of size 0 [-Wstringop-overflow=]
366 | case 10: EXTRACT_DIGIT(s, x, 1000000000UL, dot);
| ^
./Modules/_decimal/libmpdec/io.c:367:14: warning: writing 1 byte into a region of size 0 [-Wstringop-overflow=]
367 | case 9: EXTRACT_DIGIT(s, x, 100000000UL, dot);
| ^
./Modules/_decimal/libmpdec/io.c:368:14: warning: writing 1 byte into a region of size 0 [-Wstringop-overflow=]
368 | case 8: EXTRACT_DIGIT(s, x, 10000000UL, dot);
| ^
./Modules/_decimal/libmpdec/io.c:369:14: warning: writing 1 byte into a region of size 0 [-Wstringop-overflow=]
369 | case 7: EXTRACT_DIGIT(s, x, 1000000UL, dot);
| ^
./Modules/_decimal/libmpdec/io.c:368:14: warning: writing 1 byte into a region of size 0 [-Wstringop-overflow=]
368 | case 8: EXTRACT_DIGIT(s, x, 10000000UL, dot);
| ^
./Modules/_decimal/libmpdec/io.c:369:14: warning: writing 1 byte into a region of size 0 [-Wstringop-overflow=]
369 | case 7: EXTRACT_DIGIT(s, x, 1000000UL, dot);
| ^
./Modules/_decimal/libmpdec/io.c:370:14: warning: writing 1 byte into a region of size 0 [-Wstringop-overflow=]
370 | case 6: EXTRACT_DIGIT(s, x, 100000UL, dot);
| ^
./Modules/_decimal/libmpdec/io.c:371:14: warning: writing 1 byte into a region of size 0 [-Wstringop-overflow=]
371 | case 5: EXTRACT_DIGIT(s, x, 10000UL, dot);
| ^
./Modules/_decimal/libmpdec/io.c:370:14: warning: writing 1 byte into a region of size 0 [-Wstringop-overflow=]
370 | case 6: EXTRACT_DIGIT(s, x, 100000UL, dot);
| ^
./Modules/_decimal/libmpdec/io.c:371:14: warning: writing 1 byte into a region of size 0 [-Wstringop-overflow=]
371 | case 5: EXTRACT_DIGIT(s, x, 10000UL, dot);
| ^
./Modules/_decimal/libmpdec/io.c:372:14: warning: writing 1 byte into a region of size 0 [-Wstringop-overflow=]
372 | case 4: EXTRACT_DIGIT(s, x, 1000UL, dot);
| ^
./Modules/_decimal/libmpdec/io.c:373:14: warning: writing 1 byte into a region of size 0 [-Wstringop-overflow=]
373 | case 3: EXTRACT_DIGIT(s, x, 100UL, dot);
| ^
./Modules/_decimal/libmpdec/io.c:374:14: warning: writing 1 byte into a region of size 0 [-Wstringop-overflow=]
374 | case 2: EXTRACT_DIGIT(s, x, 10UL, dot);
| ^
./Modules/_decimal/libmpdec/io.c:372:14: warning: writing 1 byte into a region of size 0 [-Wstringop-overflow=]
372 | case 4: EXTRACT_DIGIT(s, x, 1000UL, dot);
| ^
./Modules/_decimal/libmpdec/io.c:373:14: warning: writing 1 byte into a region of size 0 [-Wstringop-overflow=]
373 | case 3: EXTRACT_DIGIT(s, x, 100UL, dot);
| ^
./Modules/_decimal/libmpdec/io.c:374:14: warning: writing 1 byte into a region of size 0 [-Wstringop-overflow=]
374 | case 2: EXTRACT_DIGIT(s, x, 10UL, dot);
| ^
In function ‘word_to_string’,
inlined from ‘coeff_to_string’ at ./Modules/_decimal/libmpdec/io.c:411:13:
./Modules/_decimal/libmpdec/io.c:360:14: warning: writing 1 byte into a region of size 0 [-Wstringop-overflow=]
360 | case 15: EXTRACT_DIGIT(s, x, 100000000000000ULL, dot);
| ^
./Modules/_decimal/libmpdec/io.c:359:14: warning: writing 1 byte into a region of size 0 [-Wstringop-overflow=]
359 | case 16: EXTRACT_DIGIT(s, x, 1000000000000000ULL, dot);
| ^
./Modules/_decimal/libmpdec/io.c:360:14: warning: writing 1 byte into a region of size 0 [-Wstringop-overflow=]
360 | case 15: EXTRACT_DIGIT(s, x, 100000000000000ULL, dot);
| ^
./Modules/_decimal/libmpdec/io.c:361:14: warning: writing 1 byte into a region of size 0 [-Wstringop-overflow=]
361 | case 14: EXTRACT_DIGIT(s, x, 10000000000000ULL, dot);
| ^
./Modules/_decimal/libmpdec/io.c:358:14: warning: writing 1 byte into a region of size 0 [-Wstringop-overflow=]
358 | case 17: EXTRACT_DIGIT(s, x, 10000000000000000ULL, dot);
| ^
./Modules/_decimal/libmpdec/io.c:357:14: warning: writing 1 byte into a region of size 0 [-Wstringop-overflow=]
357 | case 18: EXTRACT_DIGIT(s, x, 100000000000000000ULL, dot);
| ^
./Modules/_decimal/libmpdec/io.c:358:14: warning: writing 1 byte into a region of size 0 [-Wstringop-overflow=]
358 | case 17: EXTRACT_DIGIT(s, x, 10000000000000000ULL, dot);
| ^
./Modules/_decimal/libmpdec/io.c:359:14: warning: writing 1 byte into a region of size 0 [-Wstringop-overflow=]
359 | case 16: EXTRACT_DIGIT(s, x, 1000000000000000ULL, dot);
| ^
./Modules/_decimal/libmpdec/io.c:362:14: warning: writing 1 byte into a region of size 0 [-Wstringop-overflow=]
362 | case 13: EXTRACT_DIGIT(s, x, 1000000000000ULL, dot);
| ^
./Modules/_decimal/libmpdec/io.c:361:14: warning: writing 1 byte into a region of size 0 [-Wstringop-overflow=]
361 | case 14: EXTRACT_DIGIT(s, x, 10000000000000ULL, dot);
| ^
./Modules/_decimal/libmpdec/io.c:362:14: warning: writing 1 byte into a region of size 0 [-Wstringop-overflow=]
362 | case 13: EXTRACT_DIGIT(s, x, 1000000000000ULL, dot);
| ^
./Modules/_decimal/libmpdec/io.c:363:14: warning: writing 1 byte into a region of size 0 [-Wstringop-overflow=]
363 | case 12: EXTRACT_DIGIT(s, x, 100000000000ULL, dot);
| ^
./Modules/_decimal/libmpdec/io.c:364:14: warning: writing 1 byte into a region of size 0 [-Wstringop-overflow=]
364 | case 11: EXTRACT_DIGIT(s, x, 10000000000ULL, dot);
| ^
./Modules/_decimal/libmpdec/io.c:363:14: warning: writing 1 byte into a region of size 0 [-Wstringop-overflow=]
363 | case 12: EXTRACT_DIGIT(s, x, 100000000000ULL, dot);
| ^
./Modules/_decimal/libmpdec/io.c:364:14: warning: writing 1 byte into a region of size 0 [-Wstringop-overflow=]
364 | case 11: EXTRACT_DIGIT(s, x, 10000000000ULL, dot);
| ^
./Modules/_decimal/libmpdec/io.c:366:14: warning: writing 1 byte into a region of size 0 [-Wstringop-overflow=]
366 | case 10: EXTRACT_DIGIT(s, x, 1000000000UL, dot);
| ^
./Modules/_decimal/libmpdec/io.c:367:14: warning: writing 1 byte into a region of size 0 [-Wstringop-overflow=]
367 | case 9: EXTRACT_DIGIT(s, x, 100000000UL, dot);
| ^
./Modules/_decimal/libmpdec/io.c:366:14: warning: writing 1 byte into a region of size 0 [-Wstringop-overflow=]
366 | case 10: EXTRACT_DIGIT(s, x, 1000000000UL, dot);
| ^
./Modules/_decimal/libmpdec/io.c:367:14: warning: writing 1 byte into a region of size 0 [-Wstringop-overflow=]
367 | case 9: EXTRACT_DIGIT(s, x, 100000000UL, dot);
| ^
./Modules/_decimal/libmpdec/io.c:368:14: warning: writing 1 byte into a region of size 0 [-Wstringop-overflow=]
368 | case 8: EXTRACT_DIGIT(s, x, 10000000UL, dot);
| ^
./Modules/_decimal/libmpdec/io.c:369:14: warning: writing 1 byte into a region of size 0 [-Wstringop-overflow=]
369 | case 7: EXTRACT_DIGIT(s, x, 1000000UL, dot);
| ^
./Modules/_decimal/libmpdec/io.c:368:14: warning: writing 1 byte into a region of size 0 [-Wstringop-overflow=]
368 | case 8: EXTRACT_DIGIT(s, x, 10000000UL, dot);
| ^
./Modules/_decimal/libmpdec/io.c:369:14: warning: writing 1 byte into a region of size 0 [-Wstringop-overflow=]
369 | case 7: EXTRACT_DIGIT(s, x, 1000000UL, dot);
| ^
./Modules/_decimal/libmpdec/io.c:370:14: warning: writing 1 byte into a region of size 0 [-Wstringop-overflow=]
370 | case 6: EXTRACT_DIGIT(s, x, 100000UL, dot);
| ^
./Modules/_decimal/libmpdec/io.c:371:14: warning: writing 1 byte into a region of size 0 [-Wstringop-overflow=]
371 | case 5: EXTRACT_DIGIT(s, x, 10000UL, dot);
| ^
./Modules/_decimal/libmpdec/io.c:370:14: warning: writing 1 byte into a region of size 0 [-Wstringop-overflow=]
370 | case 6: EXTRACT_DIGIT(s, x, 100000UL, dot);
| ^
./Modules/_decimal/libmpdec/io.c:371:14: warning: writing 1 byte into a region of size 0 [-Wstringop-overflow=]
371 | case 5: EXTRACT_DIGIT(s, x, 10000UL, dot);
| ^
./Modules/_decimal/libmpdec/io.c:372:14: warning: writing 1 byte into a region of size 0 [-Wstringop-overflow=]
372 | case 4: EXTRACT_DIGIT(s, x, 1000UL, dot);
| ^
./Modules/_decimal/libmpdec/io.c:373:14: warning: writing 1 byte into a region of size 0 [-Wstringop-overflow=]
373 | case 3: EXTRACT_DIGIT(s, x, 100UL, dot);
| ^
./Modules/_decimal/libmpdec/io.c:372:14: warning: writing 1 byte into a region of size 0 [-Wstringop-overflow=]
372 | case 4: EXTRACT_DIGIT(s, x, 1000UL, dot);
| ^
./Modules/_decimal/libmpdec/io.c:373:14: warning: writing 1 byte into a region of size 0 [-Wstringop-overflow=]
373 | case 3: EXTRACT_DIGIT(s, x, 100UL, dot);
| ^
./Modules/_decimal/libmpdec/io.c:374:14: warning: writing 1 byte into a region of size 0 [-Wstringop-overflow=]
374 | case 2: EXTRACT_DIGIT(s, x, 10UL, dot);
| ^
./Modules/_decimal/libmpdec/io.c:374:14: warning: writing 1 byte into a region of size 0 [-Wstringop-overflow=]
Parser/pegen.c: In function ‘_PyPegen_fill_token’:
Parser/pegen.c:201:25: note: the layout of aggregates containing vectors with 8-byte alignment has changed in GCC 5
201 | parser_token->level = new_token->level;
| ^
Parser/pegen.c: In function ‘_PyPegen_fill_token’:
Parser/pegen.c:201:25: note: the layout of aggregates containing vectors with 8-byte alignment has changed in GCC 5
201 | parser_token->level = new_token->level;
| ^
Parser/pegen.c: In function ‘_PyPegen_fill_token’:
Parser/pegen.c:201:25: note: the layout of aggregates containing vectors with 8-byte alignment has changed in GCC 5
201 | parser_token->level = new_token->level;
| ^
/usr/bin/ld: /lib64/ld64.so.2: .gnu.version_d invalid entry
/usr/bin/ld: /lib64/ld64.so.2: error adding symbols: bad value
collect2: error: ld returned 1 exit status
make[1]: *** [Makefile:1054: python] Error 1
make[1]: *** Waiting for unfinished jobs....
/usr/bin/ld: /lib64/ld64.so.2: .gnu.version_d invalid entry
/usr/bin/ld: /lib64/ld64.so.2: error adding symbols: bad value
collect2: error: ld returned 1 exit status
make[1]: *** [Makefile:1632: Programs/_testembed] Error 1
make: *** [Makefile:943: profile-opt] Error 2
Test report
===========
Sincerely,
-The Buildbot
1
0
☠ Buildbot (Python): python/cpython - failed test (failure) (main)
by buildbot@python.org Sept. 24, 2024
by buildbot@python.org Sept. 24, 2024
Sept. 24, 2024
The Buildbot has detected a new failure on builder aarch64 Fedora Stable Refleaks 3.x while building python/cpython.
Full details are available at:
https://buildbot.python.org/#/builders/123/builds/86
Buildbot URL: https://buildbot.python.org/
Worker for this Build: cstratak-fedora-stable-aarch64
Build Reason: <unknown>
Blamelist: Jelle Zijlstra <jelle.zijlstra(a)gmail.com>, Serhiy Storchaka <storchaka(a)gmail.com>, Victor Stinner <vstinner(a)python.org>, Xie Yanbo <xieyanbo(a)gmail.com>, sobolevn <mail(a)sobolevn.me>
BUILD FAILED: failed test (failure)
Summary of the results of the build (if available):
===================================================
==
Captured traceback
==================
remote: Enumerating objects: 110, done.
remote: Counting objects: 0% (1/102)
remote: Counting objects: 1% (2/102)
remote: Counting objects: 2% (3/102)
remote: Counting objects: 3% (4/102)
remote: Counting objects: 4% (5/102)
remote: Counting objects: 5% (6/102)
remote: Counting objects: 6% (7/102)
remote: Counting objects: 7% (8/102)
remote: Counting objects: 8% (9/102)
remote: Counting objects: 9% (10/102)
remote: Counting objects: 10% (11/102)
remote: Counting objects: 11% (12/102)
remote: Counting objects: 12% (13/102)
remote: Counting objects: 13% (14/102)
remote: Counting objects: 14% (15/102)
remote: Counting objects: 15% (16/102)
remote: Counting objects: 16% (17/102)
remote: Counting objects: 17% (18/102)
remote: Counting objects: 18% (19/102)
remote: Counting objects: 19% (20/102)
remote: Counting objects: 20% (21/102)
remote: Counting objects: 21% (22/102)
remote: Counting objects: 22% (23/102)
remote: Counting objects: 23% (24/102)
remote: Counting objects: 24% (25/102)
remote: Counting objects: 25% (26/102)
remote: Counting objects: 26% (27/102)
remote: Counting objects: 27% (28/102)
remote: Counting objects: 28% (29/102)
remote: Counting objects: 29% (30/102)
remote: Counting objects: 30% (31/102)
remote: Counting objects: 31% (32/102)
remote: Counting objects: 32% (33/102)
remote: Counting objects: 33% (34/102)
remote: Counting objects: 34% (35/102)
remote: Counting objects: 35% (36/102)
remote: Counting objects: 36% (37/102)
remote: Counting objects: 37% (38/102)
remote: Counting objects: 38% (39/102)
remote: Counting objects: 39% (40/102)
remote: Counting objects: 40% (41/102)
remote: Counting objects: 41% (42/102)
remote: Counting objects: 42% (43/102)
remote: Counting objects: 43% (44/102)
remote: Counting objects: 44% (45/102)
remote: Counting objects: 45% (46/102)
remote: Counting objects: 46% (47/102)
remote: Counting objects: 47% (48/102)
remote: Counting objects: 48% (49/102)
remote: Counting objects: 49% (50/102)
remote: Counting objects: 50% (51/102)
remote: Counting objects: 51% (53/102)
remote: Counting objects: 52% (54/102)
remote: Counting objects: 53% (55/102)
remote: Counting objects: 54% (56/102)
remote: Counting objects: 55% (57/102)
remote: Counting objects: 56% (58/102)
remote: Counting objects: 57% (59/102)
remote: Counting objects: 58% (60/102)
remote: Counting objects: 59% (61/102)
remote: Counting objects: 60% (62/102)
remote: Counting objects: 61% (63/102)
remote: Counting objects: 62% (64/102)
remote: Counting objects: 63% (65/102)
remote: Counting objects: 64% (66/102)
remote: Counting objects: 65% (67/102)
remote: Counting objects: 66% (68/102)
remote: Counting objects: 67% (69/102)
remote: Counting objects: 68% (70/102)
remote: Counting objects: 69% (71/102)
remote: Counting objects: 70% (72/102)
remote: Counting objects: 71% (73/102)
remote: Counting objects: 72% (74/102)
remote: Counting objects: 73% (75/102)
remote: Counting objects: 74% (76/102)
remote: Counting objects: 75% (77/102)
remote: Counting objects: 76% (78/102)
remote: Counting objects: 77% (79/102)
remote: Counting objects: 78% (80/102)
remote: Counting objects: 79% (81/102)
remote: Counting objects: 80% (82/102)
remote: Counting objects: 81% (83/102)
remote: Counting objects: 82% (84/102)
remote: Counting objects: 83% (85/102)
remote: Counting objects: 84% (86/102)
remote: Counting objects: 85% (87/102)
remote: Counting objects: 86% (88/102)
remote: Counting objects: 87% (89/102)
remote: Counting objects: 88% (90/102)
remote: Counting objects: 89% (91/102)
remote: Counting objects: 90% (92/102)
remote: Counting objects: 91% (93/102)
remote: Counting objects: 92% (94/102)
remote: Counting objects: 93% (95/102)
remote: Counting objects: 94% (96/102)
remote: Counting objects: 95% (97/102)
remote: Counting objects: 96% (98/102)
remote: Counting objects: 97% (99/102)
remote: Counting objects: 98% (100/102)
remote: Counting objects: 99% (101/102)
remote: Counting objects: 100% (102/102)
remote: Counting objects: 100% (102/102), done.
remote: Compressing objects: 1% (1/62)
remote: Compressing objects: 3% (2/62)
remote: Compressing objects: 4% (3/62)
remote: Compressing objects: 6% (4/62)
remote: Compressing objects: 8% (5/62)
remote: Compressing objects: 9% (6/62)
remote: Compressing objects: 11% (7/62)
remote: Compressing objects: 12% (8/62)
remote: Compressing objects: 14% (9/62)
remote: Compressing objects: 16% (10/62)
remote: Compressing objects: 17% (11/62)
remote: Compressing objects: 19% (12/62)
remote: Compressing objects: 20% (13/62)
remote: Compressing objects: 22% (14/62)
remote: Compressing objects: 24% (15/62)
remote: Compressing objects: 25% (16/62)
remote: Compressing objects: 27% (17/62)
remote: Compressing objects: 29% (18/62)
remote: Compressing objects: 30% (19/62)
remote: Compressing objects: 32% (20/62)
remote: Compressing objects: 33% (21/62)
remote: Compressing objects: 35% (22/62)
remote: Compressing objects: 37% (23/62)
remote: Compressing objects: 38% (24/62)
remote: Compressing objects: 40% (25/62)
remote: Compressing objects: 41% (26/62)
remote: Compressing objects: 43% (27/62)
remote: Compressing objects: 45% (28/62)
remote: Compressing objects: 46% (29/62)
remote: Compressing objects: 48% (30/62)
remote: Compressing objects: 50% (31/62)
remote: Compressing objects: 51% (32/62)
remote: Compressing objects: 53% (33/62)
remote: Compressing objects: 54% (34/62)
remote: Compressing objects: 56% (35/62)
remote: Compressing objects: 58% (36/62)
remote: Compressing objects: 59% (37/62)
remote: Compressing objects: 61% (38/62)
remote: Compressing objects: 62% (39/62)
remote: Compressing objects: 64% (40/62)
remote: Compressing objects: 66% (41/62)
remote: Compressing objects: 67% (42/62)
remote: Compressing objects: 69% (43/62)
remote: Compressing objects: 70% (44/62)
remote: Compressing objects: 72% (45/62)
remote: Compressing objects: 74% (46/62)
remote: Compressing objects: 75% (47/62)
remote: Compressing objects: 77% (48/62)
remote: Compressing objects: 79% (49/62)
remote: Compressing objects: 80% (50/62)
remote: Compressing objects: 82% (51/62)
remote: Compressing objects: 83% (52/62)
remote: Compressing objects: 85% (53/62)
remote: Compressing objects: 87% (54/62)
remote: Compressing objects: 88% (55/62)
remote: Compressing objects: 90% (56/62)
remote: Compressing objects: 91% (57/62)
remote: Compressing objects: 93% (58/62)
remote: Compressing objects: 95% (59/62)
remote: Compressing objects: 96% (60/62)
remote: Compressing objects: 98% (61/62)
remote: Compressing objects: 100% (62/62)
remote: Compressing objects: 100% (62/62), done.
Receiving objects: 0% (1/110)
Receiving objects: 1% (2/110)
Receiving objects: 2% (3/110)
Receiving objects: 3% (4/110)
Receiving objects: 4% (5/110)
Receiving objects: 5% (6/110)
Receiving objects: 6% (7/110)
Receiving objects: 7% (8/110)
Receiving objects: 8% (9/110)
Receiving objects: 9% (10/110)
Receiving objects: 10% (11/110)
Receiving objects: 11% (13/110)
Receiving objects: 12% (14/110)
Receiving objects: 13% (15/110)
Receiving objects: 14% (16/110)
Receiving objects: 15% (17/110)
Receiving objects: 16% (18/110)
Receiving objects: 17% (19/110)
Receiving objects: 18% (20/110)
Receiving objects: 19% (21/110)
Receiving objects: 20% (22/110)
Receiving objects: 21% (24/110)
Receiving objects: 22% (25/110)
Receiving objects: 23% (26/110)
Receiving objects: 24% (27/110)
Receiving objects: 25% (28/110)
Receiving objects: 26% (29/110)
Receiving objects: 27% (30/110)
Receiving objects: 28% (31/110)
Receiving objects: 29% (32/110)
Receiving objects: 30% (33/110)
Receiving objects: 31% (35/110)
Receiving objects: 32% (36/110)
Receiving objects: 33% (37/110)
Receiving objects: 34% (38/110)
Receiving objects: 35% (39/110)
Receiving objects: 36% (40/110)
Receiving objects: 37% (41/110)
Receiving objects: 38% (42/110)
Receiving objects: 39% (43/110)
Receiving objects: 40% (44/110)
Receiving objects: 41% (46/110)
Receiving objects: 42% (47/110)
Receiving objects: 43% (48/110)
Receiving objects: 44% (49/110)
Receiving objects: 45% (50/110)
Receiving objects: 46% (51/110)
Receiving objects: 47% (52/110)
Receiving objects: 48% (53/110)
Receiving objects: 49% (54/110)
Receiving objects: 50% (55/110)
Receiving objects: 51% (57/110)
Receiving objects: 52% (58/110)
Receiving objects: 53% (59/110)
Receiving objects: 54% (60/110)
Receiving objects: 55% (61/110)
Receiving objects: 56% (62/110)
Receiving objects: 57% (63/110)
Receiving objects: 58% (64/110)
Receiving objects: 59% (65/110)
Receiving objects: 60% (66/110)
Receiving objects: 61% (68/110)
Receiving objects: 62% (69/110)
Receiving objects: 63% (70/110)
Receiving objects: 64% (71/110)
Receiving objects: 65% (72/110)
Receiving objects: 66% (73/110)
Receiving objects: 67% (74/110)
Receiving objects: 68% (75/110)
Receiving objects: 69% (76/110)
Receiving objects: 70% (77/110)
Receiving objects: 71% (79/110)
Receiving objects: 72% (80/110)
Receiving objects: 73% (81/110)
Receiving objects: 74% (82/110)
Receiving objects: 75% (83/110)
Receiving objects: 76% (84/110)
Receiving objects: 77% (85/110)
Receiving objects: 78% (86/110)
Receiving objects: 79% (87/110)
Receiving objects: 80% (88/110)
Receiving objects: 81% (90/110)
Receiving objects: 82% (91/110)
Receiving objects: 83% (92/110)
Receiving objects: 84% (93/110)
Receiving objects: 85% (94/110)
Receiving objects: 86% (95/110)
Receiving objects: 87% (96/110)
Receiving objects: 88% (97/110)
Receiving objects: 89% (98/110)
Receiving objects: 90% (99/110)
remote: Total 110 (delta 67), reused 52 (delta 40), pack-reused 8 (from 1)
Receiving objects: 91% (101/110)
Receiving objects: 92% (102/110)
Receiving objects: 93% (103/110)
Receiving objects: 94% (104/110)
Receiving objects: 95% (105/110)
Receiving objects: 96% (106/110)
Receiving objects: 97% (107/110)
Receiving objects: 98% (108/110)
Receiving objects: 99% (109/110)
Receiving objects: 100% (110/110)
Receiving objects: 100% (110/110), 224.27 KiB | 6.41 MiB/s, done.
Resolving deltas: 0% (0/67)
Resolving deltas: 1% (1/67)
Resolving deltas: 2% (2/67)
Resolving deltas: 4% (3/67)
Resolving deltas: 5% (4/67)
Resolving deltas: 7% (5/67)
Resolving deltas: 8% (6/67)
Resolving deltas: 10% (7/67)
Resolving deltas: 11% (8/67)
Resolving deltas: 13% (9/67)
Resolving deltas: 14% (10/67)
Resolving deltas: 16% (11/67)
Resolving deltas: 17% (12/67)
Resolving deltas: 19% (13/67)
Resolving deltas: 20% (14/67)
Resolving deltas: 22% (15/67)
Resolving deltas: 23% (16/67)
Resolving deltas: 25% (17/67)
Resolving deltas: 26% (18/67)
Resolving deltas: 28% (19/67)
Resolving deltas: 29% (20/67)
Resolving deltas: 31% (21/67)
Resolving deltas: 37% (25/67)
Resolving deltas: 43% (29/67)
Resolving deltas: 44% (30/67)
Resolving deltas: 46% (31/67)
Resolving deltas: 47% (32/67)
Resolving deltas: 49% (33/67)
Resolving deltas: 50% (34/67)
Resolving deltas: 52% (35/67)
Resolving deltas: 53% (36/67)
Resolving deltas: 55% (37/67)
Resolving deltas: 56% (38/67)
Resolving deltas: 58% (39/67)
Resolving deltas: 59% (40/67)
Resolving deltas: 61% (41/67)
Resolving deltas: 62% (42/67)
Resolving deltas: 64% (43/67)
Resolving deltas: 65% (44/67)
Resolving deltas: 67% (45/67)
Resolving deltas: 68% (46/67)
Resolving deltas: 70% (47/67)
Resolving deltas: 71% (48/67)
Resolving deltas: 73% (49/67)
Resolving deltas: 74% (50/67)
Resolving deltas: 76% (51/67)
Resolving deltas: 77% (52/67)
Resolving deltas: 79% (53/67)
Resolving deltas: 80% (54/67)
Resolving deltas: 82% (55/67)
Resolving deltas: 83% (56/67)
Resolving deltas: 85% (57/67)
Resolving deltas: 86% (58/67)
Resolving deltas: 88% (59/67)
Resolving deltas: 89% (60/67)
Resolving deltas: 91% (61/67)
Resolving deltas: 92% (62/67)
Resolving deltas: 94% (63/67)
Resolving deltas: 95% (64/67)
Resolving deltas: 97% (65/67)
Resolving deltas: 98% (66/67)
Resolving deltas: 100% (67/67)
Resolving deltas: 100% (67/67), completed with 18 local objects.
From https://github.com/python/cpython
* branch main -> FETCH_HEAD
Note: switching to 'e670a113b5e1fcc3ce3bb9b5b4b1f126264ae21b'.
You are in 'detached HEAD' state. You can look around, make experimental
changes and commit them, and you can discard any commits you make in this
state without impacting any branches by switching back to a branch.
If you want to create a new branch to retain commits you create, you may
do so (now or later) by using -c with the switch command. Example:
git switch -c <new-branch-name>
Or undo this operation with:
git switch -
Turn off this advice by setting config variable advice.detachedHead to false
HEAD is now at e670a113b5e gh-123978: Remove broken time.thread_time() on NetBSD (GH-124116)
Switched to and reset branch 'main'
configure: WARNING: no system libmpdecimal found; falling back to bundled libmpdecimal (deprecated and scheduled for removal in Python 3.15)
make: *** [Makefile:2281: buildbottest] Error 2
Test report
===========
Failed tests:
- test.test_multiprocessing_spawn.test_processes
Test leaking resources:
- test_processes: references
- test_processes: memory blocks
Sincerely,
-The Buildbot
1
0
☠ Buildbot (Python): python/cpython - failed test (failure) (main)
by buildbot@python.org Sept. 24, 2024
by buildbot@python.org Sept. 24, 2024
Sept. 24, 2024
The Buildbot has detected a new failure on builder AMD64 FreeBSD15 3.x while building python/cpython.
Full details are available at:
https://buildbot.python.org/#/builders/1238/builds/3343
Buildbot URL: https://buildbot.python.org/
Worker for this Build: opsec-fbsd15
Build Reason: <unknown>
Blamelist: Serhiy Storchaka <storchaka(a)gmail.com>
BUILD FAILED: failed test (failure)
Summary of the results of the build (if available):
===================================================
==
Captured traceback
==================
Traceback (most recent call last):
File "<frozen getpath>", line 468, in <module>
ValueError: embedded null byte
Warning -- Uncaught thread exception: InterpreterError
Exception in thread Thread-186 (task):
RuntimeError: error evaluating path
Traceback (most recent call last):
File "/home/buildbot/buildarea/3.x.opsec-fbsd15/build/Lib/threading.py", line 1041, in _bootstrap_inner
self.run()
~~~~~~~~^^
File "/home/buildbot/buildarea/3.x.opsec-fbsd15/build/Lib/threading.py", line 992, in run
self._target(*self._args, **self._kwargs)
~~~~~~~~~~~~^^^^^^^^^^^^^^^^^^^^^^^^^^^^^
File "/home/buildbot/buildarea/3.x.opsec-fbsd15/build/Lib/test/test_interpreters/test_stress.py", line 29, in task
interp = interpreters.create()
File "/home/buildbot/buildarea/3.x.opsec-fbsd15/build/Lib/test/support/interpreters/__init__.py", line 76, in create
id = _interpreters.create(reqrefs=True)
interpreters.InterpreterError: interpreter creation failed
k
Test report
===========
Failed tests:
- test_interpreters
Sincerely,
-The Buildbot
1
0
☠ Buildbot (Python): python/cpython - failed test (failure) (3.13)
by buildbot@python.org Sept. 24, 2024
by buildbot@python.org Sept. 24, 2024
Sept. 24, 2024
The Buildbot has detected a new failure on builder AMD64 Windows Server 2022 NoGIL 3.13 while building python/cpython.
Full details are available at:
https://buildbot.python.org/#/builders/1488/builds/546
Buildbot URL: https://buildbot.python.org/
Worker for this Build: itamaro-win64-srv-22-aws
Build Reason: <unknown>
Blamelist: Adam Turner <9087854+AA-Turner(a)users.noreply.github.com>, Miss Islington (bot) <31488909+miss-islington(a)users.noreply.github.com>
BUILD FAILED: failed test (failure)
Summary of the results of the build (if available):
===================================================
==
Captured traceback
==================
Traceback (most recent call last):
File "C:\Users\Administrator\buildarea\3.13.itamaro-win64-srv-22-aws.x64.nogil\build\Lib\test\test_wmi.py", line 88, in test_wmi_query_threads
self.assertRegex(t.result(), "ProcessId=")
~~~~~~~~^^
File "C:\Users\Administrator\buildarea\3.13.itamaro-win64-srv-22-aws.x64.nogil\build\Lib\concurrent\futures\_base.py", line 456, in result
return self.__get_result()
~~~~~~~~~~~~~~~~~^^
File "C:\Users\Administrator\buildarea\3.13.itamaro-win64-srv-22-aws.x64.nogil\build\Lib\concurrent\futures\_base.py", line 401, in __get_result
raise self._exception
File "C:\Users\Administrator\buildarea\3.13.itamaro-win64-srv-22-aws.x64.nogil\build\Lib\concurrent\futures\thread.py", line 58, in run
result = self.fn(*self.args, **self.kwargs)
File "C:\Users\Administrator\buildarea\3.13.itamaro-win64-srv-22-aws.x64.nogil\build\Lib\test\test_wmi.py", line 23, in wmi_exec_query
return _wmi.exec_query(query)
~~~~~~~~~~~~~~~^^^^^^^
TimeoutError: [WinError 258] The wait operation timed out
Traceback (most recent call last):
File "C:\Users\Administrator\buildarea\3.13.itamaro-win64-srv-22-aws.x64.nogil\build\Lib\test\test_wmi.py", line 40, in test_wmi_query_repeated
self.test_wmi_query_os_version()
~~~~~~~~~~~~~~~~~~~~~~~~~~~~~~^^
File "C:\Users\Administrator\buildarea\3.13.itamaro-win64-srv-22-aws.x64.nogil\build\Lib\test\test_wmi.py", line 28, in test_wmi_query_os_version
r = wmi_exec_query("SELECT Version FROM Win32_OperatingSystem").split("\0")
~~~~~~~~~~~~~~^^^^^^^^^^^^^^^^^^^^^^^^^^^^^^^^^^^^^^^^^^^^^
File "C:\Users\Administrator\buildarea\3.13.itamaro-win64-srv-22-aws.x64.nogil\build\Lib\test\test_wmi.py", line 16, in wmi_exec_query
return _wmi.exec_query(query)
~~~~~~~~~~~~~~~^^^^^^^
OSError: Query returns more than 8192 characters
Test report
===========
Failed tests:
- test_wmi
Failed subtests:
- test_wmi_query_threads - test.test_wmi.WmiTests.test_wmi_query_threads
- test_wmi_query_repeated - test.test_wmi.WmiTests.test_wmi_query_repeated
Sincerely,
-The Buildbot
1
0
☠ Buildbot (Python): python/cpython - failed test (failure) (timed out) (main)
by buildbot@python.org Sept. 24, 2024
by buildbot@python.org Sept. 24, 2024
Sept. 24, 2024
The Buildbot has detected a new failure on builder PPC64LE Fedora Rawhide NoGIL refleaks 3.x while building python/cpython.
Full details are available at:
https://buildbot.python.org/#/builders/1540/builds/136
Buildbot URL: https://buildbot.python.org/
Worker for this Build: cstratak-fedora-rawhide-ppc64le
Build Reason: <unknown>
Blamelist: AN Long <aisk(a)users.noreply.github.com>, Adam Turner <9087854+AA-Turner(a)users.noreply.github.com>, Brian Schubert <brianm.schubert(a)gmail.com>, Bénédikt Tran <10796600+picnixz(a)users.noreply.github.com>, Cody Maloney <cmaloney(a)users.noreply.github.com>, Furkan Onder <furkanonder(a)protonmail.com>, Hugo van Kemenade <1324225+hugovk(a)users.noreply.github.com>, Jacek <jacek.duszenko(a)gmail.com>, Jacob Walls <jacobtylerwalls(a)gmail.com>, Jakub Kulík <Kulikjak(a)gmail.com>, Jelle Zijlstra <jelle.zijlstra(a)gmail.com>, Kirill Podoprigora <kirill.bast9(a)mail.ru>, Michał Górny <mgorny(a)gentoo.org>, Nate Ohlson <nohlson(a)purdue.edu>, Petr Viktorin <encukou(a)gmail.com>, Sam James <sam(a)gentoo.org>, Savannah Ostrowski <savannahostrowski(a)gmail.com>, Sergey B Kirpichev <skirpichev(a)gmail.com>, Serhiy Storchaka <storchaka(a)gmail.com>, Stefano Rivera <stefano(a)rivera.za.net>, Steve Dower <steve.dower(a)python.org>, Terry Jan Reedy <tjreedy(a)udel.edu>, Tomas R <tomas.roun8(a)gmail.com>, Victor Stinner <vsti
nner(a)python.org>, Y5 <124019959+y5c4l3(a)users.noreply.github.com>, Zachary Ware <zach(a)python.org>, decorator-factory <42166884+decorator-factory(a)users.noreply.github.com>, luk1337 <priv.luk(a)gmail.com>, neonene <53406459+neonene(a)users.noreply.github.com>, sobolevn <mail(a)sobolevn.me>
BUILD FAILED: failed test (failure) (timed out)
Summary of the results of the build (if available):
===================================================
==
Captured traceback
==================
Note: switching to '6203ef35dd4ee9dd59759ce83eace8eacac69685'.
You are in 'detached HEAD' state. You can look around, make experimental
changes and commit them, and you can discard any commits you make in this
state without impacting any branches by switching back to a branch.
If you want to create a new branch to retain commits you create, you may
do so (now or later) by using -c with the switch command. Example:
git switch -c <new-branch-name>
Or undo this operation with:
git switch -
Turn off this advice by setting config variable advice.detachedHead to false
HEAD is now at 6203ef35dd4 Replace the term `Immutable` with a `Hashable` in the `sequence` entry of the Glossary (#124350)
Switched to and reset branch 'main'
configure: WARNING: no system libmpdecimal found; falling back to bundled libmpdecimal (deprecated and scheduled for removal in Python 3.15)
make: *** [Makefile:2311: buildbottest] Terminated
Test report
===========
Failed tests:
- test.test_concurrent_futures.test_deadlock
Sincerely,
-The Buildbot
1
0