Buildbot-status
Threads by month
- ----- 2026 -----
- September
- August
- July
- June
- May
- April
- March
- February
- January
- ----- 2025 -----
- December
- November
- October
- September
- August
- July
- June
- May
- April
- March
- February
- January
- ----- 2024 -----
- December
- November
- October
- September
- August
- July
- June
- May
- April
- March
- February
- January
- ----- 2023 -----
- December
- November
- October
- September
- August
- July
- June
- May
- April
- March
- February
- January
- ----- 2022 -----
- December
- November
- October
- September
- August
- July
- June
- May
- April
- March
- February
- January
- ----- 2021 -----
- December
- November
- October
- September
- August
- July
- June
- May
- April
- March
- February
- January
- ----- 2020 -----
- December
- November
- October
- September
- August
- July
- June
- May
- April
- March
- February
- January
- ----- 2019 -----
- December
- November
- October
- September
- August
- July
- June
- May
- April
- March
- February
- January
- ----- 2018 -----
- December
- November
- October
- September
- August
- July
- June
- May
- April
- March
- February
- January
- ----- 2017 -----
- December
- November
- October
- September
- August
- July
- June
- May
November 2025
- 1 participants
- 128 discussions
Nov. 11, 2025
The Buildbot has detected a new failure on builder AMD64 Android 3.14 while building python/cpython.
Full details are available at:
https://buildbot.python.org/#/builders/1694/builds/580
Buildbot URL: https://buildbot.python.org/
Worker for this Build: mhsmith-android-x86_64
Build Reason: <unknown>
Blamelist: Miss Islington (bot) <31488909+miss-islington(a)users.noreply.github.com>
BUILD FAILED: test (failure)
Summary of the results of the build (if available):
===================================================
Captured traceback
==================
remote: Enumerating objects: 20, done.
remote: Counting objects: 7% (1/13)
remote: Counting objects: 15% (2/13)
remote: Counting objects: 23% (3/13)
remote: Counting objects: 30% (4/13)
remote: Counting objects: 38% (5/13)
remote: Counting objects: 46% (6/13)
remote: Counting objects: 53% (7/13)
remote: Counting objects: 61% (8/13)
remote: Counting objects: 69% (9/13)
remote: Counting objects: 76% (10/13)
remote: Counting objects: 84% (11/13)
remote: Counting objects: 92% (12/13)
remote: Counting objects: 100% (13/13)
remote: Counting objects: 100% (13/13), done.
remote: Compressing objects: 16% (1/6)
remote: Compressing objects: 33% (2/6)
remote: Compressing objects: 50% (3/6)
remote: Compressing objects: 66% (4/6)
remote: Compressing objects: 83% (5/6)
remote: Compressing objects: 100% (6/6)
remote: Compressing objects: 100% (6/6), done.
remote: Total 20 (delta 7), reused 7 (delta 7), pack-reused 7 (from 2)
From https://github.com/python/cpython
* branch 3.14 -> FETCH_HEAD
Note: switching to 'ec836f2ad65ae7c254f8de6bbc26de91c2ed6163'.
You are in 'detached HEAD' state. You can look around, make experimental
changes and commit them, and you can discard any commits you make in this
state without impacting any branches by switching back to a branch.
If you want to create a new branch to retain commits you create, you may
do so (now or later) by using -c with the switch command. Example:
git switch -c <new-branch-name>
Or undo this operation with:
git switch -
Turn off this advice by setting config variable advice.detachedHead to false
HEAD is now at ec836f2ad65 [3.14] gh-140485: Catch ChildProcessError in multiprocessing resource tracker (GH-141132) (#141384)
Switched to and reset branch '3.14'
configure: WARNING: no system libmpdec found; falling back to bundled libmpdec (deprecated and scheduled for removal in Python 3.16)
In file included from ../../Include/internal/pycore_dict.h:11,
from ../../Objects/typeobject.c:7:
In function ‘Py_DECREF_MORTAL’,
inlined from ‘PyStackRef_XCLOSE’ at ../../Include/internal/pycore_stackref.h:660:9,
inlined from ‘_PyThreadState_PopCStackRef’ at ../../Include/internal/pycore_stackref.h:746:5,
inlined from ‘vectorcall_maybe’ at ../../Objects/typeobject.c:2985:9:
../../Include/internal/pycore_object.h:481:8: warning: array subscript 0 is outside array bounds of ‘PyObject[0]’ {aka ‘struct _object[]’} [-Warray-bounds]
481 | if (--op->ob_refcnt == 0) {
| ^
% Total % Received % Xferd Average Speed Time Time Time Current
Dload Upload Total Spent Left Speed
0 0 0 0 0 0 0 0 --:--:-- --:--:-- --:--:-- 0
0 0 0 0 0 0 0 0 --:--:-- --:--:-- --:--:-- 0
100 201k 100 201k 0 0 498k 0 --:--:-- --:--:-- --:--:-- 498k
% Total % Received % Xferd Average Speed Time Time Time Current
Dload Upload Total Spent Left Speed
0 0 0 0 0 0 0 0 --:--:-- --:--:-- --:--:-- 0
0 0 0 0 0 0 0 0 --:--:-- --:--:-- --:--:-- 0
0 0 0 0 0 0 0 0 --:--:-- --:--:-- --:--:-- 0
100 43710 100 43710 0 0 98037 0 --:--:-- --:--:-- --:--:-- 98037
% Total % Received % Xferd Average Speed Time Time Time Current
Dload Upload Total Spent Left Speed
0 0 0 0 0 0 0 0 --:--:-- --:--:-- --:--:-- 0
0 0 0 0 0 0 0 0 --:--:-- --:--:-- --:--:-- 0
100 5099k 100 5099k 0 0 11.1M 0 --:--:-- --:--:-- --:--:-- 11.1M
% Total % Received % Xferd Average Speed Time Time Time Current
Dload Upload Total Spent Left Speed
0 0 0 0 0 0 0 0 --:--:-- --:--:-- --:--:-- 0
0 0 0 0 0 0 0 0 --:--:-- --:--:-- --:--:-- 0
100 1270k 100 1270k 0 0 2837k 0 --:--:-- --:--:-- --:--:-- 2837k
% Total % Received % Xferd Average Speed Time Time Time Current
Dload Upload Total Spent Left Speed
0 0 0 0 0 0 0 0 --:--:-- --:--:-- --:--:-- 0
0 0 0 0 0 0 0 0 --:--:-- --:--:-- --:--:-- 0
0 0 0 0 0 0 0 0 --:--:-- --:--:-- --:--:-- 0
0 0 0 0 0 0 0 0 --:--:-- --:--:-- --:--:-- 0
100 629k 100 629k 0 0 1406k 0 --:--:-- --:--:-- --:--:-- 68.2M
% Total % Received % Xferd Average Speed Time Time Time Current
Dload Upload Total Spent Left Speed
0 0 0 0 0 0 0 0 --:--:-- --:--:-- --:--:-- 0
0 0 0 0 0 0 0 0 --:--:-- --:--:-- --:--:-- 0
0 0 0 0 0 0 0 0 --:--:-- --:--:-- --:--:-- 0
100 511k 100 511k 0 0 1182k 0 --:--:-- --:--:-- --:--:-- 1182k
configure: WARNING: no system libmpdec found; falling back to bundled libmpdec (deprecated and scheduled for removal in Python 3.16)
../../Python/fileutils.c:460:1: warning: unused function 'decode_current_locale' [-Wunused-function]
460 | decode_current_locale(const char* arg, wchar_t **wstr, size_t *wlen,
| ^~~~~~~~~~~~~~~~~~~~~
../../Python/fileutils.c:679:1: warning: unused function 'encode_current_locale' [-Wunused-function]
679 | encode_current_locale(const wchar_t *text, char **str,
| ^~~~~~~~~~~~~~~~~~~~~
2 warnings generated.
../../Modules/_localemodule.c:195:1: warning: unused function 'is_all_ascii' [-Wunused-function]
195 | is_all_ascii(const char *str)
| ^~~~~~~~~~~~
1 warning generated.
../../Modules/_hacl/Lib_Memzero0.c:66:6: warning: "Your platform does not support any safe implementation of memzero -- consider a pull request!" [-W#warnings]
66 | #warning "Your platform does not support any safe implementation of memzero -- consider a pull request!"
| ^
1 warning generated.
% Total % Received % Xferd Average Speed Time Time Time Current
Dload Upload Total Spent Left Speed
0 0 0 0 0 0 0 0 --:--:-- --:--:-- --:--:-- 0
100 8784 100 8784 0 0 43615 0 --:--:-- --:--:-- --:--:-- 43485
100 8784 100 8784 0 0 43574 0 --:--:-- --:--:-- --:--:-- 43485
% Total % Received % Xferd Average Speed Time Time Time Current
Dload Upload Total Spent Left Speed
0 0 0 0 0 0 0 0 --:--:-- --:--:-- --:--:-- 0
100 2894 100 2894 0 0 15059 0 --:--:-- --:--:-- --:--:-- 15072
% Total % Received % Xferd Average Speed Time Time Time Current
Dload Upload Total Spent Left Speed
0 0 0 0 0 0 0 0 --:--:-- --:--:-- --:--:-- 0
100 43504 100 43504 0 0 220k 0 --:--:-- --:--:-- --:--:-- 221k
W/.python.testbed: Unexpected CPU variant for x86: x86_64.
W/.python.testbed: Known variants: atom, sandybridge, silvermont, goldmont, goldmont-plus, tremont, kabylake, default
W/ActivityThread: Package uses different ABI(s) than its instrumentation: package[org.python.testbed]: x86_64, null instrumentation[org.python.testbed.test]: null, null
W/.python.testbed: ClassLoaderContext shared library size mismatch. Expected=2, found=0 (PCL[]{PCL[/system/framework/android.test.base.jar*836642756]#PCL[/system/framework/android.test.mock.jar*3186112116]} | PCL[])
W/.python.testbed: ClassLoaderContext classpath size mismatch. expected=0, found=1 (PCL[] | PCL[/system/framework/android.test.runner.jar*4168958247])
W/.python.testbed: ClassLoaderContext classpath size mismatch. expected=0, found=2 (PCL[] | PCL[/system/framework/android.test.runner.jar*4168958247:/system/framework/android.test.mock.jar*3186112116])
W/ziparchive: Unable to open '/data/app/~~TsYgtl_JgrWC5-M7qy2O6w==/org.python.testbed.test-M3DmsYCZIFWytILgylYxXA==/base.dm': No such file or directory
W/ziparchive: Unable to open '/data/app/~~TsYgtl_JgrWC5-M7qy2O6w==/org.python.testbed.test-M3DmsYCZIFWytILgylYxXA==/base.dm': No such file or directory
W/ziparchive: Unable to open '/data/app/~~7F-q54YErP1FrGhIi3P4Fg==/org.python.testbed-x_yIodRBtCDRr9xMFTQhmQ==/base.dm': No such file or directory
W/ziparchive: Unable to open '/data/app/~~7F-q54YErP1FrGhIi3P4Fg==/org.python.testbed-x_yIodRBtCDRr9xMFTQhmQ==/base.dm': No such file or directory
W/.python.testbed: ClassLoaderContext shared library size mismatch. Expected=2, found=3 (PCL[]{PCL[/system/framework/android.test.base.jar*836642756]#PCL[/system/framework/android.test.mock.jar*3186112116]} | PCL[]{PCL[/system/framework/android.test.base.jar*836642756]#PCL[/system/framework/android.test.mock.jar*3186112116]#PCL[/system/framework/android.test.runner.jar*4168958247]{PCL[/system/framework/android.test.base.jar*836642756]#PCL[/system/framework/android.test.mock.jar*3186112116]}};PCL[/system/framework/android.test.runner.jar*4168958247:/system/framework/android.test.mock.jar*3186112116:/system/framework/android.test.base.jar*836642756:/data/app/~~TsYgtl_JgrWC5-M7qy2O6w==/org.python.testbed.test-M3DmsYCZIFWytILgylYxXA==/base.apk*3260347339:/data/app/~~TsYgtl_JgrWC5-M7qy2O6w==/org.python.testbed.test-M3DmsYCZIFWytILgylYxXA==/base.apk!classes2.dex*1379084564:/data/app/~~TsYgtl_JgrWC5-M7qy2O6w==/org.python.testbed.test-M3DmsYCZIFWytILgylYxXA==/base.apk!classes3.dex*4285428894
:/data/app/~~7F-q54YErP1FrGhIi3P4Fg==/org.python.testbed-x_yIodRBtCDRr9xMFTQhmQ==/base.apk*801009802:/data/app/~~7F-q54YErP1FrGhIi3P4Fg==/org.python.testbed-x_yIodRBtCDRr9xMFTQhmQ==/base.apk!classes2.dex*3978002876:/data/app/~~7F-q54YErP1FrGhIi3P4Fg==/org.python.testbed-x_yIodRBtCDRr9xMFTQhmQ==/base.apk!classes3.dex*568761067])
W/.python.testbed: ClassLoaderContext classpath size mismatch. expected=0, found=1 (PCL[] | PCL[/system/framework/android.test.runner.jar*4168958247]{PCL[/system/framework/android.test.base.jar*836642756]#PCL[/system/framework/android.test.mock.jar*3186112116]#PCL[/system/framework/android.test.runner.jar*4168958247]{PCL[/system/framework/android.test.base.jar*836642756]#PCL[/system/framework/android.test.mock.jar*3186112116]}};PCL[/system/framework/android.test.runner.jar*4168958247:/system/framework/android.test.mock.jar*3186112116:/system/framework/android.test.base.jar*836642756:/data/app/~~TsYgtl_JgrWC5-M7qy2O6w==/org.python.testbed.test-M3DmsYCZIFWytILgylYxXA==/base.apk*3260347339:/data/app/~~TsYgtl_JgrWC5-M7qy2O6w==/org.python.testbed.test-M3DmsYCZIFWytILgylYxXA==/base.apk!classes2.dex*1379084564:/data/app/~~TsYgtl_JgrWC5-M7qy2O6w==/org.python.testbed.test-M3DmsYCZIFWytILgylYxXA==/base.apk!classes3.dex*4285428894:/data/app/~~7F-q54YErP1FrGhIi3P4Fg==/org.python.testbed-x_yIodRB
tCDRr9xMFTQhmQ==/base.apk*801009802:/data/app/~~7F-q54YErP1FrGhIi3P4Fg==/org.python.testbed-x_yIodRBtCDRr9xMFTQhmQ==/base.apk!classes2.dex*3978002876:/data/app/~~7F-q54YErP1FrGhIi3P4Fg==/org.python.testbed-x_yIodRBtCDRr9xMFTQhmQ==/base.apk!classes3.dex*568761067])
W/.python.testbed: ClassLoaderContext classpath size mismatch. expected=0, found=2 (PCL[] | PCL[/system/framework/android.test.runner.jar*4168958247:/system/framework/android.test.mock.jar*3186112116]{PCL[/system/framework/android.test.base.jar*836642756]#PCL[/system/framework/android.test.mock.jar*3186112116]#PCL[/system/framework/android.test.runner.jar*4168958247]{PCL[/system/framework/android.test.base.jar*836642756]#PCL[/system/framework/android.test.mock.jar*3186112116]}};PCL[/system/framework/android.test.runner.jar*4168958247:/system/framework/android.test.mock.jar*3186112116:/system/framework/android.test.base.jar*836642756:/data/app/~~TsYgtl_JgrWC5-M7qy2O6w==/org.python.testbed.test-M3DmsYCZIFWytILgylYxXA==/base.apk*3260347339:/data/app/~~TsYgtl_JgrWC5-M7qy2O6w==/org.python.testbed.test-M3DmsYCZIFWytILgylYxXA==/base.apk!classes2.dex*1379084564:/data/app/~~TsYgtl_JgrWC5-M7qy2O6w==/org.python.testbed.test-M3DmsYCZIFWytILgylYxXA==/base.apk!classes3.dex*4285428894:/data/app/~~7
F-q54YErP1FrGhIi3P4Fg==/org.python.testbed-x_yIodRBtCDRr9xMFTQhmQ==/base.apk*801009802:/data/app/~~7F-q54YErP1FrGhIi3P4Fg==/org.python.testbed-x_yIodRBtCDRr9xMFTQhmQ==/base.apk!classes2.dex*3978002876:/data/app/~~7F-q54YErP1FrGhIi3P4Fg==/org.python.testbed-x_yIodRBtCDRr9xMFTQhmQ==/base.apk!classes3.dex*568761067])
W/ziparchive: Unable to open '/data/app/~~TsYgtl_JgrWC5-M7qy2O6w==/org.python.testbed.test-M3DmsYCZIFWytILgylYxXA==/base.dm': No such file or directory
W/ziparchive: Unable to open '/data/app/~~TsYgtl_JgrWC5-M7qy2O6w==/org.python.testbed.test-M3DmsYCZIFWytILgylYxXA==/base.dm': No such file or directory
W/ziparchive: Unable to open '/data/app/~~7F-q54YErP1FrGhIi3P4Fg==/org.python.testbed-x_yIodRBtCDRr9xMFTQhmQ==/base.dm': No such file or directory
W/ziparchive: Unable to open '/data/app/~~7F-q54YErP1FrGhIi3P4Fg==/org.python.testbed-x_yIodRBtCDRr9xMFTQhmQ==/base.dm': No such file or directory
W/.python.testbed: Opening an oat file without a class loader. Are you using the deprecated DexFile APIs?
W/.python.testbed: type=1400 audit(0.0:37): avc: denied { read } for name="overcommit_memory" dev="proc" ino=14450 scontext=u:r:untrusted_app:s0:c108,c256,c512,c768 tcontext=u:object_r:proc_overcommit_memory:s0 tclass=file permissive=0 app=org.python.testbed
W/.python.testbed: type=1400 audit(0.0:38): avc: granted { execute } for path="/data/data/org.python.testbed/files/python/lib/python3.14/lib-dynload/math.cpython-314-x86_64-linux-android.so" dev="dm-38" ino=312801 scontext=u:r:untrusted_app:s0:c108,c256,c512,c768 tcontext=u:object_r:app_data_file:s0:c108,c256,c512,c768 tclass=file app=org.python.testbed
W/.python.testbed: type=1400 audit(0.0:39): avc: granted { execute } for path="/data/data/org.python.testbed/files/python/lib/python3.14/lib-dynload/_bisect.cpython-314-x86_64-linux-android.so" dev="dm-38" ino=312747 scontext=u:r:untrusted_app:s0:c108,c256,c512,c768 tcontext=u:object_r:app_data_file:s0:c108,c256,c512,c768 tclass=file app=org.python.testbed
W/.python.testbed: type=1400 audit(0.0:40): avc: granted { execute } for path="/data/data/org.python.testbed/files/python/lib/python3.14/lib-dynload/_random.cpython-314-x86_64-linux-android.so" dev="dm-38" ino=312775 scontext=u:r:untrusted_app:s0:c108,c256,c512,c768 tcontext=u:object_r:app_data_file:s0:c108,c256,c512,c768 tclass=file app=org.python.testbed
W/.python.testbed: type=1400 audit(0.0:41): avc: granted { execute } for path="/data/data/org.python.testbed/files/python/lib/python3.14/lib-dynload/_struct.cpython-314-x86_64-linux-android.so" dev="dm-38" ino=312784 scontext=u:r:untrusted_app:s0:c108,c256,c512,c768 tcontext=u:object_r:app_data_file:s0:c108,c256,c512,c768 tclass=file app=org.python.testbed
W/.python.testbed: type=1400 audit(0.0:42): avc: granted { execute } for path="/data/data/org.python.testbed/files/python/lib/python3.14/lib-dynload/_pickle.cpython-314-x86_64-linux-android.so" dev="dm-38" ino=312772 scontext=u:r:untrusted_app:s0:c108,c256,c512,c768 tcontext=u:object_r:app_data_file:s0:c108,c256,c512,c768 tclass=file app=org.python.testbed
W/.python.testbed: type=1400 audit(0.0:43): avc: granted { execute } for path="/data/data/org.python.testbed/files/python/lib/python3.14/lib-dynload/_heapq.cpython-314-x86_64-linux-android.so" dev="dm-38" ino=312762 scontext=u:r:untrusted_app:s0:c108,c256,c512,c768 tcontext=u:object_r:app_data_file:s0:c108,c256,c512,c768 tclass=file app=org.python.testbed
W/.python.testbed: type=1400 audit(0.0:44): avc: granted { execute } for path="/data/data/org.python.testbed/files/python/lib/python3.14/lib-dynload/fcntl.cpython-314-x86_64-linux-android.so" dev="dm-38" ino=312800 scontext=u:r:untrusted_app:s0:c108,c256,c512,c768 tcontext=u:object_r:app_data_file:s0:c108,c256,c512,c768 tclass=file app=org.python.testbed
W/.python.testbed: type=1400 audit(0.0:45): avc: granted { execute } for path="/data/data/org.python.testbed/files/python/lib/python3.14/lib-dynload/_posixsubprocess.cpython-314-x86_64-linux-android.so" dev="dm-38" ino=312773 scontext=u:r:untrusted_app:s0:c108,c256,c512,c768 tcontext=u:object_r:app_data_file:s0:c108,c256,c512,c768 tclass=file app=org.python.testbed
W/.python.testbed: type=1400 audit(0.0:47): avc: granted { execute } for path="/data/data/org.python.testbed/files/python/lib/python3.14/lib-dynload/zlib.cpython-314-x86_64-linux-android.so" dev="dm-38" ino=312812 scontext=u:r:untrusted_app:s0:c108,c256,c512,c768 tcontext=u:object_r:app_data_file:s0:c108,c256,c512,c768 tclass=file app=org.python.testbed
W/.python.testbed: type=1400 audit(0.0:48): avc: granted { execute } for path="/data/data/org.python.testbed/files/python/lib/python3.14/lib-dynload/_bz2.cpython-314-x86_64-linux-android.so" dev="dm-38" ino=312749 scontext=u:r:untrusted_app:s0:c108,c256,c512,c768 tcontext=u:object_r:app_data_file:s0:c108,c256,c512,c768 tclass=file app=org.python.testbed
W/.python.testbed: type=1400 audit(0.0:49): avc: granted { execute } for path="/data/data/org.python.testbed/files/python/lib/python3.14/lib-dynload/_lzma.cpython-314-x86_64-linux-android.so" dev="dm-38" ino=312769 scontext=u:r:untrusted_app:s0:c108,c256,c512,c768 tcontext=u:object_r:app_data_file:s0:c108,c256,c512,c768 tclass=file app=org.python.testbed
W/.python.testbed: type=1400 audit(0.0:50): avc: granted { execute } for path="/data/data/org.python.testbed/files/python/lib/python3.14/lib-dynload/_zstd.cpython-314-x86_64-linux-android.so" dev="dm-38" ino=312796 scontext=u:r:untrusted_app:s0:c108,c256,c512,c768 tcontext=u:object_r:app_data_file:s0:c108,c256,c512,c768 tclass=file app=org.python.testbed
W/.python.testbed: type=1400 audit(0.0:51): avc: granted { execute } for path="/data/data/org.python.testbed/files/python/lib/python3.14/lib-dynload/_json.cpython-314-x86_64-linux-android.so" dev="dm-38" ino=312767 scontext=u:r:untrusted_app:s0:c108,c256,c512,c768 tcontext=u:object_r:app_data_file:s0:c108,c256,c512,c768 tclass=file app=org.python.testbed
W/.python.testbed: type=1400 audit(0.0:61): avc: granted { execute } for path="/data/data/org.python.testbed/files/python/lib/python3.14/lib-dynload/_queue.cpython-314-x86_64-linux-android.so" dev="dm-38" ino=312774 scontext=u:r:untrusted_app:s0:c108,c256,c512,c768 tcontext=u:object_r:app_data_file:s0:c108,c256,c512,c768 tclass=file app=org.python.testbed
W/asyncio_0: type=1400 audit(0.0:62): avc: granted { execute } for path="/data/data/org.python.testbed/files/python/lib/python3.14/lib-dynload/unicodedata.cpython-314-x86_64-linux-android.so" dev="dm-38" ino=312808 scontext=u:r:untrusted_app:s0:c108,c256,c512,c768 tcontext=u:object_r:app_data_file:s0:c108,c256,c512,c768 tclass=file app=org.python.testbed
W/.python.testbed: type=1400 audit(0.0:63): avc: granted { execute } for path="/data/data/org.python.testbed/files/python/lib/python3.14/lib-dynload/_decimal.cpython-314-x86_64-linux-android.so" dev="dm-38" ino=312759 scontext=u:r:untrusted_app:s0:c108,c256,c512,c768 tcontext=u:object_r:app_data_file:s0:c108,c256,c512,c768 tclass=file app=org.python.testbed
W/.python.testbed: type=1400 audit(0.0:64): avc: granted { execute } for path="/data/data/org.python.testbed/files/python/lib/python3.14/lib-dynload/array.cpython-314-x86_64-linux-android.so" dev="dm-38" ino=312797 scontext=u:r:untrusted_app:s0:c108,c256,c512,c768 tcontext=u:object_r:app_data_file:s0:c108,c256,c512,c768 tclass=file app=org.python.testbed
test.test_asyncio.test_subprocess skipped -- test module requires subprocess
W/.python.testbed: type=1400 audit(0.0:65): avc: granted { execute } for path="/data/data/org.python.testbed/files/python/lib/python3.14/lib-dynload/_remote_debugging.cpython-314-x86_64-linux-android.so" dev="dm-38" ino=312776 scontext=u:r:untrusted_app:s0:c108,c256,c512,c768 tcontext=u:object_r:app_data_file:s0:c108,c256,c512,c768 tclass=file app=org.python.testbed
W/.python.testbed: type=1400 audit(0.0:66): avc: granted { execute } for path="/data/data/org.python.testbed/files/python/lib/python3.14/lib-dynload/_hashlib.cpython-314-x86_64-linux-android.so" dev="dm-38" ino=312761 scontext=u:r:untrusted_app:s0:c108,c256,c512,c768 tcontext=u:object_r:app_data_file:s0:c108,c256,c512,c768 tclass=file app=org.python.testbed
W/.python.testbed: type=1400 audit(0.0:67): avc: granted { execute } for path="/data/data/org.python.testbed/files/python/lib/python3.14/lib-dynload/_blake2.cpython-314-x86_64-linux-android.so" dev="dm-38" ino=312748 scontext=u:r:untrusted_app:s0:c108,c256,c512,c768 tcontext=u:object_r:app_data_file:s0:c108,c256,c512,c768 tclass=file app=org.python.testbed
W/.python.testbed: type=1400 audit(0.0:68): avc: granted { execute } for path="/data/data/org.python.testbed/files/python/lib/python3.14/lib-dynload/_hmac.cpython-314-x86_64-linux-android.so" dev="dm-38" ino=312763 scontext=u:r:untrusted_app:s0:c108,c256,c512,c768 tcontext=u:object_r:app_data_file:s0:c108,c256,c512,c768 tclass=file app=org.python.testbed
test.test_asyncio.test_windows_events skipped -- Windows only
test.test_asyncio.test_windows_utils skipped -- Windows only
W/.python.testbed: type=1400 audit(0.0:69): avc: granted { execute } for path="/data/data/org.python.testbed/files/python/lib/python3.14/lib-dynload/_interpqueues.cpython-314-x86_64-linux-android.so" dev="dm-38" ino=312765 scontext=u:r:untrusted_app:s0:c108,c256,c512,c768 tcontext=u:object_r:app_data_file:s0:c108,c256,c512,c768 tclass=file app=org.python.testbed
test.test_gdb.test_backtrace skipped -- test_gdb only works on source builds at the moment.
test.test_gdb.test_cfunction skipped -- test_gdb only works on source builds at the moment.
test.test_gdb.test_cfunction_full skipped -- test_gdb only works on source builds at the moment.
test.test_gdb.test_misc skipped -- test_gdb only works on source builds at the moment.
test.test_gdb.test_pretty_print skipped -- test_gdb only works on source builds at the moment.
W/.python.testbed: type=1400 audit(0.0:70): avc: granted { execute } for path="/data/data/org.python.testbed/files/python/lib/python3.14/lib-dynload/_testcapi.cpython-314-x86_64-linux-android.so" dev="dm-38" ino=312786 scontext=u:r:untrusted_app:s0:c108,c256,c512,c768 tcontext=u:object_r:app_data_file:s0:c108,c256,c512,c768 tclass=file app=org.python.testbed
W/.python.testbed: type=1400 audit(0.0:71): avc: granted { execute } for path="/data/data/org.python.testbed/files/python/lib/python3.14/lib-dynload/_testinternalcapi.cpython-314-x86_64-linux-android.so" dev="dm-38" ino=312790 scontext=u:r:untrusted_app:s0:c108,c256,c512,c768 tcontext=u:object_r:app_data_file:s0:c108,c256,c512,c768 tclass=file app=org.python.testbed
test.test_multiprocessing_fork.test_manager skipped -- No module named '_multiprocessing'
test.test_multiprocessing_fork.test_misc skipped -- No module named '_multiprocessing'
test.test_multiprocessing_fork.test_processes skipped -- No module named '_multiprocessing'
test.test_multiprocessing_fork.test_threads skipped -- No module named '_multiprocessing'
test.test_multiprocessing_forkserver.test_manager skipped -- No module named '_multiprocessing'
test.test_multiprocessing_forkserver.test_misc skipped -- No module named '_multiprocessing'
test.test_multiprocessing_forkserver.test_processes skipped -- No module named '_multiprocessing'
test.test_multiprocessing_forkserver.test_threads skipped -- No module named '_multiprocessing'
test.test_multiprocessing_spawn.test_manager skipped -- No module named '_multiprocessing'
test.test_multiprocessing_spawn.test_misc skipped -- No module named '_multiprocessing'
test.test_multiprocessing_spawn.test_processes skipped -- No module named '_multiprocessing'
test.test_multiprocessing_spawn.test_threads skipped -- No module named '_multiprocessing'
W/.python.testbed: type=1400 audit(0.0:72): avc: granted { execute } for path="/data/data/org.python.testbed/files/python/lib/python3.14/lib-dynload/_elementtree.cpython-314-x86_64-linux-android.so" dev="dm-38" ino=312760 scontext=u:r:untrusted_app:s0:c108,c256,c512,c768 tcontext=u:object_r:app_data_file:s0:c108,c256,c512,c768 tclass=file app=org.python.testbed
W/.python.testbed: type=1400 audit(0.0:73): avc: granted { execute } for path="/data/data/org.python.testbed/files/python/lib/python3.14/lib-dynload/pyexpat.cpython-314-x86_64-linux-android.so" dev="dm-38" ino=312803 scontext=u:r:untrusted_app:s0:c108,c256,c512,c768 tcontext=u:object_r:app_data_file:s0:c108,c256,c512,c768 tclass=file app=org.python.testbed
W/.python.testbed: type=1400 audit(0.0:74): avc: granted { execute } for path="/data/data/org.python.testbed/files/python/lib/python3.14/lib-dynload/_lsprof.cpython-314-x86_64-linux-android.so" dev="dm-38" ino=312768 scontext=u:r:untrusted_app:s0:c108,c256,c512,c768 tcontext=u:object_r:app_data_file:s0:c108,c256,c512,c768 tclass=file app=org.python.testbed
W/.python.testbed: type=1400 audit(0.0:75): avc: granted { execute } for path="/data/data/org.python.testbed/files/python/lib/python3.14/lib-dynload/_csv.cpython-314-x86_64-linux-android.so" dev="dm-38" ino=312756 scontext=u:r:untrusted_app:s0:c108,c256,c512,c768 tcontext=u:object_r:app_data_file:s0:c108,c256,c512,c768 tclass=file app=org.python.testbed
W/.python.testbed: type=1400 audit(0.0:76): avc: granted { execute } for path="/data/data/org.python.testbed/files/python/lib/python3.14/lib-dynload/mmap.cpython-314-x86_64-linux-android.so" dev="dm-38" ino=312802 scontext=u:r:untrusted_app:s0:c108,c256,c512,c768 tcontext=u:object_r:app_data_file:s0:c108,c256,c512,c768 tclass=file app=org.python.testbed
W/.python.testbed: type=1400 audit(0.0:77): avc: granted { execute } for path="/data/data/org.python.testbed/files/python/lib/python3.14/lib-dynload/_statistics.cpython-314-x86_64-linux-android.so" dev="dm-38" ino=312783 scontext=u:r:untrusted_app:s0:c108,c256,c512,c768 tcontext=u:object_r:app_data_file:s0:c108,c256,c512,c768 tclass=file app=org.python.testbed
W/.python.testbed: type=1400 audit(0.0:78): avc: granted { execute } for path="/data/data/org.python.testbed/files/python/lib/python3.14/lib-dynload/_interpchannels.cpython-314-x86_64-linux-android.so" dev="dm-38" ino=312764 scontext=u:r:untrusted_app:s0:c108,c256,c512,c768 tcontext=u:object_r:app_data_file:s0:c108,c256,c512,c768 tclass=file app=org.python.testbed
W/.python.testbed: type=1400 audit(0.0:79): avc: granted { execute } for path="/data/data/org.python.testbed/files/python/lib/python3.14/lib-dynload/_testlimitedcapi.cpython-314-x86_64-linux-android.so" dev="dm-38" ino=312791 scontext=u:r:untrusted_app:s0:c108,c256,c512,c768 tcontext=u:object_r:app_data_file:s0:c108,c256,c512,c768 tclass=file app=org.python.testbed
W/.python.testbed: type=1400 audit(0.0:80): avc: granted { execute } for path="/data/data/org.python.testbed/files/python/lib/python3.14/lib-dynload/_testsinglephase.cpython-314-x86_64-linux-android.so" dev="dm-38" ino=312793 scontext=u:r:untrusted_app:s0:c108,c256,c512,c768 tcontext=u:object_r:app_data_file:s0:c108,c256,c512,c768 tclass=file app=org.python.testbed
W/.python.testbed: type=1400 audit(0.0:81): avc: granted { execute } for path="/data/data/org.python.testbed/files/python/lib/python3.14/lib-dynload/_testmultiphase.cpython-314-x86_64-linux-android.so" dev="dm-38" ino=312792 scontext=u:r:untrusted_app:s0:c108,c256,c512,c768 tcontext=u:object_r:app_data_file:s0:c108,c256,c512,c768 tclass=file app=org.python.testbed
W/.python.testbed: type=1400 audit(0.0:82): avc: granted { execute } for path="/data/data/org.python.testbed/files/python/lib/python3.14/lib-dynload/_testbuffer.cpython-314-x86_64-linux-android.so" dev="dm-38" ino=312785 scontext=u:r:untrusted_app:s0:c108,c256,c512,c768 tcontext=u:object_r:app_data_file:s0:c108,c256,c512,c768 tclass=file app=org.python.testbed
W/.python.testbed: type=1400 audit(0.0:83): avc: granted { execute } for path="/data/data/org.python.testbed/files/python/lib/python3.14/lib-dynload/_zoneinfo.cpython-314-x86_64-linux-android.so" dev="dm-38" ino=312795 scontext=u:r:untrusted_app:s0:c108,c256,c512,c768 tcontext=u:object_r:app_data_file:s0:c108,c256,c512,c768 tclass=file app=org.python.testbed
a
Hello
Hello world
olé
中文
😀
\xc0\x80
a\xc0\x80
\xc0\x80b
a\xc0\x80b
\xff
a\xff
\xffb
a\xffb
x
a
b
c
d
xx
f
g
hello
hello
world
bytearray
memoryview
mmrve
\xc0\x80\xc0\x80\xc0\x80\xfe\xff\xff\xff
a
Hello
Hello world
olé
中文
😀
\ud800\udc00
\udc80
\xc0\x80
a\xc0\x80
\xc0\x80b
a\xc0\x80b
x
a
b
c
d
xxf
g
x
a
b
c
d
xx
f
g
hello
hello
world
before form feed
before line separator
custom
hello
helloworld
foobarfoobarfoobarfoobarfoobarfoobarfoobarfoobarfoobarfoobarfoobarfoobarfoobarfoobarfoobarfoobarfoobarfoobarfoobarfoobarfoobarfoobarfoobarfoobarfoobarfoobarfoobarfoobarfoobarfoobarfoobarfoobarfoobarfoobarfoobarfoobarfoobarfoobarfoobarfoobarfoobarfoobarfoobarfoobarfoobarfoobarfoobarfoobarfoobarfoobarfoobarfoobarfoobarfoobarfoobarfoobarfoobarfoobarfoobarfoobarfoobarfoobarfoobarfoobarfoobarfoobarfoobarfoobarfoobarfoobarfoobarfoobarfoobarfoobarfoobarfoobarfoobarfoobarfoobarfoobarfoobarfoobarfoobarfoobarfoobarfoobarfoobarfoobarfoobarfoobarfoobarfoobarfoobarfoobarfoobarfoobarfoobarfoobarfoobarfoobarfoobarfoobarfoobarfoobarfoobarfoobarfoobarfoobarfoobarfoobarfoobarfoobarfoobarfoobarfoobarfoobarfoobarfoobarfoobarfoobarfoobarfoobarfoobarfoobarfoobarfoobarfoobarfoobarfoobarfoobarfoobarfoobarfoobarfoobarfoobarfoobarfoobarfoobarfoobarfoobarfoobarfoobarfoobarfoobarfoobarfoobarfoobarfoobarfoobarfoobarfoobarfoobarfoobarfoobarfoobarfoobarfoobarfoobarfoobarfoobarfoobarfoobarfoobarfoobarfoobarfoobarfo
obarfoobarfoobarfoobarfoobarfoobarfoobarfoobarfoobarfoobarfoobarfoobarfoobarfoobarfoobarfoobarfoobarfoobarfoobarfoobarfoobarfoobarfoobarfoobarfoobarfoobarfoobarfoobarfoobarfoobarfoobarfoobarfoobarfoobarfoobarfoobarfoobarfoobarfoobarfoobarfoobarfoobarfoobarfoobarfoobarfoobarfoobarfoobarfoobarfoobarfoobarfoobarfoobarfoobarfoobarfoobarfoobarfoobarfoobarfoobarfoobarfoobarfoobarfoobarfoobarfoobarfoobarfoobarfoobarfoobarfoobarfoobarfoobarfoobarfoobarfoobarfoobarfoobarfoobarfoobarfoobarfoobarfoobarfoobarfoobarfoobarfoobarfoobarfoobarfoobarfoobarfoobarfoobarfoobarfoobarfoobarfoobarfoobarfoobarfoobarfoobarfoobarfoobarfoobarfoobarfoobarfoobarfoobarfoobarfoobarfoobarfoobarfoobarfoobarfoobarfoobarfoobarfoobarfoobarfoobarfoobarfoobarfoobarfoobarfoobarfoobarfoobarfoobarfoobarfoobarfoobarfoobarfoobarfoobarfoobarfoobarfoobarfoobarfoobarfoobarfoobarfoobarfoobarfoobarfoobarfoobarfoobarfoobarfoobarfoobarfoobarfoobarfoobarfoobarfoobarfoobarfoobarfoobarfoobarfoobarfoobarfoobarfoobarfoobarfoobarfoobarfoo
barfoobarfoobarfoobarfoobarfoobarfoobarfoobarfoobarfoobarfoobarfoobarfoobarfoobarfoobarfoobarfoobarfoobarfoobarfoobarfoobarfoobarfoobarfoobarfoobarfoobarfoobarfoobarfoobarfoobarfoobarfoobarfoobarfoobarfoobarfoobarfoobarfoobarfoobarfoobarfoobarfoobarfoobarfoobarfoobarfoobarfoobarfoobarfoobarfoobarfoobarfoobarfoobarfoobarfoobarfoobarfoobarfoobarfoobarfoobarfoobarfoobarfoobarfoobarfoobarfoobarfoobarfoobarfoobarfoobarfoobarfoobarfoobarfoobarfoobarfoobarfoobarfoobarfoobarfoobarfoobarfoobarfoobarfoobarfoobarfoobarfoobarfoobarfoobarfoobarfoobarfoobarfoobarfoobarfoobarfoobarfoobarfoobarfoobarfoobarfoobarfoobarfoobarfoobarfoobarfoobarfoobarfoobarfoobarfoobarfoobarfoobarfoobarfoobarfoobarfoobarfoobarfoobarfoobarfoobarfoobarfoobarfoobarfoobarfoobarfoobarfoobarfoobarfoobarfoobarfoobarfoobarfoobarfoobarfoobarfoobarfoobarfoobarfoobarfoobarfoobarfoobarfoobarfoobarfoobarfoobarfoobarfoobarfoobarfoobarfoobarfoobarfoobarfoobarfoobarfoobarfoobarfoobarfoobarfoobarfoobarfoobarfoobarfoobarfoobarfoobarfoob
arfoobarfoobarfoobarfoobarfoobarfoobarfoobarfoobarfoobarfoobarfoobarfoobarfoobarfoobarfoobarfoobarfoobarfoobarfoobarfoobarfoobarfoobarfoobarfoobarfoobarfoobarfoobarfoobarfoobarfoobarfoobarfoobarfoobarfoobarfoobarfoobarfoobarfoobarfoobarfoobarfoobarfoobarfoobarfoobarfoobarfoobarfoobarfoobarfoobarfoobarfoobarfoobarfoobarfoobarfoobarfoobarfoobarfoobarfoobarfoobarfoobarfoobarfoobarfoobarfoobarfoobarfoobarfoobarfoobarfoobarfoobarfoobarfoobarfoobarfoobarfoobarfoobarfoobarfoobarfoobarfoobarfoobarfoobarfoobarfoobarfoobarfoobarfoobarfoobarfoobarfoobarfoobarfoobarfoobarfoobarfoobarfoobarfoobarfoobarfoobarfoobarfoobarfoobarfoobarfoobarfoobarfoobarfoobarfoobarfoobarfoobarfoobarfoobarfoobarfoobarfoobarfoobarfoobarfoobarfoobarfoobarfoobarfoobarfoobarfoobarfoobarfoobarfoobarfoobarfoobarfoobarfoobarfoobarfoobarfoobarfoobarfoobarfoobarfoobarfoobarfoobarfoobarfoobarfoobarfoobarfoobarfoobarfoobarfoobarfoobarfoobarfoobarfoobarfoobarfoobarfoobarfoobarfoobarfoobarfoobarfoobarfoobarfoobarfoobarfoobarfooba
rfoobarfoob
arfoobarfoobarfoobarfoobarfoobarfoobarfoobarfoobarfoobarfoobarfoobarfoobarfoobarfoobarfoobarfoobarfoobarfoobarfoobarfoobarfoobarfoobarfoobarfoobarfoobarfoobarfoobarfoobarfoobarfoobarfoobarfoobarfoobar
01234567890123456789012345678901234567890123456789012345678901234567890123456789012345678901234567890123456789012345678901234567890123456789012345678901234567890123456789012345678901234567890123456789012345678901234567890123456789012345678901234567890123456789012345678901234567890123456789012345678901234567890123456789012345678901�
�34567890123456789012345678901234567890123456789012345678901234567890123456789012345678901234567890123456789012345678901234567890123456789012345678901234567890123456789012345678901234567890123456789012345678901234567890123456789012345678901234567890123456789012345678901234567890123456789012345678901234567890123456789012345678901234
56789012345678901234567890123456789012345678901234567890123456789012345678901234567890123456789012345678901234567890123456789012345678901234567890123456789012345678901234567890123456789012345678901234567890123456789012345678901234567890123456789012345678901234567890123456789012345678901234567890123456789012345678901234567890123456�
��89
01234567890123456789012345678901234567890123456789012345678901234567890123456789012345678901234567890123456789012345678901234567890123456789012345678901234567890123456789012345678901234567890123456789012345678901234567890123456789012345678901234567890123456789012345678901234567890123456789012345678901234567890123456789012345678901�
�34567890123456789012345678901234567890123456789012345678901234567890123456789012345678901234567890123456789012345678901234567890123456789012345678901234567890123456789
01234567890123456789012345678901234567890123456789012345678901234567890123456789012345678901234567890123456789012345678901234567890123456789012345678901234567890123456789012345678901234567890123456789012345678901234567890123456789012345678901234567890123456789012345678901234567890123456789012345678901234567890123456789012345678901234567890123456789012345678901234567890123456789012345678901234567890123456789012345678901234567890123456789012345678901234567890123456789012345678901234567890123456789012345678901234567890123456789012345678901234567890123456789012345678901234567890123456789012345678901234567890123456789012345678901234567890123456789012345678901234567890123456789012345678901234567890123456789012345678901234567890123456789012345678901234567890123456789012345678901234567890123456789012345678901234567890123456789012345678901234567890123456789012345678901234567890123456789012345678901234567890123456789012345678901234567890123456789012345678901234567890123456789012345678901234567
8901234567890123456789012345678901234567890123456789012345678901234567890123456789012345678901234567890123456789012345678901234567890123456789012345678901234567890123456789012345678901234567890123456789012345678901234567890123456789012345678901234567890123456789012345678901234567890123456789012345678901234567890123456789012345678901234567890123456789012345678901234567890123456789012345678901234567890123456789012345678901234567890123456789012345678901234567890123456789012345678901234567890123456789012345678901234567890123456789012345678901234567890123456789012345678901234567890123456789012345678901234567890123456789012345678901234567890123456789012345678901234567890123456789012345678901234567890123456789012345678901234567890123456789012345678901234567890123456789012345678901234567890123456789012345678901234567890123456789012345678901234567890123456789012345678901234567890123456789012345678901234567890123456789012345678901234567890123456789012345678901234567890123456789012345678901234
5678901234567890123456789012345678901234567890123456789012345678901234567890123456789012345678901234567890123456789012345678901234567890123456789012345678901234567890123456789012345678901234567890123456789012345678901234567890123456789012345678901234567890123456789012345678901234567890123456789012345678901234567890123456789012345678901234567890123456789012345678901234567890123456789012345678901234567890123456789012345678901234567890123456789012345678901234567890123456789012345678901234567890123456789012345678901234567890123456789012345678901234567890123456789012345678901234567890123456789012345678901234567890123456789012345678901234567890123456789012345678901234567890123456789012345678901234567890123456789012345678901234567890123456789012345678901234567890123456789012345678901234567890123456789012345678901234567890123456789012345678901234567890123456789012345678901234567890123456789012345678901234567890123456789012345678901234567890123456789012345678901234567890123456789012345678901
2345678901234567890123456789012345678901234567890123456789012345678901234567890123456789012345678901234567890123456789012345678901234567890123456789012345678901234567890123456789012345678901234567890123456789012345678901234567890123456789012345678901234567890123456789012345678901234567890123456789012345678901234567890123456789012345678901234567890123456789012345678901234567890123456789012345678901234567890123456789012345678901234567890123456789012345678901234567890123456789012345678901234567890123456789
012345678901234567890123456789012345678901234567890123456789012345678901234567890123456789012345678901234567890123456789012345678901234567890123456789012345678901234567890123456789012345678901234567890123456789012345678901234567890123456789012345678901234567890123456789012345678901234567890123456789012345678901234567890123456789012345678901234567890123456789012345678901234567890123456789012345678901234567890123456789012345678901234567890123456789012345678901234567890123456789012345678901234567890123456789
test_apple skipped -- Apple-specific
test_argparse skipped -- test module requires subprocess
test_asdl_parser skipped -- test irrelevant for an installed Python
W/.python.testbed: type=1400 audit(0.0:84): avc: denied { ioctl } for path="pipe:[48807]" dev="pipefs" ino=48807 ioctlcmd=0x5413 scontext=u:r:untrusted_app:s0:c108,c256,c512,c768 tcontext=u:r:untrusted_app:s0:c108,c256,c512,c768 tclass=fifo_file permissive=0 app=org.python.testbed
W/.python.testbed: type=1400 audit(0.0:85): avc: denied { ioctl } for path="pipe:[48807]" dev="pipefs" ino=48807 ioctlcmd=0x5413 scontext=u:r:untrusted_app:s0:c108,c256,c512,c768 tcontext=u:r:untrusted_app:s0:c108,c256,c512,c768 tclass=fifo_file permissive=0 app=org.python.testbed
W/.python.testbed: type=1400 audit(0.0:86): avc: denied { ioctl } for path="pipe:[48807]" dev="pipefs" ino=48807 ioctlcmd=0x5413 scontext=u:r:untrusted_app:s0:c108,c256,c512,c768 tcontext=u:r:untrusted_app:s0:c108,c256,c512,c768 tclass=fifo_file permissive=0 app=org.python.testbed
W/.python.testbed: type=1400 audit(0.0:87): avc: denied { ioctl } for path="pipe:[48807]" dev="pipefs" ino=48807 ioctlcmd=0x5413 scontext=u:r:untrusted_app:s0:c108,c256,c512,c768 tcontext=u:r:untrusted_app:s0:c108,c256,c512,c768 tclass=fifo_file permissive=0 app=org.python.testbed
W/.python.testbed: type=1400 audit(0.0:88): avc: denied { ioctl } for path="pipe:[48807]" dev="pipefs" ino=48807 ioctlcmd=0x5413 scontext=u:r:untrusted_app:s0:c108,c256,c512,c768 tcontext=u:r:untrusted_app:s0:c108,c256,c512,c768 tclass=fifo_file permissive=0 app=org.python.testbed
W/.python.testbed: type=1400 audit(0.0:89): avc: denied { ioctl } for path="pipe:[48807]" dev="pipefs" ino=48807 ioctlcmd=0x5413 scontext=u:r:untrusted_app:s0:c108,c256,c512,c768 tcontext=u:r:untrusted_app:s0:c108,c256,c512,c768 tclass=fifo_file permissive=0 app=org.python.testbed
W/.python.testbed: type=1400 audit(0.0:90): avc: denied { ioctl } for path="pipe:[48807]" dev="pipefs" ino=48807 ioctlcmd=0x5413 scontext=u:r:untrusted_app:s0:c108,c256,c512,c768 tcontext=u:r:untrusted_app:s0:c108,c256,c512,c768 tclass=fifo_file permissive=0 app=org.python.testbed
W/.python.testbed: type=1400 audit(0.0:5325): avc: denied { ioctl } for path="pipe:[48807]" dev="pipefs" ino=48807 ioctlcmd=0x5413 scontext=u:r:untrusted_app:s0:c108,c256,c512,c768 tcontext=u:r:untrusted_app:s0:c108,c256,c512,c768 tclass=fifo_file permissive=0 app=org.python.testbed
W/.python.testbed: type=1400 audit(0.0:5326): avc: denied { ioctl } for path="pipe:[48807]" dev="pipefs" ino=48807 ioctlcmd=0x5413 scontext=u:r:untrusted_app:s0:c108,c256,c512,c768 tcontext=u:r:untrusted_app:s0:c108,c256,c512,c768 tclass=fifo_file permissive=0 app=org.python.testbed
W/.python.testbed: type=1400 audit(0.0:5327): avc: denied { ioctl } for path="pipe:[48807]" dev="pipefs" ino=48807 ioctlcmd=0x5413 scontext=u:r:untrusted_app:s0:c108,c256,c512,c768 tcontext=u:r:untrusted_app:s0:c108,c256,c512,c768 tclass=fifo_file permissive=0 app=org.python.testbed
W/.python.testbed: type=1400 audit(0.0:5328): avc: denied { ioctl } for path="pipe:[48807]" dev="pipefs" ino=48807 ioctlcmd=0x5413 scontext=u:r:untrusted_app:s0:c108,c256,c512,c768 tcontext=u:r:untrusted_app:s0:c108,c256,c512,c768 tclass=fifo_file permissive=0 app=org.python.testbed
W/.python.testbed: type=1400 audit(0.0:5329): avc: denied { ioctl } for path="pipe:[48807]" dev="pipefs" ino=48807 ioctlcmd=0x5413 scontext=u:r:untrusted_app:s0:c108,c256,c512,c768 tcontext=u:r:untrusted_app:s0:c108,c256,c512,c768 tclass=fifo_file permissive=0 app=org.python.testbed
W/.python.testbed: type=1400 audit(0.0:9881): avc: denied { ioctl } for path="pipe:[48807]" dev="pipefs" ino=48807 ioctlcmd=0x5413 scontext=u:r:untrusted_app:s0:c108,c256,c512,c768 tcontext=u:r:untrusted_app:s0:c108,c256,c512,c768 tclass=fifo_file permissive=0 app=org.python.testbed
W/.python.testbed: type=1400 audit(0.0:9882): avc: denied { ioctl } for path="pipe:[48807]" dev="pipefs" ino=48807 ioctlcmd=0x5413 scontext=u:r:untrusted_app:s0:c108,c256,c512,c768 tcontext=u:r:untrusted_app:s0:c108,c256,c512,c768 tclass=fifo_file permissive=0 app=org.python.testbed
W/.python.testbed: type=1400 audit(0.0:9883): avc: denied { ioctl } for path="pipe:[48807]" dev="pipefs" ino=48807 ioctlcmd=0x5413 scontext=u:r:untrusted_app:s0:c108,c256,c512,c768 tcontext=u:r:untrusted_app:s0:c108,c256,c512,c768 tclass=fifo_file permissive=0 app=org.python.testbed
W/.python.testbed: type=1400 audit(0.0:9884): avc: denied { ioctl } for path="pipe:[48807]" dev="pipefs" ino=48807 ioctlcmd=0x5413 scontext=u:r:untrusted_app:s0:c108,c256,c512,c768 tcontext=u:r:untrusted_app:s0:c108,c256,c512,c768 tclass=fifo_file permissive=0 app=org.python.testbed
W/.python.testbed: type=1400 audit(0.0:9885): avc: denied { ioctl } for path="pipe:[48807]" dev="pipefs" ino=48807 ioctlcmd=0x5413 scontext=u:r:untrusted_app:s0:c108,c256,c512,c768 tcontext=u:r:untrusted_app:s0:c108,c256,c512,c768 tclass=fifo_file permissive=0 app=org.python.testbed
W/.python.testbed: type=1400 audit(0.0:15151): avc: denied { ioctl } for path="pipe:[48807]" dev="pipefs" ino=48807 ioctlcmd=0x5413 scontext=u:r:untrusted_app:s0:c108,c256,c512,c768 tcontext=u:r:untrusted_app:s0:c108,c256,c512,c768 tclass=fifo_file permissive=0 app=org.python.testbed
W/.python.testbed: type=1400 audit(0.0:15152): avc: denied { ioctl } for path="pipe:[48807]" dev="pipefs" ino=48807 ioctlcmd=0x5413 scontext=u:r:untrusted_app:s0:c108,c256,c512,c768 tcontext=u:r:untrusted_app:s0:c108,c256,c512,c768 tclass=fifo_file permissive=0 app=org.python.testbed
W/.python.testbed: type=1400 audit(0.0:15153): avc: denied { ioctl } for path="pipe:[48807]" dev="pipefs" ino=48807 ioctlcmd=0x5413 scontext=u:r:untrusted_app:s0:c108,c256,c512,c768 tcontext=u:r:untrusted_app:s0:c108,c256,c512,c768 tclass=fifo_file permissive=0 app=org.python.testbed
W/.python.testbed: type=1400 audit(0.0:15154): avc: denied { ioctl } for path="pipe:[48807]" dev="pipefs" ino=48807 ioctlcmd=0x5413 scontext=u:r:untrusted_app:s0:c108,c256,c512,c768 tcontext=u:r:untrusted_app:s0:c108,c256,c512,c768 tclass=fifo_file permissive=0 app=org.python.testbed
W/.python.testbed: type=1400 audit(0.0:15155): avc: denied { ioctl } for path="pipe:[48807]" dev="pipefs" ino=48807 ioctlcmd=0x5413 scontext=u:r:untrusted_app:s0:c108,c256,c512,c768 tcontext=u:r:untrusted_app:s0:c108,c256,c512,c768 tclass=fifo_file permissive=0 app=org.python.testbed
W/.python.testbed: type=1400 audit(0.0:19912): avc: denied { ioctl } for path="pipe:[48807]" dev="pipefs" ino=48807 ioctlcmd=0x5413 scontext=u:r:untrusted_app:s0:c108,c256,c512,c768 tcontext=u:r:untrusted_app:s0:c108,c256,c512,c768 tclass=fifo_file permissive=0 app=org.python.testbed
W/.python.testbed: type=1400 audit(0.0:19913): avc: denied { ioctl } for path="pipe:[48807]" dev="pipefs" ino=48807 ioctlcmd=0x5413 scontext=u:r:untrusted_app:s0:c108,c256,c512,c768 tcontext=u:r:untrusted_app:s0:c108,c256,c512,c768 tclass=fifo_file permissive=0 app=org.python.testbed
W/.python.testbed: type=1400 audit(0.0:19914): avc: denied { ioctl } for path="pipe:[48807]" dev="pipefs" ino=48807 ioctlcmd=0x5413 scontext=u:r:untrusted_app:s0:c108,c256,c512,c768 tcontext=u:r:untrusted_app:s0:c108,c256,c512,c768 tclass=fifo_file permissive=0 app=org.python.testbed
W/.python.testbed: type=1400 audit(0.0:19915): avc: denied { ioctl } for path="pipe:[48807]" dev="pipefs" ino=48807 ioctlcmd=0x5413 scontext=u:r:untrusted_app:s0:c108,c256,c512,c768 tcontext=u:r:untrusted_app:s0:c108,c256,c512,c768 tclass=fifo_file permissive=0 app=org.python.testbed
W/.python.testbed: type=1400 audit(0.0:19916): avc: denied { ioctl } for path="pipe:[48807]" dev="pipefs" ino=48807 ioctlcmd=0x5413 scontext=u:r:untrusted_app:s0:c108,c256,c512,c768 tcontext=u:r:untrusted_app:s0:c108,c256,c512,c768 tclass=fifo_file permissive=0 app=org.python.testbed
W/.python.testbed: type=1400 audit(0.0:25359): avc: denied { ioctl } for path="pipe:[48807]" dev="pipefs" ino=48807 ioctlcmd=0x5413 scontext=u:r:untrusted_app:s0:c108,c256,c512,c768 tcontext=u:r:untrusted_app:s0:c108,c256,c512,c768 tclass=fifo_file permissive=0 app=org.python.testbed
W/.python.testbed: type=1400 audit(0.0:25360): avc: denied { ioctl } for path="pipe:[48807]" dev="pipefs" ino=48807 ioctlcmd=0x5413 scontext=u:r:untrusted_app:s0:c108,c256,c512,c768 tcontext=u:r:untrusted_app:s0:c108,c256,c512,c768 tclass=fifo_file permissive=0 app=org.python.testbed
W/.python.testbed: type=1400 audit(0.0:25361): avc: denied { ioctl } for path="pipe:[48807]" dev="pipefs" ino=48807 ioctlcmd=0x5413 scontext=u:r:untrusted_app:s0:c108,c256,c512,c768 tcontext=u:r:untrusted_app:s0:c108,c256,c512,c768 tclass=fifo_file permissive=0 app=org.python.testbed
W/.python.testbed: type=1400 audit(0.0:25362): avc: denied { ioctl } for path="pipe:[48807]" dev="pipefs" ino=48807 ioctlcmd=0x5413 scontext=u:r:untrusted_app:s0:c108,c256,c512,c768 tcontext=u:r:untrusted_app:s0:c108,c256,c512,c768 tclass=fifo_file permissive=0 app=org.python.testbed
W/.python.testbed: type=1400 audit(0.0:25363): avc: denied { ioctl } for path="pipe:[48807]" dev="pipefs" ino=48807 ioctlcmd=0x5413 scontext=u:r:untrusted_app:s0:c108,c256,c512,c768 tcontext=u:r:untrusted_app:s0:c108,c256,c512,c768 tclass=fifo_file permissive=0 app=org.python.testbed
W/.python.testbed: type=1400 audit(0.0:30734): avc: denied { ioctl } for path="pipe:[48807]" dev="pipefs" ino=48807 ioctlcmd=0x5413 scontext=u:r:untrusted_app:s0:c108,c256,c512,c768 tcontext=u:r:untrusted_app:s0:c108,c256,c512,c768 tclass=fifo_file permissive=0 app=org.python.testbed
W/.python.testbed: type=1400 audit(0.0:30735): avc: denied { ioctl } for path="pipe:[48807]" dev="pipefs" ino=48807 ioctlcmd=0x5413 scontext=u:r:untrusted_app:s0:c108,c256,c512,c768 tcontext=u:r:untrusted_app:s0:c108,c256,c512,c768 tclass=fifo_file permissive=0 app=org.python.testbed
W/.python.testbed: type=1400 audit(0.0:30736): avc: denied { ioctl } for path="pipe:[48807]" dev="pipefs" ino=48807 ioctlcmd=0x5413 scontext=u:r:untrusted_app:s0:c108,c256,c512,c768 tcontext=u:r:untrusted_app:s0:c108,c256,c512,c768 tclass=fifo_file permissive=0 app=org.python.testbed
W/.python.testbed: type=1400 audit(0.0:30737): avc: denied { ioctl } for path="pipe:[48807]" dev="pipefs" ino=48807 ioctlcmd=0x5413 scontext=u:r:untrusted_app:s0:c108,c256,c512,c768 tcontext=u:r:untrusted_app:s0:c108,c256,c512,c768 tclass=fifo_file permissive=0 app=org.python.testbed
W/.python.testbed: type=1400 audit(0.0:30738): avc: denied { ioctl } for path="pipe:[48807]" dev="pipefs" ino=48807 ioctlcmd=0x5413 scontext=u:r:untrusted_app:s0:c108,c256,c512,c768 tcontext=u:r:untrusted_app:s0:c108,c256,c512,c768 tclass=fifo_file permissive=0 app=org.python.testbed
W/.python.testbed: type=1400 audit(0.0:36024): avc: denied { ioctl } for path="pipe:[48807]" dev="pipefs" ino=48807 ioctlcmd=0x5413 scontext=u:r:untrusted_app:s0:c108,c256,c512,c768 tcontext=u:r:untrusted_app:s0:c108,c256,c512,c768 tclass=fifo_file permissive=0 app=org.python.testbed
W/.python.testbed: type=1400 audit(0.0:36025): avc: denied { ioctl } for path="pipe:[48807]" dev="pipefs" ino=48807 ioctlcmd=0x5413 scontext=u:r:untrusted_app:s0:c108,c256,c512,c768 tcontext=u:r:untrusted_app:s0:c108,c256,c512,c768 tclass=fifo_file permissive=0 app=org.python.testbed
W/.python.testbed: type=1400 audit(0.0:36026): avc: denied { ioctl } for path="pipe:[48807]" dev="pipefs" ino=48807 ioctlcmd=0x5413 scontext=u:r:untrusted_app:s0:c108,c256,c512,c768 tcontext=u:r:untrusted_app:s0:c108,c256,c512,c768 tclass=fifo_file permissive=0 app=org.python.testbed
W/.python.testbed: type=1400 audit(0.0:36027): avc: denied { ioctl } for path="pipe:[48807]" dev="pipefs" ino=48807 ioctlcmd=0x5413 scontext=u:r:untrusted_app:s0:c108,c256,c512,c768 tcontext=u:r:untrusted_app:s0:c108,c256,c512,c768 tclass=fifo_file permissive=0 app=org.python.testbed
W/.python.testbed: type=1400 audit(0.0:36028): avc: denied { ioctl } for path="pipe:[48807]" dev="pipefs" ino=48807 ioctlcmd=0x5413 scontext=u:r:untrusted_app:s0:c108,c256,c512,c768 tcontext=u:r:untrusted_app:s0:c108,c256,c512,c768 tclass=fifo_file permissive=0 app=org.python.testbed
W/.python.testbed: type=1400 audit(0.0:39921): avc: granted { execute } for path="/data/data/org.python.testbed/files/python/lib/python3.14/lib-dynload/_sqlite3.cpython-314-x86_64-linux-android.so" dev="dm-38" ino=312781 scontext=u:r:untrusted_app:s0:c108,c256,c512,c768 tcontext=u:object_r:app_data_file:s0:c108,c256,c512,c768 tclass=file app=org.python.testbed
W/.python.testbed: type=1400 audit(0.0:39922): avc: granted { execute } for path="/data/data/org.python.testbed/files/python/lib/python3.14/lib-dynload/syslog.cpython-314-x86_64-linux-android.so" dev="dm-38" ino=312806 scontext=u:r:untrusted_app:s0:c108,c256,c512,c768 tcontext=u:object_r:app_data_file:s0:c108,c256,c512,c768 tclass=file app=org.python.testbed
W/.python.testbed: type=1400 audit(0.0:39923): avc: denied { ioctl } for path="pipe:[48807]" dev="pipefs" ino=48807 ioctlcmd=0x5413 scontext=u:r:untrusted_app:s0:c108,c256,c512,c768 tcontext=u:r:untrusted_app:s0:c108,c256,c512,c768 tclass=fifo_file permissive=0 app=org.python.testbed
W/.python.testbed: type=1400 audit(0.0:39924): avc: denied { ioctl } for path="pipe:[48807]" dev="pipefs" ino=48807 ioctlcmd=0x5413 scontext=u:r:untrusted_app:s0:c108,c256,c512,c768 tcontext=u:r:untrusted_app:s0:c108,c256,c512,c768 tclass=fifo_file permissive=0 app=org.python.testbed
W/.python.testbed: type=1400 audit(0.0:39925): avc: denied { ioctl } for path="pipe:[48807]" dev="pipefs" ino=48807 ioctlcmd=0x5413 scontext=u:r:untrusted_app:s0:c108,c256,c512,c768 tcontext=u:r:untrusted_app:s0:c108,c256,c512,c768 tclass=fifo_file permissive=0 app=org.python.testbed
W/.python.testbed: type=1400 audit(0.0:39926): avc: denied { ioctl } for path="pipe:[48807]" dev="pipefs" ino=48807 ioctlcmd=0x5413 scontext=u:r:untrusted_app:s0:c108,c256,c512,c768 tcontext=u:r:untrusted_app:s0:c108,c256,c512,c768 tclass=fifo_file permissive=0 app=org.python.testbed
W/.python.testbed: type=1400 audit(0.0:39927): avc: denied { ioctl } for path="pipe:[48807]" dev="pipefs" ino=48807 ioctlcmd=0x5413 scontext=u:r:untrusted_app:s0:c108,c256,c512,c768 tcontext=u:r:untrusted_app:s0:c108,c256,c512,c768 tclass=fifo_file permissive=0 app=org.python.testbed
W/.python.testbed: type=1400 audit(0.0:39928): avc: denied { ioctl } for path="pipe:[48807]" dev="pipefs" ino=48807 ioctlcmd=0x5413 scontext=u:r:untrusted_app:s0:c108,c256,c512,c768 tcontext=u:r:untrusted_app:s0:c108,c256,c512,c768 tclass=fifo_file permissive=0 app=org.python.testbed
W/.python.testbed: type=1400 audit(0.0:39929): avc: denied { ioctl } for path="pipe:[48807]" dev="pipefs" ino=48807 ioctlcmd=0x5413 scontext=u:r:untrusted_app:s0:c108,c256,c512,c768 tcontext=u:r:untrusted_app:s0:c108,c256,c512,c768 tclass=fifo_file permissive=0 app=org.python.testbed
W/.python.testbed: type=1400 audit(0.0:39930): avc: denied { ioctl } for path="pipe:[48807]" dev="pipefs" ino=48807 ioctlcmd=0x5413 scontext=u:r:untrusted_app:s0:c108,c256,c512,c768 tcontext=u:r:untrusted_app:s0:c108,c256,c512,c768 tclass=fifo_file permissive=0 app=org.python.testbed
W/.python.testbed: type=1400 audit(0.0:40128): avc: granted { execute } for path="/data/data/org.python.testbed/files/python/lib/python3.14/lib-dynload/_codecs_cn.cpython-314-x86_64-linux-android.so" dev="dm-38" ino=312750 scontext=u:r:untrusted_app:s0:c108,c256,c512,c768 tcontext=u:object_r:app_data_file:s0:c108,c256,c512,c768 tclass=file app=org.python.testbed
W/.python.testbed: type=1400 audit(0.0:40129): avc: granted { execute } for path="/data/data/org.python.testbed/files/python/lib/python3.14/lib-dynload/_multibytecodec.cpython-314-x86_64-linux-android.so" dev="dm-38" ino=312771 scontext=u:r:untrusted_app:s0:c108,c256,c512,c768 tcontext=u:object_r:app_data_file:s0:c108,c256,c512,c768 tclass=file app=org.python.testbed
test_clinic skipped -- test module requires subprocess
W/.python.testbed: type=1400 audit(0.0:40130): avc: granted { execute } for path="/data/data/org.python.testbed/files/python/lib/python3.14/lib-dynload/cmath.cpython-314-x86_64-linux-android.so" dev="dm-38" ino=312799 scontext=u:r:untrusted_app:s0:c108,c256,c512,c768 tcontext=u:object_r:app_data_file:s0:c108,c256,c512,c768 tclass=file app=org.python.testbed
test_cmd_line skipped -- test module requires subprocess
W/.python.testbed: type=1400 audit(0.0:40131): avc: granted { execute } for path="/data/data/org.python.testbed/files/python/lib/python3.14/lib-dynload/_codecs_hk.cpython-314-x86_64-linux-android.so" dev="dm-38" ino=312751 scontext=u:r:untrusted_app:s0:c108,c256,c512,c768 tcontext=u:object_r:app_data_file:s0:c108,c256,c512,c768 tclass=file app=org.python.testbed
W/.python.testbed: type=1400 audit(0.0:40132): avc: granted { execute } for path="/data/data/org.python.testbed/files/python/lib/python3.14/lib-dynload/_codecs_tw.cpython-314-x86_64-linux-android.so" dev="dm-38" ino=312755 scontext=u:r:untrusted_app:s0:c108,c256,c512,c768 tcontext=u:object_r:app_data_file:s0:c108,c256,c512,c768 tclass=file app=org.python.testbed
W/.python.testbed: type=1400 audit(0.0:40133): avc: granted { execute } for path="/data/data/org.python.testbed/files/python/lib/python3.14/lib-dynload/_codecs_iso2022.cpython-314-x86_64-linux-android.so" dev="dm-38" ino=312752 scontext=u:r:untrusted_app:s0:c108,c256,c512,c768 tcontext=u:object_r:app_data_file:s0:c108,c256,c512,c768 tclass=file app=org.python.testbed
W/.python.testbed: type=1400 audit(0.0:40134): avc: granted { execute } for path="/data/data/org.python.testbed/files/python/lib/python3.14/lib-dynload/_codecs_jp.cpython-314-x86_64-linux-android.so" dev="dm-38" ino=312753 scontext=u:r:untrusted_app:s0:c108,c256,c512,c768 tcontext=u:object_r:app_data_file:s0:c108,c256,c512,c768 tclass=file app=org.python.testbed
W/.python.testbed: type=1400 audit(0.0:40135): avc: granted { execute } for path="/data/data/org.python.testbed/files/python/lib/python3.14/lib-dynload/_codecs_kr.cpython-314-x86_64-linux-android.so" dev="dm-38" ino=312754 scontext=u:r:untrusted_app:s0:c108,c256,c512,c768 tcontext=u:object_r:app_data_file:s0:c108,c256,c512,c768 tclass=file app=org.python.testbed
W/.python.testbed: type=1400 audit(0.0:40136): avc: denied { ioctl } for path="pipe:[48807]" dev="pipefs" ino=48807 ioctlcmd=0x5413 scontext=u:r:untrusted_app:s0:c108,c256,c512,c768 tcontext=u:r:untrusted_app:s0:c108,c256,c512,c768 tclass=fifo_file permissive=0 app=org.python.testbed
W/.python.testbed: type=1400 audit(0.0:40137): avc: denied { ioctl } for path="pipe:[48807]" dev="pipefs" ino=48807 ioctlcmd=0x5413 scontext=u:r:untrusted_app:s0:c108,c256,c512,c768 tcontext=u:r:untrusted_app:s0:c108,c256,c512,c768 tclass=fifo_file permissive=0 app=org.python.testbed
W/.python.testbed: type=1400 audit(0.0:40138): avc: denied { ioctl } for path="pipe:[48807]" dev="pipefs" ino=48807 ioctlcmd=0x5413 scontext=u:r:untrusted_app:s0:c108,c256,c512,c768 tcontext=u:r:untrusted_app:s0:c108,c256,c512,c768 tclass=fifo_file permissive=0 app=org.python.testbed
W/.python.testbed: type=1400 audit(0.0:40139): avc: denied { ioctl } for path="pipe:[48807]" dev="pipefs" ino=48807 ioctlcmd=0x5413 scontext=u:r:untrusted_app:s0:c108,c256,c512,c768 tcontext=u:r:untrusted_app:s0:c108,c256,c512,c768 tclass=fifo_file permissive=0 app=org.python.testbed
W/.python.testbed: type=1400 audit(0.0:40140): avc: denied { ioctl } for path="pipe:[48807]" dev="pipefs" ino=48807 ioctlcmd=0x5413 scontext=u:r:untrusted_app:s0:c108,c256,c512,c768 tcontext=u:r:untrusted_app:s0:c108,c256,c512,c768 tclass=fifo_file permissive=0 app=org.python.testbed
W/.python.testbed: type=1400 audit(0.0:40141): avc: denied { ioctl } for path="pipe:[48807]" dev="pipefs" ino=48807 ioctlcmd=0x5413 scontext=u:r:untrusted_app:s0:c108,c256,c512,c768 tcontext=u:r:untrusted_app:s0:c108,c256,c512,c768 tclass=fifo_file permissive=0 app=org.python.testbed
W/.python.testbed: type=1400 audit(0.0:40142): avc: denied { ioctl } for path="pipe:[48807]" dev="pipefs" ino=48807 ioctlcmd=0x5413 scontext=u:r:untrusted_app:s0:c108,c256,c512,c768 tcontext=u:r:untrusted_app:s0:c108,c256,c512,c768 tclass=fifo_file permissive=0 app=org.python.testbed
W/.python.testbed: type=1400 audit(0.0:40204): avc: granted { execute } for path="/data/data/org.python.testbed/files/python/lib/python3.14/lib-dynload/_ctypes_test.cpython-314-x86_64-linux-android.so" dev="dm-38" ino=312758 scontext=u:r:untrusted_app:s0:c108,c256,c512,c768 tcontext=u:object_r:app_data_file:s0:c108,c256,c512,c768 tclass=file app=org.python.testbed
test_curses skipped -- No module named '_curses'
test_dbm_gnu skipped -- No module named '_gdbm'
test_dbm_ndbm skipped -- No module named '_dbm'
W/.python.testbed: type=1400 audit(0.0:40205): avc: granted { execute } for path="/data/data/org.python.testbed/files/python/lib/python3.14/lib-dynload/xxsubtype.cpython-314-x86_64-linux-android.so" dev="dm-38" ino=312811 scontext=u:r:untrusted_app:s0:c108,c256,c512,c768 tcontext=u:object_r:app_data_file:s0:c108,c256,c512,c768 tclass=file app=org.python.testbed
test_devpoll skipped -- test works only on Solaris OS family
W/.python.testbed: type=1400 audit(0.0:40206): avc: denied { ioctl } for path="pipe:[48807]" dev="pipefs" ino=48807 ioctlcmd=0x5413 scontext=u:r:untrusted_app:s0:c108,c256,c512,c768 tcontext=u:r:untrusted_app:s0:c108,c256,c512,c768 tclass=fifo_file permissive=0 app=org.python.testbed
W/.python.testbed: type=1400 audit(0.0:40207): avc: denied { ioctl } for path="pipe:[48807]" dev="pipefs" ino=48807 ioctlcmd=0x5413 scontext=u:r:untrusted_app:s0:c108,c256,c512,c768 tcontext=u:r:untrusted_app:s0:c108,c256,c512,c768 tclass=fifo_file permissive=0 app=org.python.testbed
W/.python.testbed: type=1400 audit(0.0:40208): avc: denied { ioctl } for path="pipe:[48807]" dev="pipefs" ino=48807 ioctlcmd=0x5413 scontext=u:r:untrusted_app:s0:c108,c256,c512,c768 tcontext=u:r:untrusted_app:s0:c108,c256,c512,c768 tclass=fifo_file permissive=0 app=org.python.testbed
W/.python.testbed: type=1400 audit(0.0:40209): avc: denied { ioctl } for path="pipe:[48807]" dev="pipefs" ino=48807 ioctlcmd=0x5413 scontext=u:r:untrusted_app:s0:c108,c256,c512,c768 tcontext=u:r:untrusted_app:s0:c108,c256,c512,c768 tclass=fifo_file permissive=0 app=org.python.testbed
W/.python.testbed: type=1400 audit(0.0:40210): avc: denied { ioctl } for path="pipe:[48807]" dev="pipefs" ino=48807 ioctlcmd=0x5413 scontext=u:r:untrusted_app:s0:c108,c256,c512,c768 tcontext=u:r:untrusted_app:s0:c108,c256,c512,c768 tclass=fifo_file permissive=0 app=org.python.testbed
W/.python.testbed: type=1400 audit(0.0:40211): avc: denied { ioctl } for path="pipe:[48807]" dev="pipefs" ino=48807 ioctlcmd=0x5413 scontext=u:r:untrusted_app:s0:c108,c256,c512,c768 tcontext=u:r:untrusted_app:s0:c108,c256,c512,c768 tclass=fifo_file permissive=0 app=org.python.testbed
W/.python.testbed: type=1400 audit(0.0:40212): avc: denied { ioctl } for path="pipe:[48807]" dev="pipefs" ino=48807 ioctlcmd=0x5413 scontext=u:r:untrusted_app:s0:c108,c256,c512,c768 tcontext=u:r:untrusted_app:s0:c108,c256,c512,c768 tclass=fifo_file permissive=0 app=org.python.testbed
W/.python.testbed: type=1400 audit(0.0:40213): avc: denied { ioctl } for path="pipe:[48807]" dev="pipefs" ino=48807 ioctlcmd=0x5413 scontext=u:r:untrusted_app:s0:c108,c256,c512,c768 tcontext=u:r:untrusted_app:s0:c108,c256,c512,c768 tclass=fifo_file permissive=0 app=org.python.testbed
test_dtrace skipped -- test module requires subprocess
test_embed skipped -- test module requires subprocess
W/.python.testbed: type=1400 audit(0.0:41186): avc: denied { relabelfrom } for name="pip-25.3-py3-none-any.whl" dev="dm-38" ino=328082 scontext=u:r:untrusted_app:s0:c108,c256,c512,c768 tcontext=u:object_r:app_data_file:s0:c108,c256,c512,c768 tclass=file permissive=0 app=org.python.testbed
W/.python.testbed: type=1400 audit(0.0:41187): avc: denied { relabelfrom } for name="pip-25.3-py3-none-any.whl" dev="dm-38" ino=328082 scontext=u:r:untrusted_app:s0:c108,c256,c512,c768 tcontext=u:object_r:app_data_file:s0:c108,c256,c512,c768 tclass=file permissive=0 app=org.python.testbed
W/.python.testbed: type=1400 audit(0.0:41188): avc: denied { relabelfrom } for name="pip-25.3-py3-none-any.whl" dev="dm-38" ino=328082 scontext=u:r:untrusted_app:s0:c108,c256,c512,c768 tcontext=u:object_r:app_data_file:s0:c108,c256,c512,c768 tclass=file permissive=0 app=org.python.testbed
W/.python.testbed: type=1400 audit(0.0:41189): avc: denied { relabelfrom } for name="pip-25.3-py3-none-any.whl" dev="dm-38" ino=328082 scontext=u:r:untrusted_app:s0:c108,c256,c512,c768 tcontext=u:object_r:app_data_file:s0:c108,c256,c512,c768 tclass=file permissive=0 app=org.python.testbed
W/.python.testbed: type=1400 audit(0.0:41190): avc: denied { relabelfrom } for name="pip-25.3-py3-none-any.whl" dev="dm-38" ino=328082 scontext=u:r:untrusted_app:s0:c108,c256,c512,c768 tcontext=u:object_r:app_data_file:s0:c108,c256,c512,c768 tclass=file permissive=0 app=org.python.testbed
test_faulthandler skipped -- test module requires subprocess
test_file_eintr skipped -- test module requires subprocess
W/.python.testbed: type=1400 audit(0.0:41268): avc: denied { relabelfrom } for name="file" dev="dm-38" ino=328086 scontext=u:r:untrusted_app:s0:c108,c256,c512,c768 tcontext=u:object_r:app_data_file:s0:c108,c256,c512,c768 tclass=file permissive=0 app=org.python.testbed
W/.python.testbed: type=1400 audit(0.0:41269): avc: denied { relabelfrom } for name="file" dev="dm-38" ino=328089 scontext=u:r:untrusted_app:s0:c108,c256,c512,c768 tcontext=u:object_r:app_data_file:s0:c108,c256,c512,c768 tclass=file permissive=0 app=org.python.testbed
W/.python.testbed: type=1400 audit(0.0:41270): avc: denied { relabelfrom } for name="file" dev="dm-38" ino=328089 scontext=u:r:untrusted_app:s0:c108,c256,c512,c768 tcontext=u:object_r:app_data_file:s0:c108,c256,c512,c768 tclass=file permissive=0 app=org.python.testbed
W/.python.testbed: type=1400 audit(0.0:41271): avc: denied { relabelfrom } for name="file" dev="dm-38" ino=328092 scontext=u:r:untrusted_app:s0:c108,c256,c512,c768 tcontext=u:object_r:app_data_file:s0:c108,c256,c512,c768 tclass=file permissive=0 app=org.python.testbed
W/.python.testbed: type=1400 audit(0.0:41272): avc: denied { relabelfrom } for name="file" dev="dm-38" ino=328095 scontext=u:r:untrusted_app:s0:c108,c256,c512,c768 tcontext=u:object_r:app_data_file:s0:c108,c256,c512,c768 tclass=file permissive=0 app=org.python.testbed
test_fork1 skipped -- test module requires working os.fork
test_free_threading skipped -- GIL enabled
test_generated_cases skipped -- test module requires subprocess
W/.python.testbed: type=1400 audit(0.0:41345): avc: denied { link } for name=40746573745F313938355F746D70C3A6 dev="dm-38" ino=322124 scontext=u:r:untrusted_app:s0:c108,c256,c512,c768 tcontext=u:object_r:app_data_file:s0:c108,c256,c512,c768 tclass=file permissive=0 app=org.python.testbed
W/.python.testbed: type=1400 audit(0.0:41346): avc: denied { link } for name=40746573745F313938355F746D70C3A631 dev="dm-38" ino=322124 scontext=u:r:untrusted_app:s0:c108,c256,c512,c768 tcontext=u:object_r:app_data_file:s0:c108,c256,c512,c768 tclass=file permissive=0 app=org.python.testbed
test_getopt skipped -- test module requires subprocess
test_grp skipped -- No module named 'grp'
W/.python.testbed: type=1400 audit(0.0:41347): avc: granted { execute } for path="/data/data/org.python.testbed/files/python/lib/python3.14/lib-dynload/_sha3.cpython-314-x86_64-linux-android.so" dev="dm-38" ino=312779 scontext=u:r:untrusted_app:s0:c108,c256,c512,c768 tcontext=u:object_r:app_data_file:s0:c108,c256,c512,c768 tclass=file app=org.python.testbed
W/.python.testbed: type=1400 audit(0.0:41348): avc: granted { execute } for path="/data/data/org.python.testbed/files/python/lib/python3.14/lib-dynload/_md5.cpython-314-x86_64-linux-android.so" dev="dm-38" ino=312770 scontext=u:r:untrusted_app:s0:c108,c256,c512,c768 tcontext=u:object_r:app_data_file:s0:c108,c256,c512,c768 tclass=file app=org.python.testbed
W/.python.testbed: type=1400 audit(0.0:41349): avc: granted { execute } for path="/data/data/org.python.testbed/files/python/lib/python3.14/lib-dynload/_sha1.cpython-314-x86_64-linux-android.so" dev="dm-38" ino=312777 scontext=u:r:untrusted_app:s0:c108,c256,c512,c768 tcontext=u:object_r:app_data_file:s0:c108,c256,c512,c768 tclass=file app=org.python.testbed
W/.python.testbed: type=1400 audit(0.0:41350): avc: granted { execute } for path="/data/data/org.python.testbed/files/python/lib/python3.14/lib-dynload/_sha2.cpython-314-x86_64-linux-android.so" dev="dm-38" ino=312778 scontext=u:r:untrusted_app:s0:c108,c256,c512,c768 tcontext=u:object_r:app_data_file:s0:c108,c256,c512,c768 tclass=file app=org.python.testbed
test_idle skipped -- No module named '_tkinter'
W/libc : malloc(421052631578947376) failed: returning null pointer
W/libc : malloc(421052631578947376) failed: returning null pointer
test_kqueue skipped -- test works only on BSD
test_launcher skipped -- test only applies to Windows
W/.python.testbed: type=1400 audit(0.0:41351): avc: denied { link } for name="846825.1.myhostname.mydomain" dev="dm-38" ino=328240 scontext=u:r:untrusted_app:s0:c108,c256,c512,c768 tcontext=u:object_r:app_data_file:s0:c108,c256,c512,c768 tclass=file permissive=0 app=org.python.testbed
W/.python.testbed: type=1400 audit(0.0:41352): avc: denied { link } for name="846825.2.myhostname.mydomain" dev="dm-38" ino=328242 scontext=u:r:untrusted_app:s0:c108,c256,c512,c768 tcontext=u:object_r:app_data_file:s0:c108,c256,c512,c768 tclass=file permissive=0 app=org.python.testbed
W/.python.testbed: type=1400 audit(0.0:41353): avc: denied { link } for name="846825.1.myhostname.mydomain" dev="dm-38" ino=328240 scontext=u:r:untrusted_app:s0:c108,c256,c512,c768 tcontext=u:object_r:app_data_file:s0:c108,c256,c512,c768 tclass=file permissive=0 app=org.python.testbed
W/.python.testbed: type=1400 audit(0.0:41354): avc: denied { link } for name="846825.1.myhostname.mydomain" dev="dm-38" ino=328240 scontext=u:r:untrusted_app:s0:c108,c256,c512,c768 tcontext=u:object_r:app_data_file:s0:c108,c256,c512,c768 tclass=file permissive=0 app=org.python.testbed
W/.python.testbed: type=1400 audit(0.0:41355): avc: denied { link } for name=40746573745F313938355F746D70C3A62E6C6F636B2E313736323834363832362E6C6F63616C686F73742E31393835 dev="dm-38" ino=322177 scontext=u:r:untrusted_app:s0:c108,c256,c512,c768 tcontext=u:object_r:app_data_file:s0:c108,c256,c512,c768 tclass=file permissive=0 app=org.python.testbed
W/.python.testbed: type=1400 audit(0.0:41356): avc: denied { link } for name=".mh_sequences.lock.1762846826.localhost.1985" dev="dm-38" ino=328239 scontext=u:r:untrusted_app:s0:c108,c256,c512,c768 tcontext=u:object_r:app_data_file:s0:c108,c256,c512,c768 tclass=file permissive=0 app=org.python.testbed
W/.python.testbed: type=1400 audit(0.0:41357): avc: denied { link } for name=".mh_sequences.lock.1762846826.localhost.1985" dev="dm-38" ino=328238 scontext=u:r:untrusted_app:s0:c108,c256,c512,c768 tcontext=u:object_r:app_data_file:s0:c108,c256,c512,c768 tclass=file permissive=0 app=org.python.testbed
W/.python.testbed: type=1400 audit(0.0:41358): avc: denied { link } for name=".mh_sequences.lock.1762846826.localhost.1985" dev="dm-38" ino=328240 scontext=u:r:untrusted_app:s0:c108,c256,c512,c768 tcontext=u:object_r:app_data_file:s0:c108,c256,c512,c768 tclass=file permissive=0 app=org.python.testbed
W/.python.testbed: type=1400 audit(0.0:41359): avc: denied { link } for name="4" dev="dm-38" ino=328241 scontext=u:r:untrusted_app:s0:c108,c256,c512,c768 tcontext=u:object_r:app_data_file:s0:c108,c256,c512,c768 tclass=file permissive=0 app=org.python.testbed
W/.python.testbed: type=1400 audit(0.0:41363): avc: denied { link } for name=40746573745F313938355F746D70C3A62E6C6F636B2E313736323834363832372E6C6F63616C686F73742E31393835 dev="dm-38" ino=322177 scontext=u:r:untrusted_app:s0:c108,c256,c512,c768 tcontext=u:object_r:app_data_file:s0:c108,c256,c512,c768 tclass=file permissive=0 app=org.python.testbed
W/.python.testbed: type=1400 audit(0.0:41364): avc: denied { link } for name=40746573745F313938355F746D70C3A62E6C6F636B2E313736323834363832372E6C6F63616C686F73742E31393835 dev="dm-38" ino=322177 scontext=u:r:untrusted_app:s0:c108,c256,c512,c768 tcontext=u:object_r:app_data_file:s0:c108,c256,c512,c768 tclass=file permissive=0 app=org.python.testbed
W/.python.testbed: type=1400 audit(0.0:41365): avc: denied { link } for name="1762846827.M270613P1985Q1.localhost" dev="dm-38" ino=328240 scontext=u:r:untrusted_app:s0:c108,c256,c512,c768 tcontext=u:object_r:app_data_file:s0:c108,c256,c512,c768 tclass=file permissive=0 app=org.python.testbed
W/.python.testbed: type=1400 audit(0.0:41366): avc: denied { link } for name="1762846827.M275490P1985Q2.localhost" dev="dm-38" ino=328241 scontext=u:r:untrusted_app:s0:c108,c256,c512,c768 tcontext=u:object_r:app_data_file:s0:c108,c256,c512,c768 tclass=file permissive=0 app=org.python.testbed
W/.python.testbed: type=1400 audit(0.0:41367): avc: denied { link } for name="1762846827.M289778P1985Q3.localhost" dev="dm-38" ino=328242 scontext=u:r:untrusted_app:s0:c108,c256,c512,c768 tcontext=u:object_r:app_data_file:s0:c108,c256,c512,c768 tclass=file permissive=0 app=org.python.testbed
W/.python.testbed: type=1400 audit(0.0:41539): avc: denied { link } for name="1762846828.M165692P1985Q188.localhost" dev="dm-38" ino=328241 scontext=u:r:untrusted_app:s0:c108,c256,c512,c768 tcontext=u:object_r:app_data_file:s0:c108,c256,c512,c768 tclass=file permissive=0 app=org.python.testbed
W/.python.testbed: type=1400 audit(0.0:41540): avc: denied { link } for name="1762846828.M172044P1985Q189.localhost" dev="dm-38" ino=328242 scontext=u:r:untrusted_app:s0:c108,c256,c512,c768 tcontext=u:object_r:app_data_file:s0:c108,c256,c512,c768 tclass=file permissive=0 app=org.python.testbed
W/.python.testbed: type=1400 audit(0.0:41541): avc: denied { link } for name="1762846828.M180098P1985Q190.localhost" dev="dm-38" ino=328240 scontext=u:r:untrusted_app:s0:c108,c256,c512,c768 tcontext=u:object_r:app_data_file:s0:c108,c256,c512,c768 tclass=file permissive=0 app=org.python.testbed
W/.python.testbed: type=1400 audit(0.0:41542): avc: denied { link } for name="1762846828.M185636P1985Q191.localhost" dev="dm-38" ino=328240 scontext=u:r:untrusted_app:s0:c108,c256,c512,c768 tcontext=u:object_r:app_data_file:s0:c108,c256,c512,c768 tclass=file permissive=0 app=org.python.testbed
W/.python.testbed: type=1400 audit(0.0:41543): avc: denied { link } for name="1762846828.M188650P1985Q192.localhost" dev="dm-38" ino=328241 scontext=u:r:untrusted_app:s0:c108,c256,c512,c768 tcontext=u:object_r:app_data_file:s0:c108,c256,c512,c768 tclass=file permissive=0 app=org.python.testbed
W/.python.testbed: type=1400 audit(0.0:41563): avc: denied { ioctl } for path="pipe:[48807]" dev="pipefs" ino=48807 ioctlcmd=0x5413 scontext=u:r:untrusted_app:s0:c108,c256,c512,c768 tcontext=u:r:untrusted_app:s0:c108,c256,c512,c768 tclass=fifo_file permissive=0 app=org.python.testbed
W/.python.testbed: type=1400 audit(0.0:41564): avc: denied { ioctl } for path="pipe:[48807]" dev="pipefs" ino=48807 ioctlcmd=0x5413 scontext=u:r:untrusted_app:s0:c108,c256,c512,c768 tcontext=u:r:untrusted_app:s0:c108,c256,c512,c768 tclass=fifo_file permissive=0 app=org.python.testbed
W/.python.testbed: type=1400 audit(0.0:41565): avc: denied { ioctl } for path="pipe:[48807]" dev="pipefs" ino=48807 ioctlcmd=0x5413 scontext=u:r:untrusted_app:s0:c108,c256,c512,c768 tcontext=u:r:untrusted_app:s0:c108,c256,c512,c768 tclass=fifo_file permissive=0 app=org.python.testbed
W/.python.testbed: type=1400 audit(0.0:41566): avc: denied { ioctl } for path="pipe:[48807]" dev="pipefs" ino=48807 ioctlcmd=0x5413 scontext=u:r:untrusted_app:s0:c108,c256,c512,c768 tcontext=u:r:untrusted_app:s0:c108,c256,c512,c768 tclass=fifo_file permissive=0 app=org.python.testbed
W/.python.testbed: type=1400 audit(0.0:41567): avc: denied { ioctl } for path="pipe:[48807]" dev="pipefs" ino=48807 ioctlcmd=0x5413 scontext=u:r:untrusted_app:s0:c108,c256,c512,c768 tcontext=u:r:untrusted_app:s0:c108,c256,c512,c768 tclass=fifo_file permissive=0 app=org.python.testbed
W/.python.testbed: type=1400 audit(0.0:41680): avc: granted { execute } for path=2F646174612F646174612F6F72672E707974686F6E2E746573746265642F63616368652F746573745F707974686F6E5F776F726B65725F31393835C3A62F40746573745F313938355F746D70C3A6 dev="dm-38" ino=322183 scontext=u:r:untrusted_app:s0:c108,c256,c512,c768 tcontext=u:object_r:app_data_file:s0:c108,c256,c512,c768 tclass=file app=org.python.testbed
test_msvcrt skipped -- windows related tests
test_multiprocessing_main_handling skipped -- No module named '_multiprocessing'
W/.python.testbed: type=1400 audit(0.0:41681): avc: denied { link } for name=40746573745F313938355F746D70C3A6 dev="dm-38" ino=322192 scontext=u:r:untrusted_app:s0:c108,c256,c512,c768 tcontext=u:object_r:app_data_file:s0:c108,c256,c512,c768 tclass=file permissive=0 app=org.python.testbed
W/.python.testbed: type=1400 audit(0.0:41682): avc: denied { link } for name=40746573745F313938355F746D70C3A631 dev="dm-38" ino=322192 scontext=u:r:untrusted_app:s0:c108,c256,c512,c768 tcontext=u:object_r:app_data_file:s0:c108,c256,c512,c768 tclass=file permissive=0 app=org.python.testbed
test_optparse skipped -- test module requires subprocess
W/.python.testbed: type=1400 audit(0.0:41683): avc: denied { link } for name=40746573745F313938355F746D70C3A6 dev="dm-38" ino=322200 scontext=u:r:untrusted_app:s0:c108,c256,c512,c768 tcontext=u:object_r:app_data_file:s0:c108,c256,c512,c768 tclass=file permissive=0 app=org.python.testbed
W/.python.testbed: type=1400 audit(0.0:41684): avc: denied { link } for name=40746573745F313938355F746D70C3A6 dev="dm-38" ino=322200 scontext=u:r:untrusted_app:s0:c108,c256,c512,c768 tcontext=u:object_r:app_data_file:s0:c108,c256,c512,c768 tclass=file permissive=0 app=org.python.testbed
W/.python.testbed: type=1400 audit(0.0:41685): avc: denied { link } for name=40746573745F313938355F746D70C3A6C3B1 dev="dm-38" ino=322200 scontext=u:r:untrusted_app:s0:c108,c256,c512,c768 tcontext=u:object_r:app_data_file:s0:c108,c256,c512,c768 tclass=file permissive=0 app=org.python.testbed
W/.python.testbed: type=1400 audit(0.0:41686): avc: denied { ioctl } for path="pipe:[48807]" dev="pipefs" ino=48807 ioctlcmd=0x5413 scontext=u:r:untrusted_app:s0:c108,c256,c512,c768 tcontext=u:r:untrusted_app:s0:c108,c256,c512,c768 tclass=fifo_file permissive=0 app=org.python.testbed
W/.python.testbed: type=1400 audit(0.0:41687): avc: denied { relabelfrom } for name="fileD" dev="dm-38" ino=328279 scontext=u:r:untrusted_app:s0:c108,c256,c512,c768 tcontext=u:object_r:app_data_file:s0:c108,c256,c512,c768 tclass=file permissive=0 app=org.python.testbed
W/.python.testbed: type=1400 audit(0.0:41688): avc: denied { relabelfrom } for name="dirD" dev="dm-38" ino=328278 scontext=u:r:untrusted_app:s0:c108,c256,c512,c768 tcontext=u:object_r:app_data_file:s0:c108,c256,c512,c768 tclass=dir permissive=0 app=org.python.testbed
W/.python.testbed: type=1400 audit(0.0:41689): avc: denied { relabelfrom } for name="fileC" dev="dm-38" ino=328280 scontext=u:r:untrusted_app:s0:c108,c256,c512,c768 tcontext=u:object_r:app_data_file:s0:c108,c256,c512,c768 tclass=file permissive=0 app=org.python.testbed
W/.python.testbed: type=1400 audit(0.0:41690): avc: denied { relabelfrom } for name="novel.txt" dev="dm-38" ino=328281 scontext=u:r:untrusted_app:s0:c108,c256,c512,c768 tcontext=u:object_r:app_data_file:s0:c108,c256,c512,c768 tclass=file permissive=0 app=org.python.testbed
W/.python.testbed: type=1400 audit(0.0:41691): avc: denied { relabelfrom } for name="copyA" dev="dm-38" ino=328277 scontext=u:r:untrusted_app:s0:c108,c256,c512,c768 tcontext=u:object_r:app_data_file:s0:c108,c256,c512,c768 tclass=dir permissive=0 app=org.python.testbed
W/.python.testbed: type=1400 audit(0.0:41692): avc: denied { relabelfrom } for name="copyA" dev="dm-38" ino=328277 scontext=u:r:untrusted_app:s0:c108,c256,c512,c768 tcontext=u:object_r:app_data_file:s0:c108,c256,c512,c768 tclass=file permissive=0 app=org.python.testbed
W/.python.testbed: type=1400 audit(0.0:41693): avc: denied { relabelfrom } for name="fileD" dev="dm-38" ino=328279 scontext=u:r:untrusted_app:s0:c108,c256,c512,c768 tcontext=u:object_r:app_data_file:s0:c108,c256,c512,c768 tclass=file permissive=0 app=org.python.testbed
W/.python.testbed: type=1400 audit(0.0:41694): avc: denied { relabelfrom } for name="dirD" dev="dm-38" ino=328278 scontext=u:r:untrusted_app:s0:c108,c256,c512,c768 tcontext=u:object_r:app_data_file:s0:c108,c256,c512,c768 tclass=dir permissive=0 app=org.python.testbed
W/.python.testbed: type=1400 audit(0.0:41695): avc: denied { relabelfrom } for name="fileC" dev="dm-38" ino=328280 scontext=u:r:untrusted_app:s0:c108,c256,c512,c768 tcontext=u:object_r:app_data_file:s0:c108,c256,c512,c768 tclass=file permissive=0 app=org.python.testbed
W/.python.testbed: type=1400 audit(0.0:41696): avc: denied { relabelfrom } for name="novel.txt" dev="dm-38" ino=328281 scontext=u:r:untrusted_app:s0:c108,c256,c512,c768 tcontext=u:object_r:app_data_file:s0:c108,c256,c512,c768 tclass=file permissive=0 app=org.python.testbed
W/.python.testbed: type=1400 audit(0.0:41697): avc: denied { relabelfrom } for name="copyA" dev="dm-38" ino=328277 scontext=u:r:untrusted_app:s0:c108,c256,c512,c768 tcontext=u:object_r:app_data_file:s0:c108,c256,c512,c768 tclass=dir permissive=0 app=org.python.testbed
W/.python.testbed: type=1400 audit(0.0:41698): avc: denied { relabelfrom } for name="copyA" dev="dm-38" ino=328277 scontext=u:r:untrusted_app:s0:c108,c256,c512,c768 tcontext=u:object_r:app_data_file:s0:c108,c256,c512,c768 tclass=file permissive=0 app=org.python.testbed
W/.python.testbed: type=1400 audit(0.0:41699): avc: denied { relabelfrom } for name="fileD" dev="dm-38" ino=328279 scontext=u:r:untrusted_app:s0:c108,c256,c512,c768 tcontext=u:object_r:app_data_file:s0:c108,c256,c512,c768 tclass=file permissive=0 app=org.python.testbed
W/.python.testbed: type=1400 audit(0.0:41700): avc: denied { relabelfrom } for name="dirD" dev="dm-38" ino=328278 scontext=u:r:untrusted_app:s0:c108,c256,c512,c768 tcontext=u:object_r:app_data_file:s0:c108,c256,c512,c768 tclass=dir permissive=0 app=org.python.testbed
W/.python.testbed: type=1400 audit(0.0:41701): avc: denied { relabelfrom } for name="fileC" dev="dm-38" ino=328280 scontext=u:r:untrusted_app:s0:c108,c256,c512,c768 tcontext=u:object_r:app_data_file:s0:c108,c256,c512,c768 tclass=file permissive=0 app=org.python.testbed
W/.python.testbed: type=1400 audit(0.0:41702): avc: denied { relabelfrom } for name="novel.txt" dev="dm-38" ino=328281 scontext=u:r:untrusted_app:s0:c108,c256,c512,c768 tcontext=u:object_r:app_data_file:s0:c108,c256,c512,c768 tclass=file permissive=0 app=org.python.testbed
W/.python.testbed: type=1400 audit(0.0:41703): avc: denied { relabelfrom } for name="copyA" dev="dm-38" ino=328277 scontext=u:r:untrusted_app:s0:c108,c256,c512,c768 tcontext=u:object_r:app_data_file:s0:c108,c256,c512,c768 tclass=dir permissive=0 app=org.python.testbed
W/.python.testbed: type=1400 audit(0.0:41704): avc: denied { relabelfrom } for name="copyA" dev="dm-38" ino=328277 scontext=u:r:untrusted_app:s0:c108,c256,c512,c768 tcontext=u:object_r:app_data_file:s0:c108,c256,c512,c768 tclass=file permissive=0 app=org.python.testbed
test_perf_profiler skipped -- test module requires subprocess
test_perfmaps skipped -- Linux only
W/.python.testbed: type=1400 audit(0.0:41705): avc: denied { ioctl } for path="pipe:[48807]" dev="pipefs" ino=48807 ioctlcmd=0x5413 scontext=u:r:untrusted_app:s0:c108,c256,c512,c768 tcontext=u:r:untrusted_app:s0:c108,c256,c512,c768 tclass=fifo_file permissive=0 app=org.python.testbed
W/.python.testbed: type=1400 audit(0.0:41706): avc: denied { ioctl } for path="pipe:[48807]" dev="pipefs" ino=48807 ioctlcmd=0x5413 scontext=u:r:untrusted_app:s0:c108,c256,c512,c768 tcontext=u:r:untrusted_app:s0:c108,c256,c512,c768 tclass=fifo_file permissive=0 app=org.python.testbed
W/.python.testbed: type=1400 audit(0.0:41707): avc: denied { ioctl } for path="pipe:[48807]" dev="pipefs" ino=48807 ioctlcmd=0x5413 scontext=u:r:untrusted_app:s0:c108,c256,c512,c768 tcontext=u:r:untrusted_app:s0:c108,c256,c512,c768 tclass=fifo_file permissive=0 app=org.python.testbed
W/.python.testbed: type=1400 audit(0.0:41708): avc: denied { ioctl } for path="pipe:[48807]" dev="pipefs" ino=48807 ioctlcmd=0x5413 scontext=u:r:untrusted_app:s0:c108,c256,c512,c768 tcontext=u:r:untrusted_app:s0:c108,c256,c512,c768 tclass=fifo_file permissive=0 app=org.python.testbed
W/.python.testbed: type=1400 audit(0.0:41709): avc: denied { ioctl } for path="pipe:[48807]" dev="pipefs" ino=48807 ioctlcmd=0x5413 scontext=u:r:untrusted_app:s0:c108,c256,c512,c768 tcontext=u:r:untrusted_app:s0:c108,c256,c512,c768 tclass=fifo_file permissive=0 app=org.python.testbed
W/.python.testbed: type=1400 audit(0.0:41714): avc: denied { ioctl } for path="pipe:[48807]" dev="pipefs" ino=48807 ioctlcmd=0x5413 scontext=u:r:untrusted_app:s0:c108,c256,c512,c768 tcontext=u:r:untrusted_app:s0:c108,c256,c512,c768 tclass=fifo_file permissive=0 app=org.python.testbed
W/.python.testbed: type=1400 audit(0.0:41715): avc: denied { ioctl } for path="pipe:[48807]" dev="pipefs" ino=48807 ioctlcmd=0x5413 scontext=u:r:untrusted_app:s0:c108,c256,c512,c768 tcontext=u:r:untrusted_app:s0:c108,c256,c512,c768 tclass=fifo_file permissive=0 app=org.python.testbed
W/.python.testbed: type=1400 audit(0.0:41716): avc: denied { ioctl } for path="pipe:[48807]" dev="pipefs" ino=48807 ioctlcmd=0x5413 scontext=u:r:untrusted_app:s0:c108,c256,c512,c768 tcontext=u:r:untrusted_app:s0:c108,c256,c512,c768 tclass=fifo_file permissive=0 app=org.python.testbed
W/.python.testbed: type=1400 audit(0.0:41717): avc: denied { ioctl } for path="pipe:[48807]" dev="pipefs" ino=48807 ioctlcmd=0x5413 scontext=u:r:untrusted_app:s0:c108,c256,c512,c768 tcontext=u:r:untrusted_app:s0:c108,c256,c512,c768 tclass=fifo_file permissive=0 app=org.python.testbed
W/.python.testbed: type=1400 audit(0.0:41718): avc: denied { ioctl } for path="pipe:[48807]" dev="pipefs" ino=48807 ioctlcmd=0x5413 scontext=u:r:untrusted_app:s0:c108,c256,c512,c768 tcontext=u:r:untrusted_app:s0:c108,c256,c512,c768 tclass=fifo_file permissive=0 app=org.python.testbed
W/.python.testbed: type=1400 audit(0.0:41891): avc: denied { getattr } for path="uts:[4026531838]" dev="nsfs" ino=4026531838 scontext=u:r:untrusted_app:s0:c108,c256,c512,c768 tcontext=u:object_r:nsfs:s0 tclass=file permissive=0 app=org.python.testbed
W/.python.testbed: type=1400 audit(0.0:41892): avc: denied { getsched } for scontext=u:r:untrusted_app:s0:c108,c256,c512,c768 tcontext=u:r:zygote:s0 tclass=process permissive=0 app=org.python.testbed
W/.python.testbed: type=1400 audit(0.0:41893): avc: denied { link } for name=40746573745F313938355F746D70C3A65F33 dev="dm-38" ino=328267 scontext=u:r:untrusted_app:s0:c108,c256,c512,c768 tcontext=u:object_r:app_data_file:s0:c108,c256,c512,c768 tclass=file permissive=0 app=org.python.testbed
W/.python.testbed: type=1400 audit(0.0:41894): avc: denied { link } for name=40746573745F313938355F746D70C3A6 dev="dm-38" ino=322215 scontext=u:r:untrusted_app:s0:c108,c256,c512,c768 tcontext=u:object_r:app_data_file:s0:c108,c256,c512,c768 tclass=file permissive=0 app=org.python.testbed
W/.python.testbed: type=1400 audit(0.0:41895): avc: denied { link } for name=40746573745F313938355F746D70C3A631 dev="dm-38" ino=322215 scontext=u:r:untrusted_app:s0:c108,c256,c512,c768 tcontext=u:object_r:app_data_file:s0:c108,c256,c512,c768 tclass=file permissive=0 app=org.python.testbed
test_pty skipped -- pty is not available on this platform
W/.python.testbed: type=1400 audit(0.0:41896): avc: denied { ioctl } for path="pipe:[48807]" dev="pipefs" ino=48807 ioctlcmd=0x5413 scontext=u:r:untrusted_app:s0:c108,c256,c512,c768 tcontext=u:r:untrusted_app:s0:c108,c256,c512,c768 tclass=fifo_file permissive=0 app=org.python.testbed
W/.python.testbed: type=1400 audit(0.0:41897): avc: denied { ioctl } for path="pipe:[48807]" dev="pipefs" ino=48807 ioctlcmd=0x5413 scontext=u:r:untrusted_app:s0:c108,c256,c512,c768 tcontext=u:r:untrusted_app:s0:c108,c256,c512,c768 tclass=fifo_file permissive=0 app=org.python.testbed
W/.python.testbed: type=1400 audit(0.0:41898): avc: denied { ioctl } for path="pipe:[48807]" dev="pipefs" ino=48807 ioctlcmd=0x5413 scontext=u:r:untrusted_app:s0:c108,c256,c512,c768 tcontext=u:r:untrusted_app:s0:c108,c256,c512,c768 tclass=fifo_file permissive=0 app=org.python.testbed
W/.python.testbed: type=1400 audit(0.0:41899): avc: denied { ioctl } for path="pipe:[48807]" dev="pipefs" ino=48807 ioctlcmd=0x5413 scontext=u:r:untrusted_app:s0:c108,c256,c512,c768 tcontext=u:r:untrusted_app:s0:c108,c256,c512,c768 tclass=fifo_file permissive=0 app=org.python.testbed
W/.python.testbed: type=1400 audit(0.0:41900): avc: denied { ioctl } for path="pipe:[48807]" dev="pipefs" ino=48807 ioctlcmd=0x5413 scontext=u:r:untrusted_app:s0:c108,c256,c512,c768 tcontext=u:r:untrusted_app:s0:c108,c256,c512,c768 tclass=fifo_file permissive=0 app=org.python.testbed
test_readline skipped -- No module named 'readline'
test_regrtest skipped -- test module requires subprocess
test_repl skipped -- test module requires subprocess
W/.python.testbed: type=1400 audit(0.0:41971): avc: denied { relabelfrom } for name="test.txt" dev="dm-38" ino=328286 scontext=u:r:untrusted_app:s0:c108,c256,c512,c768 tcontext=u:object_r:app_data_file:s0:c108,c256,c512,c768 tclass=file permissive=0 app=org.python.testbed
W/.python.testbed: type=1400 audit(0.0:41972): avc: denied { relabelfrom } for name="foo" dev="dm-38" ino=328286 scontext=u:r:untrusted_app:s0:c108,c256,c512,c768 tcontext=u:object_r:app_data_file:s0:c108,c256,c512,c768 tclass=file permissive=0 app=org.python.testbed
W/.python.testbed: type=1400 audit(0.0:41973): avc: denied { relabelfrom } for name="bar" dev="dm-38" ino=328286 scontext=u:r:untrusted_app:s0:c108,c256,c512,c768 tcontext=u:object_r:app_data_file:s0:c108,c256,c512,c768 tclass=file permissive=0 app=org.python.testbed
W/.python.testbed: type=1400 audit(0.0:41974): avc: denied { relabelfrom } for name="bar" dev="dm-38" ino=328286 scontext=u:r:untrusted_app:s0:c108,c256,c512,c768 tcontext=u:object_r:app_data_file:s0:c108,c256,c512,c768 tclass=lnk_file permissive=0 app=org.python.testbed
W/.python.testbed: type=1400 audit(0.0:41975): avc: denied { relabelfrom } for name="foo" dev="dm-38" ino=328291 scontext=u:r:untrusted_app:s0:c108,c256,c512,c768 tcontext=u:object_r:app_data_file:s0:c108,c256,c512,c768 tclass=file permissive=0 app=org.python.testbed
W/.python.testbed: type=1400 audit(0.0:42068): avc: denied { create } for scontext=u:r:untrusted_app:s0:c108,c256,c512,c768 tcontext=u:r:untrusted_app:s0:c108,c256,c512,c768 tclass=can_socket permissive=0 app=org.python.testbed
W/.python.testbed: type=1400 audit(0.0:42069): avc: denied { create } for scontext=u:r:untrusted_app:s0:c108,c256,c512,c768 tcontext=u:r:untrusted_app:s0:c108,c256,c512,c768 tclass=can_socket permissive=0 app=org.python.testbed
W/.python.testbed: type=1400 audit(0.0:42070): avc: denied { create } for scontext=u:r:untrusted_app:s0:c108,c256,c512,c768 tcontext=u:r:untrusted_app:s0:c108,c256,c512,c768 tclass=can_socket permissive=0 app=org.python.testbed
W/.python.testbed: type=1400 audit(0.0:42071): avc: denied { create } for scontext=u:r:untrusted_app:s0:c108,c256,c512,c768 tcontext=u:r:untrusted_app:s0:c108,c256,c512,c768 tclass=rds_socket permissive=0 app=org.python.testbed
W/.python.testbed: type=1400 audit(0.0:42072): avc: denied { create } for scontext=u:r:untrusted_app:s0:c108,c256,c512,c768 tcontext=u:r:untrusted_app:s0:c108,c256,c512,c768 tclass=alg_socket permissive=0 app=org.python.testbed
W/.python.testbed: type=1400 audit(0.0:42079): avc: denied { ioctl } for path="pipe:[48807]" dev="pipefs" ino=48807 ioctlcmd=0x5413 scontext=u:r:untrusted_app:s0:c108,c256,c512,c768 tcontext=u:r:untrusted_app:s0:c108,c256,c512,c768 tclass=fifo_file permissive=0 app=org.python.testbed
W/.python.testbed: type=1400 audit(0.0:42080): avc: denied { ioctl } for path="pipe:[48807]" dev="pipefs" ino=48807 ioctlcmd=0x5413 scontext=u:r:untrusted_app:s0:c108,c256,c512,c768 tcontext=u:r:untrusted_app:s0:c108,c256,c512,c768 tclass=fifo_file permissive=0 app=org.python.testbed
W/.python.testbed: type=1400 audit(0.0:42081): avc: denied { ioctl } for path="pipe:[48807]" dev="pipefs" ino=48807 ioctlcmd=0x5413 scontext=u:r:untrusted_app:s0:c108,c256,c512,c768 tcontext=u:r:untrusted_app:s0:c108,c256,c512,c768 tclass=fifo_file permissive=0 app=org.python.testbed
W/.python.testbed: type=1400 audit(0.0:42082): avc: denied { ioctl } for path="pipe:[48807]" dev="pipefs" ino=48807 ioctlcmd=0x5413 scontext=u:r:untrusted_app:s0:c108,c256,c512,c768 tcontext=u:r:untrusted_app:s0:c108,c256,c512,c768 tclass=fifo_file permissive=0 app=org.python.testbed
W/.python.testbed: type=1400 audit(0.0:42083): avc: denied { ioctl } for path="pipe:[48807]" dev="pipefs" ino=48807 ioctlcmd=0x5413 scontext=u:r:untrusted_app:s0:c108,c256,c512,c768 tcontext=u:r:untrusted_app:s0:c108,c256,c512,c768 tclass=fifo_file permissive=0 app=org.python.testbed
test_startfile skipped -- object <module 'os' (frozen)> has no attribute 'startfile'
Test report
===========
Sincerely,
-The Buildbot
1
0
☠ Buildbot (Python): python/cpython - failed test (failure) (3.13)
by buildbot@python.org Nov. 11, 2025
by buildbot@python.org Nov. 11, 2025
Nov. 11, 2025
The Buildbot has detected a new failure on builder ARM64 MacOS M1 Refleaks NoGIL 3.13 while building python/cpython.
Full details are available at:
https://buildbot.python.org/#/builders/1396/builds/1761
Buildbot URL: https://buildbot.python.org/
Worker for this Build: itamaro-macos-arm64-aws
Build Reason: <unknown>
Blamelist: Bénédikt Tran <10796600+picnixz(a)users.noreply.github.com>, Miss Islington (bot) <31488909+miss-islington(a)users.noreply.github.com>, Peter Bierma <zintensitydev(a)gmail.com>, Petr Viktorin <encukou(a)gmail.com>
BUILD FAILED: failed test (failure)
Summary of the results of the build (if available):
===================================================
==
Captured traceback
==================
Traceback (most recent call last):
File "/Users/buildbot/buildarea/3.13.itamaro-macos-arm64-aws.macos-with-brew.refleak.nogil/build/Lib/test/_test_multiprocessing.py", line 1492, in test_repr_rlock
self.assertEqual('<RLock(SomeOtherThread, nonzero)>', repr(lock))
~~~~~~~~~~~~~~~~^^^^^^^^^^^^^^^^^^^^^^^^^^^^^^^^^^^^^^^^^^^^^^^^^
AssertionError: '<RLock(SomeOtherThread, nonzero)>' != '<RLock(None, 0)>'
- <RLock(SomeOtherThread, nonzero)>
+ <RLock(None, 0)>
Test report
===========
Failed tests:
- test.test_multiprocessing_spawn.test_processes
- test.test_multiprocessing_forkserver.test_processes
Failed subtests:
- test_repr_rlock - test.test_multiprocessing_forkserver.test_processes.WithProcessesTestLock.test_repr_rlock
- test_repr_rlock - test.test_multiprocessing_spawn.test_processes.WithProcessesTestLock.test_repr_rlock
Test leaking resources:
- test_processes: memory blocks
Sincerely,
-The Buildbot
1
0
☠ Buildbot (Python): python/cpython - failed test (failure) (main)
by buildbot@python.org Nov. 11, 2025
by buildbot@python.org Nov. 11, 2025
Nov. 11, 2025
The Buildbot has detected a new failure on builder AMD64 Fedora Stable Refleaks 3.x while building python/cpython.
Full details are available at:
https://buildbot.python.org/#/builders/320/builds/3289
Buildbot URL: https://buildbot.python.org/
Worker for this Build: cstratak-fedora-stable-x86_64
Build Reason: <unknown>
Blamelist: Sergey B Kirpichev <skirpichev(a)gmail.com>
BUILD FAILED: failed test (failure)
Summary of the results of the build (if available):
===================================================
==
Captured traceback
==================
Traceback (most recent call last):
File "/home/buildbot/buildarea/3.x.cstratak-fedora-stable-x86_64.refleak/build/Lib/multiprocessing/process.py", line 320, in _bootstrap
self.run()
~~~~~~~~^^
File "/home/buildbot/buildarea/3.x.cstratak-fedora-stable-x86_64.refleak/build/Lib/multiprocessing/process.py", line 108, in run
self._target(*self._args, **self._kwargs)
~~~~~~~~~~~~^^^^^^^^^^^^^^^^^^^^^^^^^^^^^
File "/home/buildbot/buildarea/3.x.cstratak-fedora-stable-x86_64.refleak/build/Lib/test/_test_multiprocessing.py", line 524, in _sleep_some_event
time.sleep(100)
~~~~~~~~~~^^^^^
KeyboardInterrupt
k
Traceback (most recent call last):
File "/home/buildbot/buildarea/3.x.cstratak-fedora-stable-x86_64.refleak/build/Lib/contextlib.py", line 85, in inner
return func(*args, **kwds)
File "/home/buildbot/buildarea/3.x.cstratak-fedora-stable-x86_64.refleak/build/Lib/test/_test_multiprocessing.py", line 596, in test_interrupt
exitcode = self._kill_process(multiprocessing.Process.interrupt)
File "/home/buildbot/buildarea/3.x.cstratak-fedora-stable-x86_64.refleak/build/Lib/contextlib.py", line 85, in inner
return func(*args, **kwds)
File "/home/buildbot/buildarea/3.x.cstratak-fedora-stable-x86_64.refleak/build/Lib/test/_test_multiprocessing.py", line 577, in _kill_process
self.assertEqual(join(), None)
~~~~^^
File "/home/buildbot/buildarea/3.x.cstratak-fedora-stable-x86_64.refleak/build/Lib/test/_test_multiprocessing.py", line 250, in __call__
return self.func(*args, **kwds)
~~~~~~~~~^^^^^^^^^^^^^^^
File "/home/buildbot/buildarea/3.x.cstratak-fedora-stable-x86_64.refleak/build/Lib/multiprocessing/process.py", line 156, in join
res = self._popen.wait(timeout)
File "/home/buildbot/buildarea/3.x.cstratak-fedora-stable-x86_64.refleak/build/Lib/multiprocessing/popen_fork.py", line 44, in wait
return self.poll(os.WNOHANG if timeout == 0.0 else 0)
~~~~~~~~~^^^^^^^^^^^^^^^^^^^^^^^^^^^^^^^^^^^^^
File "/home/buildbot/buildarea/3.x.cstratak-fedora-stable-x86_64.refleak/build/Lib/multiprocessing/popen_fork.py", line 28, in poll
pid, sts = os.waitpid(self.pid, flag)
~~~~~~~~~~^^^^^^^^^^^^^^^^
File "/home/buildbot/buildarea/3.x.cstratak-fedora-stable-x86_64.refleak/build/Lib/test/_test_multiprocessing.py", line 573, in handler
raise RuntimeError('join took too long: %s' % p)
RuntimeError: join took too long: <Process name='Process-6' pid=2441711 parent=2441704 started daemon>
Traceback (most recent call last):
File "/home/buildbot/buildarea/3.x.cstratak-fedora-stable-x86_64.refleak/build/Lib/contextlib.py", line 85, in inner
return func(*args, **kwds)
File "/home/buildbot/buildarea/3.x.cstratak-fedora-stable-x86_64.refleak/build/Lib/test/_test_multiprocessing.py", line 596, in test_interrupt
exitcode = self._kill_process(multiprocessing.Process.interrupt)
File "/home/buildbot/buildarea/3.x.cstratak-fedora-stable-x86_64.refleak/build/Lib/contextlib.py", line 85, in inner
return func(*args, **kwds)
File "/home/buildbot/buildarea/3.x.cstratak-fedora-stable-x86_64.refleak/build/Lib/test/_test_multiprocessing.py", line 577, in _kill_process
self.assertEqual(join(), None)
~~~~^^
File "/home/buildbot/buildarea/3.x.cstratak-fedora-stable-x86_64.refleak/build/Lib/test/_test_multiprocessing.py", line 250, in __call__
return self.func(*args, **kwds)
~~~~~~~~~^^^^^^^^^^^^^^^
File "/home/buildbot/buildarea/3.x.cstratak-fedora-stable-x86_64.refleak/build/Lib/multiprocessing/process.py", line 156, in join
res = self._popen.wait(timeout)
File "/home/buildbot/buildarea/3.x.cstratak-fedora-stable-x86_64.refleak/build/Lib/multiprocessing/popen_fork.py", line 44, in wait
return self.poll(os.WNOHANG if timeout == 0.0 else 0)
~~~~~~~~~^^^^^^^^^^^^^^^^^^^^^^^^^^^^^^^^^^^^^
File "/home/buildbot/buildarea/3.x.cstratak-fedora-stable-x86_64.refleak/build/Lib/multiprocessing/popen_fork.py", line 28, in poll
pid, sts = os.waitpid(self.pid, flag)
~~~~~~~~~~^^^^^^^^^^^^^^^^
File "/home/buildbot/buildarea/3.x.cstratak-fedora-stable-x86_64.refleak/build/Lib/test/_test_multiprocessing.py", line 573, in handler
raise RuntimeError('join took too long: %s' % p)
RuntimeError: join took too long: <Process name='Process-150' pid=2428123 parent=2426671 started daemon>
Test report
===========
Failed tests:
- test.test_multiprocessing_fork.test_processes
Failed subtests:
- test_interrupt - test.test_multiprocessing_fork.test_processes.WithProcessesTestProcess.test_interrupt
Sincerely,
-The Buildbot
1
0
☠ Buildbot (Python): python/cpython - failed test (failure) (main)
by buildbot@python.org Nov. 11, 2025
by buildbot@python.org Nov. 11, 2025
Nov. 11, 2025
The Buildbot has detected a new failure on builder AMD64 CentOS9 NoGIL Refleaks 3.x while building python/cpython.
Full details are available at:
https://buildbot.python.org/#/builders/1610/builds/2396
Buildbot URL: https://buildbot.python.org/
Worker for this Build: itamaro-centos-aws
Build Reason: <unknown>
Blamelist: Victor Stinner <vstinner(a)python.org>
BUILD FAILED: failed test (failure)
Summary of the results of the build (if available):
===================================================
==
Captured traceback
==================
remote: Enumerating objects: 17, done.
remote: Counting objects: 6% (1/16)
remote: Counting objects: 12% (2/16)
remote: Counting objects: 18% (3/16)
remote: Counting objects: 25% (4/16)
remote: Counting objects: 31% (5/16)
remote: Counting objects: 37% (6/16)
remote: Counting objects: 43% (7/16)
remote: Counting objects: 50% (8/16)
remote: Counting objects: 56% (9/16)
remote: Counting objects: 62% (10/16)
remote: Counting objects: 68% (11/16)
remote: Counting objects: 75% (12/16)
remote: Counting objects: 81% (13/16)
remote: Counting objects: 87% (14/16)
remote: Counting objects: 93% (15/16)
remote: Counting objects: 100% (16/16)
remote: Counting objects: 100% (16/16), done.
remote: Compressing objects: 33% (1/3)
remote: Compressing objects: 66% (2/3)
remote: Compressing objects: 100% (3/3)
remote: Compressing objects: 100% (3/3), done.
remote: Total 17 (delta 13), reused 13 (delta 13), pack-reused 1 (from 1)
From https://github.com/python/cpython
* branch main -> FETCH_HEAD
Note: switching to '8435a2278f964f48d36edbc5092be5ebecfcb120'.
You are in 'detached HEAD' state. You can look around, make experimental
changes and commit them, and you can discard any commits you make in this
state without impacting any branches by switching back to a branch.
If you want to create a new branch to retain commits you create, you may
do so (now or later) by using -c with the switch command. Example:
git switch -c <new-branch-name>
Or undo this operation with:
git switch -
Turn off this advice by setting config variable advice.detachedHead to false
HEAD is now at 8435a2278f9 gh-141376: Fix exported symbols (GH-141377)
Switched to and reset branch 'main'
configure: WARNING: no system libmpdec found; falling back to pure-Python version for the decimal module
make: *** [Makefile:2493: buildbottest] Error 2
Test report
===========
Failed tests:
- test_free_threading
Test leaking resources:
- test_free_threading: file descriptors
Sincerely,
-The Buildbot
1
0
☠ Buildbot (Python): python/cpython - failed test (failure) (3.14)
by buildbot@python.org Nov. 11, 2025
by buildbot@python.org Nov. 11, 2025
Nov. 11, 2025
The Buildbot has detected a new failure on builder ARM64 macOS 3.14 while building python/cpython.
Full details are available at:
https://buildbot.python.org/#/builders/1772/builds/692
Buildbot URL: https://buildbot.python.org/
Worker for this Build: pablogsal-macos-m1
Build Reason: <unknown>
Blamelist: Miss Islington (bot) <31488909+miss-islington(a)users.noreply.github.com>
BUILD FAILED: failed test (failure)
Summary of the results of the build (if available):
===================================================
==
Captured traceback
==================
Traceback (most recent call last):
File "/Users/buildbot/buildarea/3.14.pablogsal-macos-m1.macos-with-brew/build/Lib/test/test_urllib2net.py", line 22, in _retry_thrice
last_exc = e
ResourceWarning: unclosed <socket.socket fd=8, family=2, type=1, proto=6, laddr=('192.168.0.101', 58476), raddr=('68.183.26.59', 21)>
Warning -- Unraisable exception
Exception ignored while finalizing socket <socket.socket fd=10, family=2, type=1, proto=6, laddr=('192.168.0.101', 58478), raddr=('68.183.26.59', 21)>:
Traceback (most recent call last):
File "/Users/buildbot/buildarea/3.14.pablogsal-macos-m1.macos-with-brew/build/Lib/test/test_urllib2net.py", line 22, in _retry_thrice
last_exc = e
ResourceWarning: unclosed <socket.socket fd=10, family=2, type=1, proto=6, laddr=('192.168.0.101', 58478), raddr=('68.183.26.59', 21)>
ERROR
Traceback (most recent call last):
File "/Users/buildbot/buildarea/3.14.pablogsal-macos-m1.macos-with-brew/build/Lib/test/test_urllib2net.py", line 363, in test_ftp_no_timeout
u = _urlopen_with_retry(self.FTP_HOST, timeout=None)
File "/Users/buildbot/buildarea/3.14.pablogsal-macos-m1.macos-with-brew/build/Lib/test/test_urllib2net.py", line 28, in wrapped
return _retry_thrice(func, exc, *args, **kwargs)
File "/Users/buildbot/buildarea/3.14.pablogsal-macos-m1.macos-with-brew/build/Lib/test/test_urllib2net.py", line 24, in _retry_thrice
raise last_exc
File "/Users/buildbot/buildarea/3.14.pablogsal-macos-m1.macos-with-brew/build/Lib/test/test_urllib2net.py", line 20, in _retry_thrice
return func(*args, **kwargs)
File "/Users/buildbot/buildarea/3.14.pablogsal-macos-m1.macos-with-brew/build/Lib/urllib/request.py", line 187, in urlopen
return opener.open(url, data, timeout)
~~~~~~~~~~~^^^^^^^^^^^^^^^^^^^^
File "/Users/buildbot/buildarea/3.14.pablogsal-macos-m1.macos-with-brew/build/Lib/urllib/request.py", line 487, in open
response = self._open(req, data)
File "/Users/buildbot/buildarea/3.14.pablogsal-macos-m1.macos-with-brew/build/Lib/urllib/request.py", line 504, in _open
result = self._call_chain(self.handle_open, protocol, protocol +
'_open', req)
File "/Users/buildbot/buildarea/3.14.pablogsal-macos-m1.macos-with-brew/build/Lib/urllib/request.py", line 464, in _call_chain
result = func(*args)
File "/Users/buildbot/buildarea/3.14.pablogsal-macos-m1.macos-with-brew/build/Lib/urllib/request.py", line 1556, in ftp_open
raise URLError(f"ftp error: {exp}") from exp
urllib.error.URLError: <urlopen error ftp error: [Errno 60] Operation timed out>
Traceback (most recent call last):
File "/Users/buildbot/buildarea/3.14.pablogsal-macos-m1.macos-with-brew/build/Lib/test/test_urllib2net.py", line 22, in _retry_thrice
last_exc = e
ResourceWarning: unclosed <socket.socket fd=10, family=2, type=1, proto=6, laddr=('192.168.0.101', 58525), raddr=('68.183.26.59', 21)>
Warning -- Unraisable exception
Exception ignored while finalizing socket <socket.socket fd=11, family=2, type=1, proto=6, laddr=('192.168.0.101', 58527), raddr=('68.183.26.59', 21)>:
Traceback (most recent call last):
File "/Users/buildbot/buildarea/3.14.pablogsal-macos-m1.macos-with-brew/build/Lib/test/test_urllib2net.py", line 22, in _retry_thrice
last_exc = e
ResourceWarning: unclosed <socket.socket fd=11, family=2, type=1, proto=6, laddr=('192.168.0.101', 58527), raddr=('68.183.26.59', 21)>
ERROR
Traceback (most recent call last):
File "/Users/buildbot/buildarea/3.14.pablogsal-macos-m1.macos-with-brew/build/Lib/test/test_urllib2net.py", line 342, in test_ftp_basic
u = _urlopen_with_retry(self.FTP_HOST)
File "/Users/buildbot/buildarea/3.14.pablogsal-macos-m1.macos-with-brew/build/Lib/test/test_urllib2net.py", line 28, in wrapped
return _retry_thrice(func, exc, *args, **kwargs)
File "/Users/buildbot/buildarea/3.14.pablogsal-macos-m1.macos-with-brew/build/Lib/test/test_urllib2net.py", line 24, in _retry_thrice
raise last_exc
File "/Users/buildbot/buildarea/3.14.pablogsal-macos-m1.macos-with-brew/build/Lib/test/test_urllib2net.py", line 20, in _retry_thrice
return func(*args, **kwargs)
File "/Users/buildbot/buildarea/3.14.pablogsal-macos-m1.macos-with-brew/build/Lib/urllib/request.py", line 187, in urlopen
return opener.open(url, data, timeout)
~~~~~~~~~~~^^^^^^^^^^^^^^^^^^^^
File "/Users/buildbot/buildarea/3.14.pablogsal-macos-m1.macos-with-brew/build/Lib/urllib/request.py", line 487, in open
response = self._open(req, data)
File "/Users/buildbot/buildarea/3.14.pablogsal-macos-m1.macos-with-brew/build/Lib/urllib/request.py", line 504, in _open
result = self._call_chain(self.handle_open, protocol, protocol +
'_open', req)
File "/Users/buildbot/buildarea/3.14.pablogsal-macos-m1.macos-with-brew/build/Lib/urllib/request.py", line 464, in _call_chain
result = func(*args)
File "/Users/buildbot/buildarea/3.14.pablogsal-macos-m1.macos-with-brew/build/Lib/urllib/request.py", line 1556, in ftp_open
raise URLError(f"ftp error: {exp}") from exp
urllib.error.URLError: <urlopen error ftp error: [Errno 60] Operation timed out>
Traceback (most recent call last):
File "/Users/buildbot/buildarea/3.14.pablogsal-macos-m1.macos-with-brew/build/Lib/test/test_urllib2net.py", line 22, in _retry_thrice
last_exc = e
ResourceWarning: unclosed <socket.socket fd=7, family=2, type=1, proto=6, laddr=('192.168.0.101', 58470), raddr=('68.183.26.59', 21)>
Warning -- Unraisable exception
Exception ignored while finalizing socket <socket.socket fd=8, family=2, type=1, proto=6, laddr=('192.168.0.101', 58472), raddr=('68.183.26.59', 21)>:
Traceback (most recent call last):
File "/Users/buildbot/buildarea/3.14.pablogsal-macos-m1.macos-with-brew/build/Lib/test/test_urllib2net.py", line 22, in _retry_thrice
last_exc = e
ResourceWarning: unclosed <socket.socket fd=8, family=2, type=1, proto=6, laddr=('192.168.0.101', 58472), raddr=('68.183.26.59', 21)>
ERROR
Traceback (most recent call last):
File "/Users/buildbot/buildarea/3.14.pablogsal-macos-m1.macos-with-brew/build/Lib/test/test_urllib2net.py", line 22, in _retry_thrice
last_exc = e
ResourceWarning: unclosed <socket.socket fd=10, family=2, type=1, proto=6, laddr=('192.168.0.101', 58483), raddr=('68.183.26.59', 21)>
Warning -- Unraisable exception
Exception ignored while finalizing socket <socket.socket fd=11, family=2, type=1, proto=6, laddr=('192.168.0.101', 58485), raddr=('68.183.26.59', 21)>:
Traceback (most recent call last):
File "/Users/buildbot/buildarea/3.14.pablogsal-macos-m1.macos-with-brew/build/Lib/test/test_urllib2net.py", line 22, in _retry_thrice
last_exc = e
ResourceWarning: unclosed <socket.socket fd=11, family=2, type=1, proto=6, laddr=('192.168.0.101', 58485), raddr=('68.183.26.59', 21)>
ERROR
Traceback (most recent call last):
File "/Users/buildbot/buildarea/3.14.pablogsal-macos-m1.macos-with-brew/build/Lib/test/test_urllib2net.py", line 22, in _retry_thrice
last_exc = e
ResourceWarning: unclosed <socket.socket fd=9, family=2, type=1, proto=6, laddr=('192.168.0.101', 58518), raddr=('68.183.26.59', 21)>
Warning -- Unraisable exception
Exception ignored while finalizing socket <socket.socket fd=10, family=2, type=1, proto=6, laddr=('192.168.0.101', 58520), raddr=('68.183.26.59', 21)>:
Traceback (most recent call last):
File "/Users/buildbot/buildarea/3.14.pablogsal-macos-m1.macos-with-brew/build/Lib/test/test_urllib2net.py", line 22, in _retry_thrice
last_exc = e
ResourceWarning: unclosed <socket.socket fd=10, family=2, type=1, proto=6, laddr=('192.168.0.101', 58520), raddr=('68.183.26.59', 21)>
ERROR
Traceback (most recent call last):
File "/Users/buildbot/buildarea/3.14.pablogsal-macos-m1.macos-with-brew/build/Lib/test/test_urllib2net.py", line 260, in _test_urls
f = urlopen(url, req, support.INTERNET_TIMEOUT)
File "/Users/buildbot/buildarea/3.14.pablogsal-macos-m1.macos-with-brew/build/Lib/test/test_urllib2net.py", line 28, in wrapped
return _retry_thrice(func, exc, *args, **kwargs)
File "/Users/buildbot/buildarea/3.14.pablogsal-macos-m1.macos-with-brew/build/Lib/test/test_urllib2net.py", line 24, in _retry_thrice
raise last_exc
File "/Users/buildbot/buildarea/3.14.pablogsal-macos-m1.macos-with-brew/build/Lib/test/test_urllib2net.py", line 20, in _retry_thrice
return func(*args, **kwargs)
File "/Users/buildbot/buildarea/3.14.pablogsal-macos-m1.macos-with-brew/build/Lib/urllib/request.py", line 487, in open
response = self._open(req, data)
File "/Users/buildbot/buildarea/3.14.pablogsal-macos-m1.macos-with-brew/build/Lib/urllib/request.py", line 504, in _open
result = self._call_chain(self.handle_open, protocol, protocol +
'_open', req)
File "/Users/buildbot/buildarea/3.14.pablogsal-macos-m1.macos-with-brew/build/Lib/urllib/request.py", line 464, in _call_chain
result = func(*args)
File "/Users/buildbot/buildarea/3.14.pablogsal-macos-m1.macos-with-brew/build/Lib/urllib/request.py", line 1556, in ftp_open
raise URLError(f"ftp error: {exp}") from exp
urllib.error.URLError: <urlopen error ftp error: [Errno 60] Operation timed out>
Traceback (most recent call last):
File "/Users/buildbot/buildarea/3.14.pablogsal-macos-m1.macos-with-brew/build/Lib/test/support/__init__.py", line 847, in gc_collect
gc.collect()
ResourceWarning: unclosed <socket.socket fd=7, family=2, type=1, proto=6, laddr=('192.168.0.101', 58509), raddr=('68.183.26.59', 21)>
Warning -- Unraisable exception
Exception ignored while finalizing socket <socket.socket fd=8, family=2, type=1, proto=6, laddr=('192.168.0.101', 58515), raddr=('68.183.26.59', 21)>:
Traceback (most recent call last):
File "/Users/buildbot/buildarea/3.14.pablogsal-macos-m1.macos-with-brew/build/Lib/test/support/__init__.py", line 847, in gc_collect
gc.collect()
ResourceWarning: unclosed <socket.socket fd=8, family=2, type=1, proto=6, laddr=('192.168.0.101', 58515), raddr=('68.183.26.59', 21)>
Warning -- Unraisable exception
Exception ignored while finalizing socket <socket.socket fd=9, family=2, type=1, proto=6, laddr=('192.168.0.101', 58523), raddr=('68.183.26.59', 21)>:
Traceback (most recent call last):
File "/Users/buildbot/buildarea/3.14.pablogsal-macos-m1.macos-with-brew/build/Lib/test/support/__init__.py", line 847, in gc_collect
gc.collect()
ResourceWarning: unclosed <socket.socket fd=9, family=2, type=1, proto=6, laddr=('192.168.0.101', 58523), raddr=('68.183.26.59', 21)>
Warning -- Unraisable exception
Exception ignored while finalizing socket <socket.socket fd=10, family=2, type=1, proto=6, laddr=('192.168.0.101', 58529), raddr=('68.183.26.59', 21)>:
Traceback (most recent call last):
File "/Users/buildbot/buildarea/3.14.pablogsal-macos-m1.macos-with-brew/build/Lib/test/support/__init__.py", line 847, in gc_collect
gc.collect()
ResourceWarning: unclosed <socket.socket fd=10, family=2, type=1, proto=6, laddr=('192.168.0.101', 58529), raddr=('68.183.26.59', 21)>
Traceback (most recent call last):
File "/Users/buildbot/buildarea/3.14.pablogsal-macos-m1.macos-with-brew/build/Lib/test/test_urllib2net.py", line 22, in _retry_thrice
last_exc = e
ResourceWarning: unclosed <socket.socket fd=8, family=2, type=1, proto=6, laddr=('192.168.0.101', 58511), raddr=('68.183.26.59', 21)>
Warning -- Unraisable exception
Exception ignored while finalizing socket <socket.socket fd=9, family=2, type=1, proto=6, laddr=('192.168.0.101', 58513), raddr=('68.183.26.59', 21)>:
Traceback (most recent call last):
File "/Users/buildbot/buildarea/3.14.pablogsal-macos-m1.macos-with-brew/build/Lib/test/test_urllib2net.py", line 22, in _retry_thrice
last_exc = e
ResourceWarning: unclosed <socket.socket fd=9, family=2, type=1, proto=6, laddr=('192.168.0.101', 58513), raddr=('68.183.26.59', 21)>
ERROR
Traceback (most recent call last):
File "/Users/buildbot/buildarea/3.14.pablogsal-macos-m1.macos-with-brew/build/Lib/urllib/request.py", line 1546, in ftp_open
fp, retrlen = fw.retrfile(file, type)
~~~~~~~~~~~^^^^^^^^^^^^
File "/Users/buildbot/buildarea/3.14.pablogsal-macos-m1.macos-with-brew/build/Lib/urllib/request.py", line 1826, in retrfile
conn, retrlen = self.ftp.ntransfercmd(cmd)
~~~~~~~~~~~~~~~~~~~~~^^^^^
File "/Users/buildbot/buildarea/3.14.pablogsal-macos-m1.macos-with-brew/build/Lib/ftplib.py", line 354, in ntransfercmd
conn = socket.create_connection((host, port), self.timeout,
source_address=self.source_address)
File "/Users/buildbot/buildarea/3.14.pablogsal-macos-m1.macos-with-brew/build/Lib/socket.py", line 870, in create_connection
raise exceptions[0]
File "/Users/buildbot/buildarea/3.14.pablogsal-macos-m1.macos-with-brew/build/Lib/socket.py", line 855, in create_connection
sock.connect(sa)
~~~~~~~~~~~~^^^^
TimeoutError: [Errno 60] Operation timed out
Traceback (most recent call last):
File "/Users/buildbot/buildarea/3.14.pablogsal-macos-m1.macos-with-brew/build/Lib/urllib/request.py", line 1546, in ftp_open
fp, retrlen = fw.retrfile(file, type)
~~~~~~~~~~~^^^^^^^^^^^^
File "/Users/buildbot/buildarea/3.14.pablogsal-macos-m1.macos-with-brew/build/Lib/urllib/request.py", line 1806, in retrfile
conn, retrlen = self.ftp.ntransfercmd(cmd)
~~~~~~~~~~~~~~~~~~~~~^^^^^
File "/Users/buildbot/buildarea/3.14.pablogsal-macos-m1.macos-with-brew/build/Lib/ftplib.py", line 354, in ntransfercmd
conn = socket.create_connection((host, port), self.timeout,
source_address=self.source_address)
File "/Users/buildbot/buildarea/3.14.pablogsal-macos-m1.macos-with-brew/build/Lib/socket.py", line 870, in create_connection
raise exceptions[0]
File "/Users/buildbot/buildarea/3.14.pablogsal-macos-m1.macos-with-brew/build/Lib/socket.py", line 855, in create_connection
sock.connect(sa)
~~~~~~~~~~~~^^^^
TimeoutError: timed out
Traceback (most recent call last):
File "/Users/buildbot/buildarea/3.14.pablogsal-macos-m1.macos-with-brew/build/Lib/test/test_urllib2net.py", line 372, in test_ftp_timeout
u = _urlopen_with_retry(self.FTP_HOST, timeout=60)
File "/Users/buildbot/buildarea/3.14.pablogsal-macos-m1.macos-with-brew/build/Lib/test/test_urllib2net.py", line 28, in wrapped
return _retry_thrice(func, exc, *args, **kwargs)
File "/Users/buildbot/buildarea/3.14.pablogsal-macos-m1.macos-with-brew/build/Lib/test/test_urllib2net.py", line 24, in _retry_thrice
raise last_exc
File "/Users/buildbot/buildarea/3.14.pablogsal-macos-m1.macos-with-brew/build/Lib/test/test_urllib2net.py", line 20, in _retry_thrice
return func(*args, **kwargs)
File "/Users/buildbot/buildarea/3.14.pablogsal-macos-m1.macos-with-brew/build/Lib/urllib/request.py", line 187, in urlopen
return opener.open(url, data, timeout)
~~~~~~~~~~~^^^^^^^^^^^^^^^^^^^^
File "/Users/buildbot/buildarea/3.14.pablogsal-macos-m1.macos-with-brew/build/Lib/urllib/request.py", line 487, in open
response = self._open(req, data)
File "/Users/buildbot/buildarea/3.14.pablogsal-macos-m1.macos-with-brew/build/Lib/urllib/request.py", line 504, in _open
result = self._call_chain(self.handle_open, protocol, protocol +
'_open', req)
File "/Users/buildbot/buildarea/3.14.pablogsal-macos-m1.macos-with-brew/build/Lib/urllib/request.py", line 464, in _call_chain
result = func(*args)
File "/Users/buildbot/buildarea/3.14.pablogsal-macos-m1.macos-with-brew/build/Lib/urllib/request.py", line 1556, in ftp_open
raise URLError(f"ftp error: {exp}") from exp
urllib.error.URLError: <urlopen error ftp error: [Errno 60] Operation timed out>
Traceback (most recent call last):
File "/Users/buildbot/buildarea/3.14.pablogsal-macos-m1.macos-with-brew/build/Lib/test/test_urllib2net.py", line 351, in test_ftp_default_timeout
u = _urlopen_with_retry(self.FTP_HOST)
File "/Users/buildbot/buildarea/3.14.pablogsal-macos-m1.macos-with-brew/build/Lib/test/test_urllib2net.py", line 28, in wrapped
return _retry_thrice(func, exc, *args, **kwargs)
File "/Users/buildbot/buildarea/3.14.pablogsal-macos-m1.macos-with-brew/build/Lib/test/test_urllib2net.py", line 24, in _retry_thrice
raise last_exc
File "/Users/buildbot/buildarea/3.14.pablogsal-macos-m1.macos-with-brew/build/Lib/test/test_urllib2net.py", line 20, in _retry_thrice
return func(*args, **kwargs)
File "/Users/buildbot/buildarea/3.14.pablogsal-macos-m1.macos-with-brew/build/Lib/urllib/request.py", line 187, in urlopen
return opener.open(url, data, timeout)
~~~~~~~~~~~^^^^^^^^^^^^^^^^^^^^
File "/Users/buildbot/buildarea/3.14.pablogsal-macos-m1.macos-with-brew/build/Lib/urllib/request.py", line 487, in open
response = self._open(req, data)
File "/Users/buildbot/buildarea/3.14.pablogsal-macos-m1.macos-with-brew/build/Lib/urllib/request.py", line 504, in _open
result = self._call_chain(self.handle_open, protocol, protocol +
'_open', req)
File "/Users/buildbot/buildarea/3.14.pablogsal-macos-m1.macos-with-brew/build/Lib/urllib/request.py", line 464, in _call_chain
result = func(*args)
File "/Users/buildbot/buildarea/3.14.pablogsal-macos-m1.macos-with-brew/build/Lib/urllib/request.py", line 1556, in ftp_open
raise URLError(f"ftp error: {exp}") from exp
urllib.error.URLError: <urlopen error ftp error: [Errno 60] Operation timed out>
Traceback (most recent call last):
File "/Users/buildbot/buildarea/3.14.pablogsal-macos-m1.macos-with-brew/build/Lib/test/test_urllib2net.py", line 22, in _retry_thrice
last_exc = e
ResourceWarning: unclosed <socket.socket fd=6, family=2, type=1, proto=6, laddr=('192.168.0.101', 58464), raddr=('68.183.26.59', 21)>
Warning -- Unraisable exception
Exception ignored while finalizing socket <socket.socket fd=7, family=2, type=1, proto=6, laddr=('192.168.0.101', 58466), raddr=('68.183.26.59', 21)>:
Traceback (most recent call last):
File "/Users/buildbot/buildarea/3.14.pablogsal-macos-m1.macos-with-brew/build/Lib/test/test_urllib2net.py", line 22, in _retry_thrice
last_exc = e
ResourceWarning: unclosed <socket.socket fd=7, family=2, type=1, proto=6, laddr=('192.168.0.101', 58466), raddr=('68.183.26.59', 21)>
ERROR
Traceback (most recent call last):
File "/Users/buildbot/buildarea/3.14.pablogsal-macos-m1.macos-with-brew/build/Lib/test/test_urllib2net.py", line 260, in _test_urls
f = urlopen(url, req, support.INTERNET_TIMEOUT)
File "/Users/buildbot/buildarea/3.14.pablogsal-macos-m1.macos-with-brew/build/Lib/test/test_urllib2net.py", line 28, in wrapped
return _retry_thrice(func, exc, *args, **kwargs)
File "/Users/buildbot/buildarea/3.14.pablogsal-macos-m1.macos-with-brew/build/Lib/test/test_urllib2net.py", line 24, in _retry_thrice
raise last_exc
File "/Users/buildbot/buildarea/3.14.pablogsal-macos-m1.macos-with-brew/build/Lib/test/test_urllib2net.py", line 20, in _retry_thrice
return func(*args, **kwargs)
File "/Users/buildbot/buildarea/3.14.pablogsal-macos-m1.macos-with-brew/build/Lib/urllib/request.py", line 487, in open
response = self._open(req, data)
File "/Users/buildbot/buildarea/3.14.pablogsal-macos-m1.macos-with-brew/build/Lib/urllib/request.py", line 504, in _open
result = self._call_chain(self.handle_open, protocol, protocol +
'_open', req)
File "/Users/buildbot/buildarea/3.14.pablogsal-macos-m1.macos-with-brew/build/Lib/urllib/request.py", line 464, in _call_chain
result = func(*args)
File "/Users/buildbot/buildarea/3.14.pablogsal-macos-m1.macos-with-brew/build/Lib/urllib/request.py", line 1556, in ftp_open
raise URLError(f"ftp error: {exp}") from exp
urllib.error.URLError: <urlopen error ftp error: timed out>
Traceback (most recent call last):
File "/Users/buildbot/buildarea/3.14.pablogsal-macos-m1.macos-with-brew/build/Lib/test/support/__init__.py", line 847, in gc_collect
gc.collect()
ResourceWarning: unclosed <socket.socket fd=6, family=2, type=1, proto=6, laddr=('192.168.0.101', 58468), raddr=('68.183.26.59', 21)>
Warning -- Unraisable exception
Exception ignored while finalizing socket <socket.socket fd=7, family=2, type=1, proto=6, laddr=('192.168.0.101', 58474), raddr=('68.183.26.59', 21)>:
Traceback (most recent call last):
File "/Users/buildbot/buildarea/3.14.pablogsal-macos-m1.macos-with-brew/build/Lib/test/support/__init__.py", line 847, in gc_collect
gc.collect()
ResourceWarning: unclosed <socket.socket fd=7, family=2, type=1, proto=6, laddr=('192.168.0.101', 58474), raddr=('68.183.26.59', 21)>
Warning -- Unraisable exception
Exception ignored while finalizing socket <socket.socket fd=8, family=2, type=1, proto=6, laddr=('192.168.0.101', 58480), raddr=('68.183.26.59', 21)>:
Traceback (most recent call last):
File "/Users/buildbot/buildarea/3.14.pablogsal-macos-m1.macos-with-brew/build/Lib/test/support/__init__.py", line 847, in gc_collect
gc.collect()
ResourceWarning: unclosed <socket.socket fd=8, family=2, type=1, proto=6, laddr=('192.168.0.101', 58480), raddr=('68.183.26.59', 21)>
Warning -- Unraisable exception
Exception ignored while finalizing socket <socket.socket fd=10, family=2, type=1, proto=6, laddr=('192.168.0.101', 58487), raddr=('68.183.26.59', 21)>:
Traceback (most recent call last):
File "/Users/buildbot/buildarea/3.14.pablogsal-macos-m1.macos-with-brew/build/Lib/test/support/__init__.py", line 847, in gc_collect
gc.collect()
ResourceWarning: unclosed <socket.socket fd=10, family=2, type=1, proto=6, laddr=('192.168.0.101', 58487), raddr=('68.183.26.59', 21)>
Traceback (most recent call last):
File "/Users/buildbot/buildarea/3.14.pablogsal-macos-m1.macos-with-brew/build/Lib/urllib/request.py", line 1546, in ftp_open
fp, retrlen = fw.retrfile(file, type)
~~~~~~~~~~~^^^^^^^^^^^^
File "/Users/buildbot/buildarea/3.14.pablogsal-macos-m1.macos-with-brew/build/Lib/urllib/request.py", line 1806, in retrfile
conn, retrlen = self.ftp.ntransfercmd(cmd)
~~~~~~~~~~~~~~~~~~~~~^^^^^
File "/Users/buildbot/buildarea/3.14.pablogsal-macos-m1.macos-with-brew/build/Lib/ftplib.py", line 354, in ntransfercmd
conn = socket.create_connection((host, port), self.timeout,
source_address=self.source_address)
File "/Users/buildbot/buildarea/3.14.pablogsal-macos-m1.macos-with-brew/build/Lib/socket.py", line 870, in create_connection
raise exceptions[0]
File "/Users/buildbot/buildarea/3.14.pablogsal-macos-m1.macos-with-brew/build/Lib/socket.py", line 855, in create_connection
sock.connect(sa)
~~~~~~~~~~~~^^^^
TimeoutError: [Errno 60] Operation timed out
Traceback (most recent call last):
File "/Users/buildbot/buildarea/3.14.pablogsal-macos-m1.macos-with-brew/build/Lib/test/test_urllib2net.py", line 22, in _retry_thrice
last_exc = e
ResourceWarning: unclosed <socket.socket fd=7, family=2, type=1, proto=6, laddr=('192.168.0.101', 58505), raddr=('68.183.26.59', 21)>
Warning -- Unraisable exception
Exception ignored while finalizing socket <socket.socket fd=8, family=2, type=1, proto=6, laddr=('192.168.0.101', 58507), raddr=('68.183.26.59', 21)>:
Traceback (most recent call last):
File "/Users/buildbot/buildarea/3.14.pablogsal-macos-m1.macos-with-brew/build/Lib/test/test_urllib2net.py", line 22, in _retry_thrice
last_exc = e
ResourceWarning: unclosed <socket.socket fd=8, family=2, type=1, proto=6, laddr=('192.168.0.101', 58507), raddr=('68.183.26.59', 21)>
ERROR
Test report
===========
Failed tests:
- test_urllib2net
Failed subtests:
- test_ftp_no_timeout - test.test_urllib2net.TimeoutTest.test_ftp_no_timeout
- test_ftp - test.test_urllib2net.OtherNetworkTests.test_ftp
- test_ftp_default_timeout - test.test_urllib2net.TimeoutTest.test_ftp_default_timeout
- test_ftp_timeout - test.test_urllib2net.TimeoutTest.test_ftp_timeout
- test_ftp_basic - test.test_urllib2net.TimeoutTest.test_ftp_basic
Sincerely,
-The Buildbot
1
0
☠ Buildbot (Python): python/cpython - failed test (failure) (main)
by buildbot@python.org Nov. 11, 2025
by buildbot@python.org Nov. 11, 2025
Nov. 11, 2025
The Buildbot has detected a new failure on builder AMD64 Arch Linux TraceRefs 3.x while building python/cpython.
Full details are available at:
https://buildbot.python.org/#/builders/484/builds/7018
Buildbot URL: https://buildbot.python.org/
Worker for this Build: pablogsal-arch-x86_64
Build Reason: <unknown>
Blamelist: Bénédikt Tran <10796600+picnixz(a)users.noreply.github.com>, David Ellis <ducksual(a)gmail.com>, Elena O <31424287+oklena(a)users.noreply.github.com>, Karina Souza <97332018+KarinaS0uza(a)users.noreply.github.com>, KarnbirKhera <166065758+KarnbirKhera(a)users.noreply.github.com>, Lakshya Upadhyaya <lakshya.upadhyaya05(a)gmail.com>, Peter Bierma <zintensitydev(a)gmail.com>, Petr Viktorin <encukou(a)gmail.com>, Sergey B Kirpichev <skirpichev(a)gmail.com>, Sergey Miryanov <sergey.miryanov(a)gmail.com>, Stan Ulbrych <89152624+StanFromIreland(a)users.noreply.github.com>, Victor Stinner <vstinner(a)python.org>, Yongzi Li <204532581+Yzi-Li(a)users.noreply.github.com>, dr-carlos <77367421+dr-carlos(a)users.noreply.github.com>
BUILD FAILED: failed test (failure)
Summary of the results of the build (if available):
===================================================
==
Captured traceback
==================
remote: Enumerating objects: 175, done.
remote: Counting objects: 0% (1/124)
remote: Counting objects: 1% (2/124)
remote: Counting objects: 2% (3/124)
remote: Counting objects: 3% (4/124)
remote: Counting objects: 4% (5/124)
remote: Counting objects: 5% (7/124)
remote: Counting objects: 6% (8/124)
remote: Counting objects: 7% (9/124)
remote: Counting objects: 8% (10/124)
remote: Counting objects: 9% (12/124)
remote: Counting objects: 10% (13/124)
remote: Counting objects: 11% (14/124)
remote: Counting objects: 12% (15/124)
remote: Counting objects: 13% (17/124)
remote: Counting objects: 14% (18/124)
remote: Counting objects: 15% (19/124)
remote: Counting objects: 16% (20/124)
remote: Counting objects: 17% (22/124)
remote: Counting objects: 18% (23/124)
remote: Counting objects: 19% (24/124)
remote: Counting objects: 20% (25/124)
remote: Counting objects: 21% (27/124)
remote: Counting objects: 22% (28/124)
remote: Counting objects: 23% (29/124)
remote: Counting objects: 24% (30/124)
remote: Counting objects: 25% (31/124)
remote: Counting objects: 26% (33/124)
remote: Counting objects: 27% (34/124)
remote: Counting objects: 28% (35/124)
remote: Counting objects: 29% (36/124)
remote: Counting objects: 30% (38/124)
remote: Counting objects: 31% (39/124)
remote: Counting objects: 32% (40/124)
remote: Counting objects: 33% (41/124)
remote: Counting objects: 34% (43/124)
remote: Counting objects: 35% (44/124)
remote: Counting objects: 36% (45/124)
remote: Counting objects: 37% (46/124)
remote: Counting objects: 38% (48/124)
remote: Counting objects: 39% (49/124)
remote: Counting objects: 40% (50/124)
remote: Counting objects: 41% (51/124)
remote: Counting objects: 42% (53/124)
remote: Counting objects: 43% (54/124)
remote: Counting objects: 44% (55/124)
remote: Counting objects: 45% (56/124)
remote: Counting objects: 46% (58/124)
remote: Counting objects: 47% (59/124)
remote: Counting objects: 48% (60/124)
remote: Counting objects: 49% (61/124)
remote: Counting objects: 50% (62/124)
remote: Counting objects: 51% (64/124)
remote: Counting objects: 52% (65/124)
remote: Counting objects: 53% (66/124)
remote: Counting objects: 54% (67/124)
remote: Counting objects: 55% (69/124)
remote: Counting objects: 56% (70/124)
remote: Counting objects: 57% (71/124)
remote: Counting objects: 58% (72/124)
remote: Counting objects: 59% (74/124)
remote: Counting objects: 60% (75/124)
remote: Counting objects: 61% (76/124)
remote: Counting objects: 62% (77/124)
remote: Counting objects: 63% (79/124)
remote: Counting objects: 64% (80/124)
remote: Counting objects: 65% (81/124)
remote: Counting objects: 66% (82/124)
remote: Counting objects: 67% (84/124)
remote: Counting objects: 68% (85/124)
remote: Counting objects: 69% (86/124)
remote: Counting objects: 70% (87/124)
remote: Counting objects: 71% (89/124)
remote: Counting objects: 72% (90/124)
remote: Counting objects: 73% (91/124)
remote: Counting objects: 74% (92/124)
remote: Counting objects: 75% (93/124)
remote: Counting objects: 76% (95/124)
remote: Counting objects: 77% (96/124)
remote: Counting objects: 78% (97/124)
remote: Counting objects: 79% (98/124)
remote: Counting objects: 80% (100/124)
remote: Counting objects: 81% (101/124)
remote: Counting objects: 82% (102/124)
remote: Counting objects: 83% (103/124)
remote: Counting objects: 84% (105/124)
remote: Counting objects: 85% (106/124)
remote: Counting objects: 86% (107/124)
remote: Counting objects: 87% (108/124)
remote: Counting objects: 88% (110/124)
remote: Counting objects: 89% (111/124)
remote: Counting objects: 90% (112/124)
remote: Counting objects: 91% (113/124)
remote: Counting objects: 92% (115/124)
remote: Counting objects: 93% (116/124)
remote: Counting objects: 94% (117/124)
remote: Counting objects: 95% (118/124)
remote: Counting objects: 96% (120/124)
remote: Counting objects: 97% (121/124)
remote: Counting objects: 98% (122/124)
remote: Counting objects: 99% (123/124)
remote: Counting objects: 100% (124/124)
remote: Counting objects: 100% (124/124), done.
remote: Compressing objects: 50% (1/2)
remote: Compressing objects: 100% (2/2)
remote: Compressing objects: 100% (2/2), done.
Receiving objects: 0% (1/175)
Receiving objects: 1% (2/175)
Receiving objects: 2% (4/175)
Receiving objects: 3% (6/175)
Receiving objects: 4% (7/175)
Receiving objects: 5% (9/175)
Receiving objects: 6% (11/175)
Receiving objects: 7% (13/175)
Receiving objects: 8% (14/175)
Receiving objects: 9% (16/175)
Receiving objects: 10% (18/175)
Receiving objects: 11% (20/175)
Receiving objects: 12% (21/175)
Receiving objects: 13% (23/175)
Receiving objects: 14% (25/175)
Receiving objects: 15% (27/175)
Receiving objects: 16% (28/175)
Receiving objects: 17% (30/175)
Receiving objects: 18% (32/175)
Receiving objects: 19% (34/175)
Receiving objects: 20% (35/175)
Receiving objects: 21% (37/175)
Receiving objects: 22% (39/175)
Receiving objects: 23% (41/175)
Receiving objects: 24% (42/175)
Receiving objects: 25% (44/175)
Receiving objects: 26% (46/175)
Receiving objects: 27% (48/175)
Receiving objects: 28% (49/175)
Receiving objects: 29% (51/175)
Receiving objects: 30% (53/175)
Receiving objects: 31% (55/175)
Receiving objects: 32% (56/175)
Receiving objects: 33% (58/175)
Receiving objects: 34% (60/175)
Receiving objects: 35% (62/175)
Receiving objects: 36% (63/175)
Receiving objects: 37% (65/175)
Receiving objects: 38% (67/175)
Receiving objects: 39% (69/175)
Receiving objects: 40% (70/175)
Receiving objects: 41% (72/175)
Receiving objects: 42% (74/175)
Receiving objects: 43% (76/175)
Receiving objects: 44% (77/175)
Receiving objects: 45% (79/175)
Receiving objects: 46% (81/175)
Receiving objects: 47% (83/175)
Receiving objects: 48% (84/175)
Receiving objects: 49% (86/175)
Receiving objects: 50% (88/175)
Receiving objects: 51% (90/175)
Receiving objects: 52% (91/175)
Receiving objects: 53% (93/175)
Receiving objects: 54% (95/175)
Receiving objects: 55% (97/175)
Receiving objects: 56% (98/175)
Receiving objects: 57% (100/175)
Receiving objects: 58% (102/175)
Receiving objects: 59% (104/175)
Receiving objects: 60% (105/175)
Receiving objects: 61% (107/175)
Receiving objects: 62% (109/175)
Receiving objects: 63% (111/175)
Receiving objects: 64% (112/175)
Receiving objects: 65% (114/175)
Receiving objects: 66% (116/175)
Receiving objects: 67% (118/175)
Receiving objects: 68% (119/175)
Receiving objects: 69% (121/175)
Receiving objects: 70% (123/175)
Receiving objects: 71% (125/175)
Receiving objects: 72% (126/175)
Receiving objects: 73% (128/175)
Receiving objects: 74% (130/175)
Receiving objects: 75% (132/175)
Receiving objects: 76% (133/175)
Receiving objects: 77% (135/175)
Receiving objects: 78% (137/175)
Receiving objects: 79% (139/175)
Receiving objects: 80% (140/175)
Receiving objects: 81% (142/175)
Receiving objects: 82% (144/175)
Receiving objects: 83% (146/175)
Receiving objects: 84% (147/175)
Receiving objects: 85% (149/175)
remote: Total 175 (delta 122), reused 123 (delta 122), pack-reused 51 (from 1)
Receiving objects: 86% (151/175)
Receiving objects: 87% (153/175)
Receiving objects: 88% (154/175)
Receiving objects: 89% (156/175)
Receiving objects: 90% (158/175)
Receiving objects: 91% (160/175)
Receiving objects: 92% (161/175)
Receiving objects: 93% (163/175)
Receiving objects: 94% (165/175)
Receiving objects: 95% (167/175)
Receiving objects: 96% (168/175)
Receiving objects: 97% (170/175)
Receiving objects: 98% (172/175)
Receiving objects: 99% (174/175)
Receiving objects: 100% (175/175)
Receiving objects: 100% (175/175), 137.86 KiB | 3.53 MiB/s, done.
Resolving deltas: 0% (0/136)
Resolving deltas: 1% (2/136)
Resolving deltas: 2% (3/136)
Resolving deltas: 3% (5/136)
Resolving deltas: 4% (6/136)
Resolving deltas: 5% (7/136)
Resolving deltas: 6% (9/136)
Resolving deltas: 7% (10/136)
Resolving deltas: 8% (11/136)
Resolving deltas: 9% (13/136)
Resolving deltas: 10% (14/136)
Resolving deltas: 11% (15/136)
Resolving deltas: 12% (17/136)
Resolving deltas: 13% (18/136)
Resolving deltas: 14% (20/136)
Resolving deltas: 15% (21/136)
Resolving deltas: 16% (22/136)
Resolving deltas: 17% (24/136)
Resolving deltas: 18% (25/136)
Resolving deltas: 19% (26/136)
Resolving deltas: 20% (28/136)
Resolving deltas: 21% (29/136)
Resolving deltas: 22% (30/136)
Resolving deltas: 23% (32/136)
Resolving deltas: 24% (33/136)
Resolving deltas: 25% (34/136)
Resolving deltas: 26% (36/136)
Resolving deltas: 27% (37/136)
Resolving deltas: 28% (39/136)
Resolving deltas: 29% (40/136)
Resolving deltas: 30% (41/136)
Resolving deltas: 31% (43/136)
Resolving deltas: 32% (44/136)
Resolving deltas: 33% (45/136)
Resolving deltas: 34% (47/136)
Resolving deltas: 35% (48/136)
Resolving deltas: 36% (49/136)
Resolving deltas: 37% (51/136)
Resolving deltas: 38% (52/136)
Resolving deltas: 39% (54/136)
Resolving deltas: 40% (55/136)
Resolving deltas: 41% (56/136)
Resolving deltas: 42% (58/136)
Resolving deltas: 43% (59/136)
Resolving deltas: 44% (60/136)
Resolving deltas: 45% (62/136)
Resolving deltas: 46% (63/136)
Resolving deltas: 47% (64/136)
Resolving deltas: 48% (66/136)
Resolving deltas: 49% (67/136)
Resolving deltas: 50% (68/136)
Resolving deltas: 51% (70/136)
Resolving deltas: 52% (71/136)
Resolving deltas: 53% (73/136)
Resolving deltas: 54% (74/136)
Resolving deltas: 55% (75/136)
Resolving deltas: 56% (77/136)
Resolving deltas: 57% (78/136)
Resolving deltas: 58% (79/136)
Resolving deltas: 59% (81/136)
Resolving deltas: 60% (82/136)
Resolving deltas: 61% (83/136)
Resolving deltas: 62% (85/136)
Resolving deltas: 63% (86/136)
Resolving deltas: 64% (88/136)
Resolving deltas: 65% (89/136)
Resolving deltas: 66% (90/136)
Resolving deltas: 67% (92/136)
Resolving deltas: 68% (93/136)
Resolving deltas: 69% (94/136)
Resolving deltas: 70% (96/136)
Resolving deltas: 71% (97/136)
Resolving deltas: 72% (98/136)
Resolving deltas: 73% (100/136)
Resolving deltas: 74% (101/136)
Resolving deltas: 75% (102/136)
Resolving deltas: 76% (104/136)
Resolving deltas: 77% (105/136)
Resolving deltas: 78% (107/136)
Resolving deltas: 79% (108/136)
Resolving deltas: 80% (109/136)
Resolving deltas: 81% (111/136)
Resolving deltas: 82% (112/136)
Resolving deltas: 83% (113/136)
Resolving deltas: 84% (115/136)
Resolving deltas: 85% (116/136)
Resolving deltas: 86% (117/136)
Resolving deltas: 87% (119/136)
Resolving deltas: 88% (120/136)
Resolving deltas: 89% (122/136)
Resolving deltas: 90% (123/136)
Resolving deltas: 91% (124/136)
Resolving deltas: 92% (126/136)
Resolving deltas: 93% (127/136)
Resolving deltas: 94% (128/136)
Resolving deltas: 95% (130/136)
Resolving deltas: 96% (131/136)
Resolving deltas: 97% (132/136)
Resolving deltas: 98% (134/136)
Resolving deltas: 99% (135/136)
Resolving deltas: 100% (136/136)
Resolving deltas: 100% (136/136), completed with 55 local objects.
From https://github.com/python/cpython
* branch main -> FETCH_HEAD
Note: switching to 'f835552946e29ec20144c359b8822f9e421d4d64'.
You are in 'detached HEAD' state. You can look around, make experimental
changes and commit them, and you can discard any commits you make in this
state without impacting any branches by switching back to a branch.
If you want to create a new branch to retain commits you create, you may
do so (now or later) by using -c with the switch command. Example:
git switch -c <new-branch-name>
Or undo this operation with:
git switch -
Turn off this advice by setting config variable advice.detachedHead to false
HEAD is now at f835552946e GH-141212: Fix possible memory leak in gc_mark_span_push (gh-141213)
Switched to and reset branch 'main'
make: *** [Makefile:2503: buildbottest] Error 2
Test report
===========
Failed tests:
- test_urllib2net
Sincerely,
-The Buildbot
1
0
☠ Buildbot (Python): python/cpython - failed test (failure) (3.13)
by buildbot@python.org Nov. 10, 2025
by buildbot@python.org Nov. 10, 2025
Nov. 10, 2025
The Buildbot has detected a new failure on builder ARM64 MacOS M1 Refleaks NoGIL 3.13 while building python/cpython.
Full details are available at:
https://buildbot.python.org/#/builders/1396/builds/1758
Buildbot URL: https://buildbot.python.org/
Worker for this Build: itamaro-macos-arm64-aws
Build Reason: <unknown>
Blamelist: Bénédikt Tran <10796600+picnixz(a)users.noreply.github.com>, Miss Islington (bot) <31488909+miss-islington(a)users.noreply.github.com>, Peter Bierma <zintensitydev(a)gmail.com>, Petr Viktorin <encukou(a)gmail.com>
BUILD FAILED: failed test (failure)
Summary of the results of the build (if available):
===================================================
==
Captured traceback
==================
Traceback (most recent call last):
File "/Users/buildbot/buildarea/3.13.itamaro-macos-arm64-aws.macos-with-brew.refleak.nogil/build/Lib/test/_test_multiprocessing.py", line 1492, in test_repr_rlock
self.assertEqual('<RLock(SomeOtherThread, nonzero)>', repr(lock))
~~~~~~~~~~~~~~~~^^^^^^^^^^^^^^^^^^^^^^^^^^^^^^^^^^^^^^^^^^^^^^^^^
AssertionError: '<RLock(SomeOtherThread, nonzero)>' != '<RLock(None, 0)>'
- <RLock(SomeOtherThread, nonzero)>
+ <RLock(None, 0)>
Traceback (most recent call last):
File "<string>", line 1, in <module>
from multiprocessing import Pool; pool = Pool(1); print(pool.apply_async("Python".lower).get(3)); pool.terminate()
~~~~~~~~~~~~~~~~~~~~~~~~~~~~~~~~~~~~^^^
File "/Users/buildbot/buildarea/3.13.itamaro-macos-arm64-aws.macos-with-brew.refleak.nogil/build/Lib/multiprocessing/pool.py", line 770, in get
raise TimeoutError
multiprocessing.context.TimeoutError
Traceback (most recent call last):
File "/Users/buildbot/buildarea/3.13.itamaro-macos-arm64-aws.macos-with-brew.refleak.nogil/build/Lib/test/test_venv.py", line 614, in test_multiprocessing
out, err = check_output([self.envpy(real_env_dir=True), '-c',
~~~~~~~~~~~~^^^^^^^^^^^^^^^^^^^^^^^^^^^^^^^^^^^^^^
'from multiprocessing import Pool; '
^^^^^^^^^^^^^^^^^^^^^^^^^^^^^^^^^^^^
'pool = Pool(1); '
^^^^^^^^^^^^^^^^^^
'print(pool.apply_async("Python".lower).get(3)); '
^^^^^^^^^^^^^^^^^^^^^^^^^^^^^^^^^^^^^^^^^^^^^^^^^^
'pool.terminate()'])
^^^^^^^^^^^^^^^^^^^^
File "/Users/buildbot/buildarea/3.13.itamaro-macos-arm64-aws.macos-with-brew.refleak.nogil/build/Lib/test/test_venv.py", line 59, in check_output
raise subprocess.CalledProcessError(
p.returncode, cmd, out, err)
subprocess.CalledProcessError: Command '['/private/tmp/test_python_nfudkmz0/tmpm8cjwgrl/bin/python.exe', '-c', 'from multiprocessing import Pool; pool = Pool(1); print(pool.apply_async("Python".lower).get(3)); pool.terminate()']' returned non-zero exit status 1.
Test report
===========
Failed tests:
- test_venv
- test.test_multiprocessing_forkserver.test_processes
Failed subtests:
- test_repr_rlock - test.test_multiprocessing_forkserver.test_processes.WithProcessesTestLock.test_repr_rlock
Sincerely,
-The Buildbot
1
0
☠ Buildbot (Python): python/cpython - failed test (failure) (main)
by buildbot@python.org Nov. 10, 2025
by buildbot@python.org Nov. 10, 2025
Nov. 10, 2025
The Buildbot has detected a new failure on builder ARM64 macOS 3.x while building python/cpython.
Full details are available at:
https://buildbot.python.org/#/builders/725/builds/12289
Buildbot URL: https://buildbot.python.org/
Worker for this Build: pablogsal-macos-m1
Build Reason: <unknown>
Blamelist: dr-carlos <77367421+dr-carlos(a)users.noreply.github.com>
BUILD FAILED: failed test (failure)
Summary of the results of the build (if available):
===================================================
==
Captured traceback
==================
remote: Enumerating objects: 9, done.
remote: Counting objects: 11% (1/9)
remote: Counting objects: 22% (2/9)
remote: Counting objects: 33% (3/9)
remote: Counting objects: 44% (4/9)
remote: Counting objects: 55% (5/9)
remote: Counting objects: 66% (6/9)
remote: Counting objects: 77% (7/9)
remote: Counting objects: 88% (8/9)
remote: Counting objects: 100% (9/9)
remote: Counting objects: 100% (9/9), done.
remote: Compressing objects: 20% (1/5)
remote: Compressing objects: 40% (2/5)
remote: Compressing objects: 60% (3/5)
remote: Compressing objects: 80% (4/5)
remote: Compressing objects: 100% (5/5)
remote: Compressing objects: 100% (5/5), done.
remote: Total 5 (delta 4), reused 0 (delta 0), pack-reused 0 (from 0)
From https://github.com/python/cpython
* branch main -> FETCH_HEAD
Note: switching to '06b62282c79dd69293a3eefb4c55f5acc6312cb2'.
You are in 'detached HEAD' state. You can look around, make experimental
changes and commit them, and you can discard any commits you make in this
state without impacting any branches by switching back to a branch.
If you want to create a new branch to retain commits you create, you may
do so (now or later) by using -c with the switch command. Example:
git switch -c <new-branch-name>
Or undo this operation with:
git switch -
Turn off this advice by setting config variable advice.detachedHead to false
HEAD is now at 06b62282c79 gh-141174: Improve `annotationlib.get_annotations()` test coverage (#141286)
Switched to and reset branch 'main'
make: *** [buildbottest] Error 2
Test report
===========
Failed tests:
- test_urllib2net
Sincerely,
-The Buildbot
1
0
☠ Buildbot (Python): python/cpython - failed test (failure) (3.13)
by buildbot@python.org Nov. 10, 2025
by buildbot@python.org Nov. 10, 2025
Nov. 10, 2025
The Buildbot has detected a new failure on builder ARM64 MacOS M1 Refleaks NoGIL 3.13 while building python/cpython.
Full details are available at:
https://buildbot.python.org/#/builders/1396/builds/1756
Buildbot URL: https://buildbot.python.org/
Worker for this Build: itamaro-macos-arm64-aws
Build Reason: <unknown>
Blamelist: Bénédikt Tran <10796600+picnixz(a)users.noreply.github.com>, Miss Islington (bot) <31488909+miss-islington(a)users.noreply.github.com>, Peter Bierma <zintensitydev(a)gmail.com>
BUILD FAILED: failed test (failure)
Summary of the results of the build (if available):
===================================================
==
Captured traceback
==================
Traceback (most recent call last):
File "/Users/buildbot/buildarea/3.13.itamaro-macos-arm64-aws.macos-with-brew.refleak.nogil/build/Lib/test/_test_multiprocessing.py", line 1492, in test_repr_rlock
self.assertEqual('<RLock(SomeOtherThread, nonzero)>', repr(lock))
~~~~~~~~~~~~~~~~^^^^^^^^^^^^^^^^^^^^^^^^^^^^^^^^^^^^^^^^^^^^^^^^^
AssertionError: '<RLock(SomeOtherThread, nonzero)>' != '<RLock(None, 0)>'
- <RLock(SomeOtherThread, nonzero)>
+ <RLock(None, 0)>
Test report
===========
Failed tests:
- test.test_multiprocessing_forkserver.test_processes
Failed subtests:
- test_repr_rlock - test.test_multiprocessing_forkserver.test_processes.WithProcessesTestLock.test_repr_rlock
- test_repr_rlock - test.test_multiprocessing_spawn.test_processes.WithProcessesTestLock.test_repr_rlock
Test leaking resources:
- test_processes: memory blocks
Sincerely,
-The Buildbot
1
0
☠ Buildbot (Python): python/cpython - failed test (failure) (3.13)
by buildbot@python.org Nov. 9, 2025
by buildbot@python.org Nov. 9, 2025
Nov. 9, 2025
The Buildbot has detected a new failure on builder ARM64 MacOS M1 Refleaks NoGIL 3.13 while building python/cpython.
Full details are available at:
https://buildbot.python.org/#/builders/1396/builds/1751
Buildbot URL: https://buildbot.python.org/
Worker for this Build: itamaro-macos-arm64-aws
Build Reason: <unknown>
Blamelist: Miss Islington (bot) <31488909+miss-islington(a)users.noreply.github.com>
BUILD FAILED: failed test (failure)
Summary of the results of the build (if available):
===================================================
==
Captured traceback
==================
Traceback (most recent call last):
File "/Users/buildbot/buildarea/3.13.itamaro-macos-arm64-aws.macos-with-brew.refleak.nogil/build/Lib/test/_test_multiprocessing.py", line 1492, in test_repr_rlock
self.assertEqual('<RLock(SomeOtherThread, nonzero)>', repr(lock))
~~~~~~~~~~~~~~~~^^^^^^^^^^^^^^^^^^^^^^^^^^^^^^^^^^^^^^^^^^^^^^^^^
AssertionError: '<RLock(SomeOtherThread, nonzero)>' != '<RLock(None, 0)>'
- <RLock(SomeOtherThread, nonzero)>
+ <RLock(None, 0)>
Test report
===========
Failed tests:
- test.test_multiprocessing_spawn.test_processes
Failed subtests:
- test_repr_rlock - test.test_multiprocessing_spawn.test_processes.WithProcessesTestLock.test_repr_rlock
Sincerely,
-The Buildbot
1
0