Buildbot-status
Threads by month
- ----- 2026 -----
- October
- September
- August
- July
- June
- May
- April
- March
- February
- January
- ----- 2025 -----
- December
- November
- October
- September
- August
- July
- June
- May
- April
- March
- February
- January
- ----- 2024 -----
- December
- November
- October
- September
- August
- July
- June
- May
- April
- March
- February
- January
- ----- 2023 -----
- December
- November
- October
- September
- August
- July
- June
- May
- April
- March
- February
- January
- ----- 2022 -----
- December
- November
- October
- September
- August
- July
- June
- May
- April
- March
- February
- January
- ----- 2021 -----
- December
- November
- October
- September
- August
- July
- June
- May
- April
- March
- February
- January
- ----- 2020 -----
- December
- November
- October
- September
- August
- July
- June
- May
- April
- March
- February
- January
- ----- 2019 -----
- December
- November
- October
- September
- August
- July
- June
- May
- April
- March
- February
- January
- ----- 2018 -----
- December
- November
- October
- September
- August
- July
- June
- May
- April
- March
- February
- January
- ----- 2017 -----
- December
- November
- October
- September
- August
- July
- June
- May
September 2025
- 1 participants
- 90 discussions
☠ Buildbot (Python): python/cpython - failed test (failure) (main)
by buildbot@python.org Sept. 19, 2025
by buildbot@python.org Sept. 19, 2025
Sept. 19, 2025
The Buildbot has detected a new failure on builder AMD64 Windows PGO NoGIL 3.x while building python/cpython.
Full details are available at:
https://buildbot.python.org/#/builders/1622/builds/2696
Buildbot URL: https://buildbot.python.org/
Worker for this Build: itamaro-win64-srv-22-aws
Build Reason: <unknown>
Blamelist: da-woods <dw-git(a)d-woods.co.uk>
BUILD FAILED: failed test (failure)
Summary of the results of the build (if available):
===================================================
==
Captured traceback
==================
Traceback (most recent call last):
File "C:\Users\Administrator\buildarea\3.x.itamaro-win64-srv-22-aws.nogil.pgo\build\Lib\contextlib.py", line 85, in inner
return func(*args, **kwds)
File "C:\Users\Administrator\buildarea\3.x.itamaro-win64-srv-22-aws.nogil.pgo\build\Lib\test\_test_multiprocessing.py", line 5612, in test_wait_integer
self.assertLess(delta, expected + 2)
~~~~~~~~~~~~~~~^^^^^^^^^^^^^^^^^^^^^
AssertionError: 7.376583200064488 not less than 5
Test report
===========
Failed tests:
- test_tracemalloc
- test.test_multiprocessing_spawn.test_misc
Failed subtests:
- test_wait_integer - test.test_multiprocessing_spawn.test_misc.TestWait.test_wait_integer
Sincerely,
-The Buildbot
1
0
☠ Buildbot (Python): python/cpython - failed test (failure) (main)
by buildbot@python.org Sept. 18, 2025
by buildbot@python.org Sept. 18, 2025
Sept. 18, 2025
The Buildbot has detected a new failure on builder AMD64 Fedora Stable Refleaks 3.x while building python/cpython.
Full details are available at:
https://buildbot.python.org/#/builders/320/builds/3048
Buildbot URL: https://buildbot.python.org/
Worker for this Build: cstratak-fedora-stable-x86_64
Build Reason: <unknown>
Blamelist: Adam Turner <9087854+AA-Turner(a)users.noreply.github.com>, Alex Waygood <Alex.Waygood(a)Gmail.com>, Benjamin Peterson <benjamin(a)python.org>, Cody Maloney <cmaloney(a)users.noreply.github.com>, Donghee Na <donghee.na(a)python.org>, Erlend E. Aasland <erlend(a)python.org>, Ken Jin <kenjin(a)python.org>, Malcolm Smith <smith(a)chaquo.com>, Mark Shannon <mark(a)hotpy.org>, Nicholas Tindle <nicktindle(a)outlook.com>, Oleksandr Kravets <73752159+olekskrav(a)users.noreply.github.com>, Peter Bierma <zintensitydev(a)gmail.com>, Petr Viktorin <encukou(a)gmail.com>, Rafael Fontenelle <rffontenelle(a)users.noreply.github.com>, Raymond Hettinger <rhettinger(a)users.noreply.github.com>, Sergey B Kirpichev <skirpichev(a)gmail.com>, Stan Ulbrych <89152624+StanFromIreland(a)users.noreply.github.com>, Victor Stinner <vstinner(a)python.org>
BUILD FAILED: failed test (failure)
Summary of the results of the build (if available):
===================================================
==
Captured traceback
==================
remote: Enumerating objects: 289, done.
remote: Counting objects: 0% (1/212)
remote: Counting objects: 1% (3/212)
remote: Counting objects: 2% (5/212)
remote: Counting objects: 3% (7/212)
remote: Counting objects: 4% (9/212)
remote: Counting objects: 5% (11/212)
remote: Counting objects: 6% (13/212)
remote: Counting objects: 7% (15/212)
remote: Counting objects: 8% (17/212)
remote: Counting objects: 9% (20/212)
remote: Counting objects: 10% (22/212)
remote: Counting objects: 11% (24/212)
remote: Counting objects: 12% (26/212)
remote: Counting objects: 13% (28/212)
remote: Counting objects: 14% (30/212)
remote: Counting objects: 15% (32/212)
remote: Counting objects: 16% (34/212)
remote: Counting objects: 17% (37/212)
remote: Counting objects: 18% (39/212)
remote: Counting objects: 19% (41/212)
remote: Counting objects: 20% (43/212)
remote: Counting objects: 21% (45/212)
remote: Counting objects: 22% (47/212)
remote: Counting objects: 23% (49/212)
remote: Counting objects: 24% (51/212)
remote: Counting objects: 25% (53/212)
remote: Counting objects: 26% (56/212)
remote: Counting objects: 27% (58/212)
remote: Counting objects: 28% (60/212)
remote: Counting objects: 29% (62/212)
remote: Counting objects: 30% (64/212)
remote: Counting objects: 31% (66/212)
remote: Counting objects: 32% (68/212)
remote: Counting objects: 33% (70/212)
remote: Counting objects: 34% (73/212)
remote: Counting objects: 35% (75/212)
remote: Counting objects: 36% (77/212)
remote: Counting objects: 37% (79/212)
remote: Counting objects: 38% (81/212)
remote: Counting objects: 39% (83/212)
remote: Counting objects: 40% (85/212)
remote: Counting objects: 41% (87/212)
remote: Counting objects: 42% (90/212)
remote: Counting objects: 43% (92/212)
remote: Counting objects: 44% (94/212)
remote: Counting objects: 45% (96/212)
remote: Counting objects: 46% (98/212)
remote: Counting objects: 47% (100/212)
remote: Counting objects: 48% (102/212)
remote: Counting objects: 49% (104/212)
remote: Counting objects: 50% (106/212)
remote: Counting objects: 51% (109/212)
remote: Counting objects: 52% (111/212)
remote: Counting objects: 53% (113/212)
remote: Counting objects: 54% (115/212)
remote: Counting objects: 55% (117/212)
remote: Counting objects: 56% (119/212)
remote: Counting objects: 57% (121/212)
remote: Counting objects: 58% (123/212)
remote: Counting objects: 59% (126/212)
remote: Counting objects: 60% (128/212)
remote: Counting objects: 61% (130/212)
remote: Counting objects: 62% (132/212)
remote: Counting objects: 63% (134/212)
remote: Counting objects: 64% (136/212)
remote: Counting objects: 65% (138/212)
remote: Counting objects: 66% (140/212)
remote: Counting objects: 67% (143/212)
remote: Counting objects: 68% (145/212)
remote: Counting objects: 69% (147/212)
remote: Counting objects: 70% (149/212)
remote: Counting objects: 71% (151/212)
remote: Counting objects: 72% (153/212)
remote: Counting objects: 73% (155/212)
remote: Counting objects: 74% (157/212)
remote: Counting objects: 75% (159/212)
remote: Counting objects: 76% (162/212)
remote: Counting objects: 77% (164/212)
remote: Counting objects: 78% (166/212)
remote: Counting objects: 79% (168/212)
remote: Counting objects: 80% (170/212)
remote: Counting objects: 81% (172/212)
remote: Counting objects: 82% (174/212)
remote: Counting objects: 83% (176/212)
remote: Counting objects: 84% (179/212)
remote: Counting objects: 85% (181/212)
remote: Counting objects: 86% (183/212)
remote: Counting objects: 87% (185/212)
remote: Counting objects: 88% (187/212)
remote: Counting objects: 89% (189/212)
remote: Counting objects: 90% (191/212)
remote: Counting objects: 91% (193/212)
remote: Counting objects: 92% (196/212)
remote: Counting objects: 93% (198/212)
remote: Counting objects: 94% (200/212)
remote: Counting objects: 95% (202/212)
remote: Counting objects: 96% (204/212)
remote: Counting objects: 97% (206/212)
remote: Counting objects: 98% (208/212)
remote: Counting objects: 99% (210/212)
remote: Counting objects: 100% (212/212)
remote: Counting objects: 100% (212/212), done.
remote: Compressing objects: 0% (1/148)
remote: Compressing objects: 1% (2/148)
remote: Compressing objects: 2% (3/148)
remote: Compressing objects: 3% (5/148)
remote: Compressing objects: 4% (6/148)
remote: Compressing objects: 5% (8/148)
remote: Compressing objects: 6% (9/148)
remote: Compressing objects: 7% (11/148)
remote: Compressing objects: 8% (12/148)
remote: Compressing objects: 9% (14/148)
remote: Compressing objects: 10% (15/148)
remote: Compressing objects: 11% (17/148)
remote: Compressing objects: 12% (18/148)
remote: Compressing objects: 13% (20/148)
remote: Compressing objects: 14% (21/148)
remote: Compressing objects: 15% (23/148)
remote: Compressing objects: 16% (24/148)
remote: Compressing objects: 17% (26/148)
remote: Compressing objects: 18% (27/148)
remote: Compressing objects: 19% (29/148)
remote: Compressing objects: 20% (30/148)
remote: Compressing objects: 21% (32/148)
remote: Compressing objects: 22% (33/148)
remote: Compressing objects: 23% (35/148)
remote: Compressing objects: 24% (36/148)
remote: Compressing objects: 25% (37/148)
remote: Compressing objects: 26% (39/148)
remote: Compressing objects: 27% (40/148)
remote: Compressing objects: 28% (42/148)
remote: Compressing objects: 29% (43/148)
remote: Compressing objects: 30% (45/148)
remote: Compressing objects: 31% (46/148)
remote: Compressing objects: 32% (48/148)
remote: Compressing objects: 33% (49/148)
remote: Compressing objects: 34% (51/148)
remote: Compressing objects: 35% (52/148)
remote: Compressing objects: 36% (54/148)
remote: Compressing objects: 37% (55/148)
remote: Compressing objects: 38% (57/148)
remote: Compressing objects: 39% (58/148)
remote: Compressing objects: 40% (60/148)
remote: Compressing objects: 41% (61/148)
remote: Compressing objects: 42% (63/148)
remote: Compressing objects: 43% (64/148)
remote: Compressing objects: 44% (66/148)
remote: Compressing objects: 45% (67/148)
remote: Compressing objects: 46% (69/148)
remote: Compressing objects: 47% (70/148)
remote: Compressing objects: 48% (72/148)
remote: Compressing objects: 49% (73/148)
remote: Compressing objects: 50% (74/148)
remote: Compressing objects: 51% (76/148)
remote: Compressing objects: 52% (77/148)
remote: Compressing objects: 53% (79/148)
remote: Compressing objects: 54% (80/148)
remote: Compressing objects: 55% (82/148)
remote: Compressing objects: 56% (83/148)
remote: Compressing objects: 57% (85/148)
remote: Compressing objects: 58% (86/148)
remote: Compressing objects: 59% (88/148)
remote: Compressing objects: 60% (89/148)
remote: Compressing objects: 61% (91/148)
remote: Compressing objects: 62% (92/148)
remote: Compressing objects: 63% (94/148)
remote: Compressing objects: 64% (95/148)
remote: Compressing objects: 65% (97/148)
remote: Compressing objects: 66% (98/148)
remote: Compressing objects: 67% (100/148)
remote: Compressing objects: 68% (101/148)
remote: Compressing objects: 69% (103/148)
remote: Compressing objects: 70% (104/148)
remote: Compressing objects: 71% (106/148)
remote: Compressing objects: 72% (107/148)
remote: Compressing objects: 73% (109/148)
remote: Compressing objects: 74% (110/148)
remote: Compressing objects: 75% (111/148)
remote: Compressing objects: 76% (113/148)
remote: Compressing objects: 77% (114/148)
remote: Compressing objects: 78% (116/148)
remote: Compressing objects: 79% (117/148)
remote: Compressing objects: 80% (119/148)
remote: Compressing objects: 81% (120/148)
remote: Compressing objects: 82% (122/148)
remote: Compressing objects: 83% (123/148)
remote: Compressing objects: 84% (125/148)
remote: Compressing objects: 85% (126/148)
remote: Compressing objects: 86% (128/148)
remote: Compressing objects: 87% (129/148)
remote: Compressing objects: 88% (131/148)
remote: Compressing objects: 89% (132/148)
remote: Compressing objects: 90% (134/148)
remote: Compressing objects: 91% (135/148)
remote: Compressing objects: 92% (137/148)
remote: Compressing objects: 93% (138/148)
remote: Compressing objects: 94% (140/148)
remote: Compressing objects: 95% (141/148)
remote: Compressing objects: 96% (143/148)
remote: Compressing objects: 97% (144/148)
remote: Compressing objects: 98% (146/148)
remote: Compressing objects: 99% (147/148)
remote: Compressing objects: 100% (148/148)
remote: Compressing objects: 100% (148/148), done.
Receiving objects: 0% (1/289)
Receiving objects: 1% (3/289)
Receiving objects: 2% (6/289)
Receiving objects: 3% (9/289)
Receiving objects: 4% (12/289)
Receiving objects: 5% (15/289)
Receiving objects: 6% (18/289)
Receiving objects: 7% (21/289)
Receiving objects: 8% (24/289)
Receiving objects: 9% (27/289)
Receiving objects: 10% (29/289)
Receiving objects: 11% (32/289)
Receiving objects: 12% (35/289)
Receiving objects: 13% (38/289)
Receiving objects: 14% (41/289)
Receiving objects: 15% (44/289)
Receiving objects: 16% (47/289)
Receiving objects: 17% (50/289)
Receiving objects: 18% (53/289)
Receiving objects: 19% (55/289)
Receiving objects: 20% (58/289)
Receiving objects: 21% (61/289)
Receiving objects: 22% (64/289)
Receiving objects: 23% (67/289)
Receiving objects: 24% (70/289)
Receiving objects: 25% (73/289)
Receiving objects: 26% (76/289)
Receiving objects: 27% (79/289)
Receiving objects: 28% (81/289)
Receiving objects: 29% (84/289)
Receiving objects: 30% (87/289)
Receiving objects: 31% (90/289)
Receiving objects: 32% (93/289)
Receiving objects: 33% (96/289)
Receiving objects: 34% (99/289)
Receiving objects: 35% (102/289)
Receiving objects: 36% (105/289)
Receiving objects: 37% (107/289)
Receiving objects: 38% (110/289)
Receiving objects: 39% (113/289)
Receiving objects: 40% (116/289)
Receiving objects: 41% (119/289)
Receiving objects: 42% (122/289)
Receiving objects: 43% (125/289)
Receiving objects: 44% (128/289)
Receiving objects: 45% (131/289)
Receiving objects: 46% (133/289)
Receiving objects: 47% (136/289)
Receiving objects: 48% (139/289)
Receiving objects: 49% (142/289)
Receiving objects: 50% (145/289)
Receiving objects: 51% (148/289)
Receiving objects: 52% (151/289)
Receiving objects: 53% (154/289)
Receiving objects: 54% (157/289)
Receiving objects: 55% (159/289)
Receiving objects: 56% (162/289)
Receiving objects: 57% (165/289)
Receiving objects: 58% (168/289)
Receiving objects: 59% (171/289)
Receiving objects: 60% (174/289)
Receiving objects: 61% (177/289)
Receiving objects: 62% (180/289)
Receiving objects: 63% (183/289)
Receiving objects: 64% (185/289)
Receiving objects: 65% (188/289)
Receiving objects: 66% (191/289)
Receiving objects: 67% (194/289)
Receiving objects: 68% (197/289)
Receiving objects: 69% (200/289)
Receiving objects: 70% (203/289)
Receiving objects: 71% (206/289)
Receiving objects: 72% (209/289)
Receiving objects: 73% (211/289)
Receiving objects: 74% (214/289)
Receiving objects: 75% (217/289)
Receiving objects: 76% (220/289)
Receiving objects: 77% (223/289)
Receiving objects: 78% (226/289)
Receiving objects: 79% (229/289)
Receiving objects: 80% (232/289)
Receiving objects: 81% (235/289)
Receiving objects: 82% (237/289)
Receiving objects: 83% (240/289)
Receiving objects: 84% (243/289)
Receiving objects: 85% (246/289)
Receiving objects: 86% (249/289)
Receiving objects: 87% (252/289)
Receiving objects: 88% (255/289)
Receiving objects: 89% (258/289)
Receiving objects: 90% (261/289)
Receiving objects: 91% (263/289)
Receiving objects: 92% (266/289)
Receiving objects: 93% (269/289)
Receiving objects: 94% (272/289)
Receiving objects: 95% (275/289)
Receiving objects: 96% (278/289)
remote: Total 289 (delta 130), reused 70 (delta 64), pack-reused 77 (from 3)
Receiving objects: 97% (281/289)
Receiving objects: 98% (284/289)
Receiving objects: 99% (287/289)
Receiving objects: 100% (289/289)
Receiving objects: 100% (289/289), 1.55 MiB | 8.06 MiB/s, done.
Resolving deltas: 0% (0/134)
Resolving deltas: 2% (3/134)
Resolving deltas: 3% (5/134)
Resolving deltas: 4% (6/134)
Resolving deltas: 5% (7/134)
Resolving deltas: 6% (9/134)
Resolving deltas: 7% (10/134)
Resolving deltas: 8% (11/134)
Resolving deltas: 9% (13/134)
Resolving deltas: 10% (14/134)
Resolving deltas: 11% (15/134)
Resolving deltas: 12% (17/134)
Resolving deltas: 13% (18/134)
Resolving deltas: 14% (19/134)
Resolving deltas: 15% (21/134)
Resolving deltas: 16% (22/134)
Resolving deltas: 17% (23/134)
Resolving deltas: 18% (25/134)
Resolving deltas: 19% (26/134)
Resolving deltas: 20% (27/134)
Resolving deltas: 21% (29/134)
Resolving deltas: 22% (30/134)
Resolving deltas: 23% (31/134)
Resolving deltas: 24% (33/134)
Resolving deltas: 25% (34/134)
Resolving deltas: 26% (35/134)
Resolving deltas: 27% (37/134)
Resolving deltas: 28% (38/134)
Resolving deltas: 29% (39/134)
Resolving deltas: 30% (41/134)
Resolving deltas: 31% (42/134)
Resolving deltas: 32% (43/134)
Resolving deltas: 33% (45/134)
Resolving deltas: 34% (46/134)
Resolving deltas: 35% (47/134)
Resolving deltas: 36% (49/134)
Resolving deltas: 37% (50/134)
Resolving deltas: 38% (51/134)
Resolving deltas: 39% (53/134)
Resolving deltas: 40% (54/134)
Resolving deltas: 41% (55/134)
Resolving deltas: 42% (57/134)
Resolving deltas: 43% (58/134)
Resolving deltas: 44% (59/134)
Resolving deltas: 45% (61/134)
Resolving deltas: 46% (62/134)
Resolving deltas: 47% (63/134)
Resolving deltas: 48% (65/134)
Resolving deltas: 49% (66/134)
Resolving deltas: 50% (67/134)
Resolving deltas: 51% (69/134)
Resolving deltas: 52% (70/134)
Resolving deltas: 53% (72/134)
Resolving deltas: 54% (73/134)
Resolving deltas: 55% (74/134)
Resolving deltas: 56% (76/134)
Resolving deltas: 57% (77/134)
Resolving deltas: 58% (79/134)
Resolving deltas: 59% (80/134)
Resolving deltas: 60% (81/134)
Resolving deltas: 61% (82/134)
Resolving deltas: 62% (84/134)
Resolving deltas: 63% (85/134)
Resolving deltas: 64% (86/134)
Resolving deltas: 65% (88/134)
Resolving deltas: 66% (89/134)
Resolving deltas: 67% (90/134)
Resolving deltas: 68% (92/134)
Resolving deltas: 69% (93/134)
Resolving deltas: 70% (94/134)
Resolving deltas: 71% (96/134)
Resolving deltas: 72% (97/134)
Resolving deltas: 73% (98/134)
Resolving deltas: 74% (100/134)
Resolving deltas: 75% (101/134)
Resolving deltas: 76% (102/134)
Resolving deltas: 77% (104/134)
Resolving deltas: 78% (105/134)
Resolving deltas: 79% (106/134)
Resolving deltas: 80% (108/134)
Resolving deltas: 81% (109/134)
Resolving deltas: 82% (110/134)
Resolving deltas: 83% (112/134)
Resolving deltas: 84% (113/134)
Resolving deltas: 85% (114/134)
Resolving deltas: 86% (116/134)
Resolving deltas: 87% (117/134)
Resolving deltas: 88% (118/134)
Resolving deltas: 89% (120/134)
Resolving deltas: 90% (121/134)
Resolving deltas: 91% (122/134)
Resolving deltas: 92% (124/134)
Resolving deltas: 93% (125/134)
Resolving deltas: 94% (126/134)
Resolving deltas: 95% (128/134)
Resolving deltas: 96% (129/134)
Resolving deltas: 97% (130/134)
Resolving deltas: 98% (132/134)
Resolving deltas: 99% (133/134)
Resolving deltas: 100% (134/134)
Resolving deltas: 100% (134/134), completed with 27 local objects.
From https://github.com/python/cpython
* branch main -> FETCH_HEAD
Note: switching to '3eec8977528dbbd22f9c0873930507fd97053843'.
You are in 'detached HEAD' state. You can look around, make experimental
changes and commit them, and you can discard any commits you make in this
state without impacting any branches by switching back to a branch.
If you want to create a new branch to retain commits you create, you may
do so (now or later) by using -c with the switch command. Example:
git switch -c <new-branch-name>
Or undo this operation with:
git switch -
Turn off this advice by setting config variable advice.detachedHead to false
HEAD is now at 3eec8977528 gh-136003: Skip non-daemon threads when exceptions occur during finalization (GH-139129)
Switched to and reset branch 'main'
configure: WARNING: no system libmpdec found; falling back to pure-Python version for the decimal module
make: *** [Makefile:2495: buildbottest] Error 2
Test report
===========
Failed tests:
- test.test_asyncio.test_events
- test_logging
- test_socketserver
- test_capi
- test.test_asyncio.test_sock_lowlevel
- test_socket
Test leaking resources:
- test_socket: references
- test_logging: references
- test_logging: memory blocks
- test_sock_lowlevel: references
- test_socketserver: references
- test_sock_lowlevel: memory blocks
- test_events: references
- test_events: memory blocks
- test_capi: file descriptors
- test_socketserver: memory blocks
- test_socket: memory blocks
Sincerely,
-The Buildbot
1
0
☠ Buildbot (Python): python/cpython - failed test (failure) (3.13)
by buildbot@python.org Sept. 18, 2025
by buildbot@python.org Sept. 18, 2025
Sept. 18, 2025
The Buildbot has detected a new failure on builder ARM64 MacOS M1 Refleaks NoGIL 3.13 while building python/cpython.
Full details are available at:
https://buildbot.python.org/#/builders/1396/builds/1606
Buildbot URL: https://buildbot.python.org/
Worker for this Build: itamaro-macos-arm64-aws
Build Reason: <unknown>
Blamelist: Bénédikt Tran <10796600+picnixz(a)users.noreply.github.com>, Erlend E. Aasland <erlend(a)python.org>, Miss Islington (bot) <31488909+miss-islington(a)users.noreply.github.com>, Petr Viktorin <encukou(a)gmail.com>, Łukasz Langa <lukasz(a)langa.pl>
BUILD FAILED: failed test (failure)
Summary of the results of the build (if available):
===================================================
==
Captured traceback
==================
Traceback (most recent call last):
File "/Users/buildbot/buildarea/3.13.itamaro-macos-arm64-aws.macos-with-brew.refleak.nogil/build/Lib/test/_test_multiprocessing.py", line 1492, in test_repr_rlock
self.assertEqual('<RLock(SomeOtherThread, nonzero)>', repr(lock))
~~~~~~~~~~~~~~~~^^^^^^^^^^^^^^^^^^^^^^^^^^^^^^^^^^^^^^^^^^^^^^^^^
AssertionError: '<RLock(SomeOtherThread, nonzero)>' != '<RLock(None, 0)>'
- <RLock(SomeOtherThread, nonzero)>
+ <RLock(None, 0)>
Test report
===========
Failed tests:
- test.test_multiprocessing_forkserver.test_processes
- test.test_multiprocessing_spawn.test_processes
Failed subtests:
- test_repr_rlock - test.test_multiprocessing_forkserver.test_processes.WithProcessesTestLock.test_repr_rlock
- test_repr_rlock - test.test_multiprocessing_spawn.test_processes.WithProcessesTestLock.test_repr_rlock
Sincerely,
-The Buildbot
1
0
☠ Buildbot (Python): python/cpython - failed test (failure) (main)
by buildbot@python.org Sept. 18, 2025
by buildbot@python.org Sept. 18, 2025
Sept. 18, 2025
The Buildbot has detected a new failure on builder AMD64 Fedora Stable LTO + PGO 3.x while building python/cpython.
Full details are available at:
https://buildbot.python.org/#/builders/29/builds/8996
Buildbot URL: https://buildbot.python.org/
Worker for this Build: cstratak-fedora-stable-x86_64
Build Reason: <unknown>
Blamelist: Adam Turner <9087854+AA-Turner(a)users.noreply.github.com>, Benjamin Peterson <benjamin(a)python.org>, Ken Jin <kenjin(a)python.org>, Malcolm Smith <smith(a)chaquo.com>, Sergey B Kirpichev <skirpichev(a)gmail.com>, Victor Stinner <vstinner(a)python.org>
BUILD FAILED: failed test (failure)
Summary of the results of the build (if available):
===================================================
==
Captured traceback
==================
Traceback (most recent call last):
File "/home/buildbot/buildarea/3.x.cstratak-fedora-stable-x86_64.lto-pgo/build/Lib/contextlib.py", line 85, in inner
return func(*args, **kwds)
File "/home/buildbot/buildarea/3.x.cstratak-fedora-stable-x86_64.lto-pgo/build/Lib/test/_test_multiprocessing.py", line 596, in test_interrupt
exitcode = self._kill_process(multiprocessing.Process.interrupt)
File "/home/buildbot/buildarea/3.x.cstratak-fedora-stable-x86_64.lto-pgo/build/Lib/contextlib.py", line 85, in inner
return func(*args, **kwds)
File "/home/buildbot/buildarea/3.x.cstratak-fedora-stable-x86_64.lto-pgo/build/Lib/test/_test_multiprocessing.py", line 577, in _kill_process
self.assertEqual(join(), None)
~~~~^^
File "/home/buildbot/buildarea/3.x.cstratak-fedora-stable-x86_64.lto-pgo/build/Lib/test/_test_multiprocessing.py", line 250, in __call__
return self.func(*args, **kwds)
~~~~~~~~~^^^^^^^^^^^^^^^
File "/home/buildbot/buildarea/3.x.cstratak-fedora-stable-x86_64.lto-pgo/build/Lib/multiprocessing/process.py", line 156, in join
res = self._popen.wait(timeout)
File "/home/buildbot/buildarea/3.x.cstratak-fedora-stable-x86_64.lto-pgo/build/Lib/multiprocessing/popen_fork.py", line 44, in wait
return self.poll(os.WNOHANG if timeout == 0.0 else 0)
~~~~~~~~~^^^^^^^^^^^^^^^^^^^^^^^^^^^^^^^^^^^^^
File "/home/buildbot/buildarea/3.x.cstratak-fedora-stable-x86_64.lto-pgo/build/Lib/multiprocessing/popen_fork.py", line 28, in poll
pid, sts = os.waitpid(self.pid, flag)
~~~~~~~~~~^^^^^^^^^^^^^^^^
File "/home/buildbot/buildarea/3.x.cstratak-fedora-stable-x86_64.lto-pgo/build/Lib/test/_test_multiprocessing.py", line 573, in handler
raise RuntimeError('join took too long: %s' % p)
RuntimeError: join took too long: <Process name='Process-156' pid=279607 parent=274672 started daemon>
Traceback (most recent call last):
File "/home/buildbot/buildarea/3.x.cstratak-fedora-stable-x86_64.lto-pgo/build/Lib/contextlib.py", line 85, in inner
return func(*args, **kwds)
File "/home/buildbot/buildarea/3.x.cstratak-fedora-stable-x86_64.lto-pgo/build/Lib/test/_test_multiprocessing.py", line 596, in test_interrupt
exitcode = self._kill_process(multiprocessing.Process.interrupt)
File "/home/buildbot/buildarea/3.x.cstratak-fedora-stable-x86_64.lto-pgo/build/Lib/contextlib.py", line 85, in inner
return func(*args, **kwds)
File "/home/buildbot/buildarea/3.x.cstratak-fedora-stable-x86_64.lto-pgo/build/Lib/test/_test_multiprocessing.py", line 577, in _kill_process
self.assertEqual(join(), None)
~~~~^^
File "/home/buildbot/buildarea/3.x.cstratak-fedora-stable-x86_64.lto-pgo/build/Lib/test/_test_multiprocessing.py", line 250, in __call__
return self.func(*args, **kwds)
~~~~~~~~~^^^^^^^^^^^^^^^
File "/home/buildbot/buildarea/3.x.cstratak-fedora-stable-x86_64.lto-pgo/build/Lib/multiprocessing/process.py", line 156, in join
res = self._popen.wait(timeout)
File "/home/buildbot/buildarea/3.x.cstratak-fedora-stable-x86_64.lto-pgo/build/Lib/multiprocessing/popen_fork.py", line 44, in wait
return self.poll(os.WNOHANG if timeout == 0.0 else 0)
~~~~~~~~~^^^^^^^^^^^^^^^^^^^^^^^^^^^^^^^^^^^^^
File "/home/buildbot/buildarea/3.x.cstratak-fedora-stable-x86_64.lto-pgo/build/Lib/multiprocessing/popen_fork.py", line 28, in poll
pid, sts = os.waitpid(self.pid, flag)
~~~~~~~~~~^^^^^^^^^^^^^^^^
File "/home/buildbot/buildarea/3.x.cstratak-fedora-stable-x86_64.lto-pgo/build/Lib/test/_test_multiprocessing.py", line 573, in handler
raise RuntimeError('join took too long: %s' % p)
RuntimeError: join took too long: <Process name='Process-1' pid=298087 parent=298085 started daemon>
Test report
===========
Failed tests:
- test.test_multiprocessing_fork.test_processes
Failed subtests:
- test_interrupt - test.test_multiprocessing_fork.test_processes.WithProcessesTestProcess.test_interrupt
Sincerely,
-The Buildbot
1
0
☠ Buildbot (Python): python/cpython - failed test (failure) (main)
by buildbot@python.org Sept. 18, 2025
by buildbot@python.org Sept. 18, 2025
Sept. 18, 2025
The Buildbot has detected a new failure on builder AMD64 Windows PGO NoGIL 3.x while building python/cpython.
Full details are available at:
https://buildbot.python.org/#/builders/1622/builds/2691
Buildbot URL: https://buildbot.python.org/
Worker for this Build: itamaro-win64-srv-22-aws
Build Reason: <unknown>
Blamelist: Benjamin Peterson <benjamin(a)python.org>, Sergey B Kirpichev <skirpichev(a)gmail.com>, Victor Stinner <vstinner(a)python.org>
BUILD FAILED: failed test (failure)
Summary of the results of the build (if available):
===================================================
==
Captured traceback
==================
remote: Enumerating objects: 26, done.
remote: Counting objects: 3% (1/26)
remote: Counting objects: 7% (2/26)
remote: Counting objects: 11% (3/26)
remote: Counting objects: 15% (4/26)
remote: Counting objects: 19% (5/26)
remote: Counting objects: 23% (6/26)
remote: Counting objects: 26% (7/26)
remote: Counting objects: 30% (8/26)
remote: Counting objects: 34% (9/26)
remote: Counting objects: 38% (10/26)
remote: Counting objects: 42% (11/26)
remote: Counting objects: 46% (12/26)
remote: Counting objects: 50% (13/26)
remote: Counting objects: 53% (14/26)
remote: Counting objects: 57% (15/26)
remote: Counting objects: 61% (16/26)
remote: Counting objects: 65% (17/26)
remote: Counting objects: 69% (18/26)
remote: Counting objects: 73% (19/26)
remote: Counting objects: 76% (20/26)
remote: Counting objects: 80% (21/26)
remote: Counting objects: 84% (22/26)
remote: Counting objects: 88% (23/26)
remote: Counting objects: 92% (24/26)
remote: Counting objects: 96% (25/26)
remote: Counting objects: 100% (26/26)
remote: Counting objects: 100% (26/26), done.
remote: Compressing objects: 9% (1/11)
remote: Compressing objects: 18% (2/11)
remote: Compressing objects: 27% (3/11)
remote: Compressing objects: 36% (4/11)
remote: Compressing objects: 45% (5/11)
remote: Compressing objects: 54% (6/11)
remote: Compressing objects: 63% (7/11)
remote: Compressing objects: 72% (8/11)
remote: Compressing objects: 81% (9/11)
remote: Compressing objects: 90% (10/11)
remote: Compressing objects: 100% (11/11)
remote: Compressing objects: 100% (11/11), done.
remote: Total 14 (delta 12), reused 5 (delta 3), pack-reused 0 (from 0)
From https://github.com/python/cpython
* branch main -> FETCH_HEAD
Note: switching to 'e163fbdeda17104f3782afcae557c0211a2ba0a6'.
You are in 'detached HEAD' state. You can look around, make experimental
changes and commit them, and you can discard any commits you make in this
state without impacting any branches by switching back to a branch.
If you want to create a new branch to retain commits you create, you may
do so (now or later) by using -c with the switch command. Example:
git switch -c <new-branch-name>
Or undo this operation with:
git switch -
Turn off this advice by setting config variable advice.detachedHead to false
HEAD is now at e163fbdeda1 fixes gh-139090: add os.RWF_DONTCACHE (#139091)
Switched to and reset branch 'main'
Could Not Find C:\Users\Administrator\buildarea\3.x.itamaro-win64-srv-22-aws.nogil.pgo\build\PCbuild\*.pgc
Could Not Find C:\Users\Administrator\buildarea\3.x.itamaro-win64-srv-22-aws.nogil.pgo\build\Lib\*.pyc
'"C:\Users\Administrator\buildarea\3.x.itamaro-win64-srv-22-aws.nogil.pgo\build\PCbuild\\..\python.bat"' is not recognized as an internal or external command,
operable program or batch file.
Could Not Find C:\Users\Administrator\buildarea\3.x.itamaro-win64-srv-22-aws.nogil.pgo\build\PCbuild\*.pgc
Could Not Find C:\Users\Administrator\buildarea\3.x.itamaro-win64-srv-22-aws.nogil.pgo\build\Lib\*.pyc
'"C:\Users\Administrator\buildarea\3.x.itamaro-win64-srv-22-aws.nogil.pgo\build\PCbuild\\..\python.bat"' is not recognized as an internal or external command,
operable program or batch file.
Could Not Find C:\Users\Administrator\buildarea\3.x.itamaro-win64-srv-22-aws.nogil.pgo\build\Lib\*.pyc
The system cannot find the file specified.
Could Not Find C:\Users\Administrator\buildarea\3.x.itamaro-win64-srv-22-aws.nogil.pgo\build\PCbuild\python*.zip
Could Not Find C:\Users\Administrator\buildarea\3.x.itamaro-win64-srv-22-aws.nogil.pgo\build\PCbuild\*.pgc
Could Not Find C:\Users\Administrator\buildarea\3.x.itamaro-win64-srv-22-aws.nogil.pgo\build\Lib\*.pyc
Could Not Find C:\Users\Administrator\buildarea\3.x.itamaro-win64-srv-22-aws.nogil.pgo\build\PCbuild\python*.zip
Test report
===========
Failed tests:
- test_tracemalloc
Sincerely,
-The Buildbot
1
0
☠ Buildbot (Python): python/cpython - failed test (failure) (main)
by buildbot@python.org Sept. 18, 2025
by buildbot@python.org Sept. 18, 2025
Sept. 18, 2025
The Buildbot has detected a new failure on builder x86-64 MacOS Intel ASAN NoGIL 3.x while building python/cpython.
Full details are available at:
https://buildbot.python.org/#/builders/1366/builds/5070
Buildbot URL: https://buildbot.python.org/
Worker for this Build: itamaro-macos-intel-aws
Build Reason: <unknown>
Blamelist: Cody Maloney <cmaloney(a)users.noreply.github.com>, Denis Sergeev <newjimbatler00(a)gmail.com>, Donghee Na <donghee.na(a)python.org>, Erlend E. Aasland <erlend(a)python.org>, Malcolm Smith <smith(a)chaquo.com>, Mark Shannon <mark(a)hotpy.org>, Oleksandr Kravets <73752159+olekskrav(a)users.noreply.github.com>, Pablo Galindo Salgado <Pablogsal(a)gmail.com>, Peter Bierma <zintensitydev(a)gmail.com>, Petr Viktorin <encukou(a)gmail.com>, Rafael Fontenelle <rffontenelle(a)users.noreply.github.com>, Raymond Hettinger <rhettinger(a)users.noreply.github.com>, Stan Ulbrych <89152624+StanFromIreland(a)users.noreply.github.com>, Victor Stinner <vstinner(a)python.org>
BUILD FAILED: failed test (failure)
Summary of the results of the build (if available):
===================================================
==
Captured traceback
==================
remote: Enumerating objects: 56, done.
remote: Counting objects: 2% (1/41)
remote: Counting objects: 4% (2/41)
remote: Counting objects: 7% (3/41)
remote: Counting objects: 9% (4/41)
remote: Counting objects: 12% (5/41)
remote: Counting objects: 14% (6/41)
remote: Counting objects: 17% (7/41)
remote: Counting objects: 19% (8/41)
remote: Counting objects: 21% (9/41)
remote: Counting objects: 24% (10/41)
remote: Counting objects: 26% (11/41)
remote: Counting objects: 29% (12/41)
remote: Counting objects: 31% (13/41)
remote: Counting objects: 34% (14/41)
remote: Counting objects: 36% (15/41)
remote: Counting objects: 39% (16/41)
remote: Counting objects: 41% (17/41)
remote: Counting objects: 43% (18/41)
remote: Counting objects: 46% (19/41)
remote: Counting objects: 48% (20/41)
remote: Counting objects: 51% (21/41)
remote: Counting objects: 53% (22/41)
remote: Counting objects: 56% (23/41)
remote: Counting objects: 58% (24/41)
remote: Counting objects: 60% (25/41)
remote: Counting objects: 63% (26/41)
remote: Counting objects: 65% (27/41)
remote: Counting objects: 68% (28/41)
remote: Counting objects: 70% (29/41)
remote: Counting objects: 73% (30/41)
remote: Counting objects: 75% (31/41)
remote: Counting objects: 78% (32/41)
remote: Counting objects: 80% (33/41)
remote: Counting objects: 82% (34/41)
remote: Counting objects: 85% (35/41)
remote: Counting objects: 87% (36/41)
remote: Counting objects: 90% (37/41)
remote: Counting objects: 92% (38/41)
remote: Counting objects: 95% (39/41)
remote: Counting objects: 97% (40/41)
remote: Counting objects: 100% (41/41)
remote: Counting objects: 100% (41/41), done.
remote: Compressing objects: 4% (1/24)
remote: Compressing objects: 8% (2/24)
remote: Compressing objects: 12% (3/24)
remote: Compressing objects: 16% (4/24)
remote: Compressing objects: 20% (5/24)
remote: Compressing objects: 25% (6/24)
remote: Compressing objects: 29% (7/24)
remote: Compressing objects: 33% (8/24)
remote: Compressing objects: 37% (9/24)
remote: Compressing objects: 41% (10/24)
remote: Compressing objects: 45% (11/24)
remote: Compressing objects: 50% (12/24)
remote: Compressing objects: 54% (13/24)
remote: Compressing objects: 58% (14/24)
remote: Compressing objects: 62% (15/24)
remote: Compressing objects: 66% (16/24)
remote: Compressing objects: 70% (17/24)
remote: Compressing objects: 75% (18/24)
remote: Compressing objects: 79% (19/24)
remote: Compressing objects: 83% (20/24)
remote: Compressing objects: 87% (21/24)
remote: Compressing objects: 91% (22/24)
remote: Compressing objects: 95% (23/24)
remote: Compressing objects: 100% (24/24)
remote: Compressing objects: 100% (24/24), done.
remote: Total 56 (delta 22), reused 17 (delta 17), pack-reused 15 (from 3)
From https://github.com/python/cpython
* branch main -> FETCH_HEAD
Note: switching to '243d599a05e88739f4ee8486fc76e382020174e4'.
You are in 'detached HEAD' state. You can look around, make experimental
changes and commit them, and you can discard any commits you make in this
state without impacting any branches by switching back to a branch.
If you want to create a new branch to retain commits you create, you may
do so (now or later) by using -c with the switch command. Example:
git switch -c <new-branch-name>
Or undo this operation with:
git switch -
Turn off this advice by setting config variable advice.detachedHead to false
HEAD is now at 243d599a05e gh-129813, PEP 782: Use PyBytesWriter in _sqlite (#138956)
Switched to and reset branch 'main'
configure: WARNING: pkg-config is missing. Some dependencies may not be detected correctly.
Parser/string_parser.c:185:17: warning: 'sprintf' is deprecated: This function is provided for compatibility reasons only. Due to security concerns inherent in the design of sprintf(3), it is highly recommended that you use snprintf(3) instead. [-Wdeprecated-declarations]
sprintf(p, "\\U%08x", chr);
^
/Library/Developer/CommandLineTools/SDKs/MacOSX.sdk/usr/include/stdio.h:180:1: note: 'sprintf' has been explicitly marked deprecated here
__deprecated_msg("This function is provided for compatibility reasons only. Due to security concerns inherent in the design of sprintf(3), it is highly recommended that you use snprintf(3) instead.")
^
/Library/Developer/CommandLineTools/SDKs/MacOSX.sdk/usr/include/sys/cdefs.h:215:48: note: expanded from macro '__deprecated_msg'
#define __deprecated_msg(_msg) __attribute__((__deprecated__(_msg)))
^
1 warning generated.
Objects/bytesobject.c:290:17: warning: 'sprintf' is deprecated: This function is provided for compatibility reasons only. Due to security concerns inherent in the design of sprintf(3), it is highly recommended that you use snprintf(3) instead. [-Wdeprecated-declarations]
sprintf(buffer, "%ld", va_arg(vargs, long));
^
/Library/Developer/CommandLineTools/SDKs/MacOSX.sdk/usr/include/stdio.h:180:1: note: 'sprintf' has been explicitly marked deprecated here
__deprecated_msg("This function is provided for compatibility reasons only. Due to security concerns inherent in the design of sprintf(3), it is highly recommended that you use snprintf(3) instead.")
^
/Library/Developer/CommandLineTools/SDKs/MacOSX.sdk/usr/include/sys/cdefs.h:215:48: note: expanded from macro '__deprecated_msg'
#define __deprecated_msg(_msg) __attribute__((__deprecated__(_msg)))
^
Objects/bytesobject.c:293:17: warning: 'sprintf' is deprecated: This function is provided for compatibility reasons only. Due to security concerns inherent in the design of sprintf(3), it is highly recommended that you use snprintf(3) instead. [-Wdeprecated-declarations]
sprintf(buffer, "%zd", va_arg(vargs, Py_ssize_t));
^
/Library/Developer/CommandLineTools/SDKs/MacOSX.sdk/usr/include/stdio.h:180:1: note: 'sprintf' has been explicitly marked deprecated here
__deprecated_msg("This function is provided for compatibility reasons only. Due to security concerns inherent in the design of sprintf(3), it is highly recommended that you use snprintf(3) instead.")
^
/Library/Developer/CommandLineTools/SDKs/MacOSX.sdk/usr/include/sys/cdefs.h:215:48: note: expanded from macro '__deprecated_msg'
#define __deprecated_msg(_msg) __attribute__((__deprecated__(_msg)))
^
Objects/bytesobject.c:296:17: warning: 'sprintf' is deprecated: This function is provided for compatibility reasons only. Due to security concerns inherent in the design of sprintf(3), it is highly recommended that you use snprintf(3) instead. [-Wdeprecated-declarations]
sprintf(buffer, "%d", va_arg(vargs, int));
^
/Library/Developer/CommandLineTools/SDKs/MacOSX.sdk/usr/include/stdio.h:180:1: note: 'sprintf' has been explicitly marked deprecated here
__deprecated_msg("This function is provided for compatibility reasons only. Due to security concerns inherent in the design of sprintf(3), it is highly recommended that you use snprintf(3) instead.")
^
/Library/Developer/CommandLineTools/SDKs/MacOSX.sdk/usr/include/sys/cdefs.h:215:48: note: expanded from macro '__deprecated_msg'
#define __deprecated_msg(_msg) __attribute__((__deprecated__(_msg)))
^
Objects/bytesobject.c:304:17: warning: 'sprintf' is deprecated: This function is provided for compatibility reasons only. Due to security concerns inherent in the design of sprintf(3), it is highly recommended that you use snprintf(3) instead. [-Wdeprecated-declarations]
sprintf(buffer, "%lu", va_arg(vargs, unsigned long));
^
/Library/Developer/CommandLineTools/SDKs/MacOSX.sdk/usr/include/stdio.h:180:1: note: 'sprintf' has been explicitly marked deprecated here
__deprecated_msg("This function is provided for compatibility reasons only. Due to security concerns inherent in the design of sprintf(3), it is highly recommended that you use snprintf(3) instead.")
^
/Library/Developer/CommandLineTools/SDKs/MacOSX.sdk/usr/include/sys/cdefs.h:215:48: note: expanded from macro '__deprecated_msg'
#define __deprecated_msg(_msg) __attribute__((__deprecated__(_msg)))
^
Objects/bytesobject.c:307:17: warning: 'sprintf' is deprecated: This function is provided for compatibility reasons only. Due to security concerns inherent in the design of sprintf(3), it is highly recommended that you use snprintf(3) instead. [-Wdeprecated-declarations]
sprintf(buffer, "%zu", va_arg(vargs, size_t));
^
/Library/Developer/CommandLineTools/SDKs/MacOSX.sdk/usr/include/stdio.h:180:1: note: 'sprintf' has been explicitly marked deprecated here
__deprecated_msg("This function is provided for compatibility reasons only. Due to security concerns inherent in the design of sprintf(3), it is highly recommended that you use snprintf(3) instead.")
^
/Library/Developer/CommandLineTools/SDKs/MacOSX.sdk/usr/include/sys/cdefs.h:215:48: note: expanded from macro '__deprecated_msg'
#define __deprecated_msg(_msg) __attribute__((__deprecated__(_msg)))
^
Objects/bytesobject.c:310:17: warning: 'sprintf' is deprecated: This function is provided for compatibility reasons only. Due to security concerns inherent in the design of sprintf(3), it is highly recommended that you use snprintf(3) instead. [-Wdeprecated-declarations]
sprintf(buffer, "%u", va_arg(vargs, unsigned int));
^
/Library/Developer/CommandLineTools/SDKs/MacOSX.sdk/usr/include/stdio.h:180:1: note: 'sprintf' has been explicitly marked deprecated here
__deprecated_msg("This function is provided for compatibility reasons only. Due to security concerns inherent in the design of sprintf(3), it is highly recommended that you use snprintf(3) instead.")
^
/Library/Developer/CommandLineTools/SDKs/MacOSX.sdk/usr/include/sys/cdefs.h:215:48: note: expanded from macro '__deprecated_msg'
#define __deprecated_msg(_msg) __attribute__((__deprecated__(_msg)))
^
Objects/bytesobject.c:317:13: warning: 'sprintf' is deprecated: This function is provided for compatibility reasons only. Due to security concerns inherent in the design of sprintf(3), it is highly recommended that you use snprintf(3) instead. [-Wdeprecated-declarations]
sprintf(buffer, "%i", va_arg(vargs, int));
^
/Library/Developer/CommandLineTools/SDKs/MacOSX.sdk/usr/include/stdio.h:180:1: note: 'sprintf' has been explicitly marked deprecated here
__deprecated_msg("This function is provided for compatibility reasons only. Due to security concerns inherent in the design of sprintf(3), it is highly recommended that you use snprintf(3) instead.")
^
/Library/Developer/CommandLineTools/SDKs/MacOSX.sdk/usr/include/sys/cdefs.h:215:48: note: expanded from macro '__deprecated_msg'
#define __deprecated_msg(_msg) __attribute__((__deprecated__(_msg)))
^
Objects/bytesobject.c:323:13: warning: 'sprintf' is deprecated: This function is provided for compatibility reasons only. Due to security concerns inherent in the design of sprintf(3), it is highly recommended that you use snprintf(3) instead. [-Wdeprecated-declarations]
sprintf(buffer, "%x", va_arg(vargs, int));
^
/Library/Developer/CommandLineTools/SDKs/MacOSX.sdk/usr/include/stdio.h:180:1: note: 'sprintf' has been explicitly marked deprecated here
__deprecated_msg("This function is provided for compatibility reasons only. Due to security concerns inherent in the design of sprintf(3), it is highly recommended that you use snprintf(3) instead.")
^
/Library/Developer/CommandLineTools/SDKs/MacOSX.sdk/usr/include/sys/cdefs.h:215:48: note: expanded from macro '__deprecated_msg'
#define __deprecated_msg(_msg) __attribute__((__deprecated__(_msg)))
^
Objects/bytesobject.c:347:13: warning: 'sprintf' is deprecated: This function is provided for compatibility reasons only. Due to security concerns inherent in the design of sprintf(3), it is highly recommended that you use snprintf(3) instead. [-Wdeprecated-declarations]
sprintf(buffer, "%p", va_arg(vargs, void*));
^
/Library/Developer/CommandLineTools/SDKs/MacOSX.sdk/usr/include/stdio.h:180:1: note: 'sprintf' has been explicitly marked deprecated here
__deprecated_msg("This function is provided for compatibility reasons only. Due to security concerns inherent in the design of sprintf(3), it is highly recommended that you use snprintf(3) instead.")
^
/Library/Developer/CommandLineTools/SDKs/MacOSX.sdk/usr/include/sys/cdefs.h:215:48: note: expanded from macro '__deprecated_msg'
#define __deprecated_msg(_msg) __attribute__((__deprecated__(_msg)))
^
9 warnings generated.
Objects/typeobject.c:6899:9: warning: 'sprintf' is deprecated: This function is provided for compatibility reasons only. Due to security concerns inherent in the design of sprintf(3), it is highly recommended that you use snprintf(3) instead. [-Wdeprecated-declarations]
sprintf(msg, "type_traverse() called on non-heap type '%.100s'",
^
/Library/Developer/CommandLineTools/SDKs/MacOSX.sdk/usr/include/stdio.h:180:1: note: 'sprintf' has been explicitly marked deprecated here
__deprecated_msg("This function is provided for compatibility reasons only. Due to security concerns inherent in the design of sprintf(3), it is highly recommended that you use snprintf(3) instead.")
^
/Library/Developer/CommandLineTools/SDKs/MacOSX.sdk/usr/include/sys/cdefs.h:215:48: note: expanded from macro '__deprecated_msg'
#define __deprecated_msg(_msg) __attribute__((__deprecated__(_msg)))
^
Objects/unicodeobject.c:944:16: warning: 'sprintf' is deprecated: This function is provided for compatibility reasons only. Due to security concerns inherent in the design of sprintf(3), it is highly recommended that you use snprintf(3) instead. [-Wdeprecated-declarations]
size = sprintf(str, "&#%d;", PyUnicode_READ(kind, data, i));
^
/Library/Developer/CommandLineTools/SDKs/MacOSX.sdk/usr/include/stdio.h:180:1: note: 'sprintf' has been explicitly marked deprecated here
__deprecated_msg("This function is provided for compatibility reasons only. Due to security concerns inherent in the design of sprintf(3), it is highly recommended that you use snprintf(3) instead.")
^
/Library/Developer/CommandLineTools/SDKs/MacOSX.sdk/usr/include/sys/cdefs.h:215:48: note: expanded from macro '__deprecated_msg'
#define __deprecated_msg(_msg) __attribute__((__deprecated__(_msg)))
^
Objects/unicodeobject.c:2938:30: warning: 'sprintf' is deprecated: This function is provided for compatibility reasons only. Due to security concerns inherent in the design of sprintf(3), it is highly recommended that you use snprintf(3) instead. [-Wdeprecated-declarations]
case F_LONG: DO_SPRINTS("l", long, unsigned long); break;
^
Objects/unicodeobject.c:2929:33: note: expanded from macro 'DO_SPRINTS'
case 'o': len = SPRINT(SIZE_SPEC, "o", UNSIGNED_TYPE); break; \
^
Objects/unicodeobject.c:2924:13: note: expanded from macro 'SPRINT'
sprintf(buffer, "%" SIZE_SPEC FMT_CHAR, va_arg(*vargs, TYPE))
^
/Library/Developer/CommandLineTools/SDKs/MacOSX.sdk/usr/include/stdio.h:180:1: note: 'sprintf' has been explicitly marked deprecated here
__deprecated_msg("This function is provided for compatibility reasons only. Due to security concerns inherent in the design of sprintf(3), it is highly recommended that you use snprintf(3) instead.")
^
/Library/Developer/CommandLineTools/SDKs/MacOSX.sdk/usr/include/sys/cdefs.h:215:48: note: expanded from macro '__deprecated_msg'
#define __deprecated_msg(_msg) __attribute__((__deprecated__(_msg)))
^
Objects/unicodeobject.c:2938:30: warning: 'sprintf' is deprecated: This function is provided for compatibility reasons only. Due to security concerns inherent in the design of sprintf(3), it is highly recommended that you use snprintf(3) instead. [-Wdeprecated-declarations]
case F_LONG: DO_SPRINTS("l", long, unsigned long); break;
^
Objects/unicodeobject.c:2930:33: note: expanded from macro 'DO_SPRINTS'
case 'u': len = SPRINT(SIZE_SPEC, "u", UNSIGNED_TYPE); break; \
^
Objects/unicodeobject.c:2924:13: note: expanded from macro 'SPRINT'
sprintf(buffer, "%" SIZE_SPEC FMT_CHAR, va_arg(*vargs, TYPE))
^
/Library/Developer/CommandLineTools/SDKs/MacOSX.sdk/usr/include/stdio.h:180:1: note: 'sprintf' has been explicitly marked deprecated here
__deprecated_msg("This function is provided for compatibility reasons only. Due to security concerns inherent in the design of sprintf(3), it is highly recommended that you use snprintf(3) instead.")
^
/Library/Developer/CommandLineTools/SDKs/MacOSX.sdk/usr/include/sys/cdefs.h:215:48: note: expanded from macro '__deprecated_msg'
#define __deprecated_msg(_msg) __attribute__((__deprecated__(_msg)))
^
Objects/unicodeobject.c:2938:30: warning: 'sprintf' is deprecated: This function is provided for compatibility reasons only. Due to security concerns inherent in the design of sprintf(3), it is highly recommended that you use snprintf(3) instead. [-Wdeprecated-declarations]
case F_LONG: DO_SPRINTS("l", long, unsigned long); break;
^
Objects/unicodeobject.c:2931:33: note: expanded from macro 'DO_SPRINTS'
case 'x': len = SPRINT(SIZE_SPEC, "x", UNSIGNED_TYPE); break; \
^
Objects/unicodeobject.c:2924:13: note: expanded from macro 'SPRINT'
sprintf(buffer, "%" SIZE_SPEC FMT_CHAR, va_arg(*vargs, TYPE))
^
/Library/Developer/CommandLineTools/SDKs/MacOSX.sdk/usr/include/stdio.h:180:1: note: 'sprintf' has been explicitly marked deprecated here
__deprecated_msg("This function is provided for compatibility reasons only. Due to security concerns inherent in the design of sprintf(3), it is highly recommended that you use snprintf(3) instead.")
^
/Library/Developer/CommandLineTools/SDKs/MacOSX.sdk/usr/include/sys/cdefs.h:215:48: note: expanded from macro '__deprecated_msg'
#define __deprecated_msg(_msg) __attribute__((__deprecated__(_msg)))
^
Objects/unicodeobject.c:2938:30: warning: 'sprintf' is deprecated: This function is provided for compatibility reasons only. Due to security concerns inherent in the design of sprintf(3), it is highly recommended that you use snprintf(3) instead. [-Wdeprecated-declarations]
case F_LONG: DO_SPRINTS("l", long, unsigned long); break;
^
Objects/unicodeobject.c:2932:33: note: expanded from macro 'DO_SPRINTS'
case 'X': len = SPRINT(SIZE_SPEC, "X", UNSIGNED_TYPE); break; \
^
Objects/unicodeobject.c:2924:13: note: expanded from macro 'SPRINT'
sprintf(buffer, "%" SIZE_SPEC FMT_CHAR, va_arg(*vargs, TYPE))
^
/Library/Developer/CommandLineTools/SDKs/MacOSX.sdk/usr/include/stdio.h:180:1: note: 'sprintf' has been explicitly marked deprecated here
__deprecated_msg("This function is provided for compatibility reasons only. Due to security concerns inherent in the design of sprintf(3), it is highly recommended that you use snprintf(3) instead.")
^
/Library/Developer/CommandLineTools/SDKs/MacOSX.sdk/usr/include/sys/cdefs.h:215:48: note: expanded from macro '__deprecated_msg'
#define __deprecated_msg(_msg) __attribute__((__deprecated__(_msg)))
^
Objects/unicodeobject.c:2938:30: warning: 'sprintf' is deprecated: This function is provided for compatibility reasons only. Due to security concerns inherent in the design of sprintf(3), it is highly recommended that you use snprintf(3) instead. [-Wdeprecated-declarations]
case F_LONG: DO_SPRINTS("l", long, unsigned long); break;
^
Objects/unicodeobject.c:2933:33: note: expanded from macro 'DO_SPRINTS'
default: len = SPRINT(SIZE_SPEC, "d", SIGNED_TYPE); break; \
^
Objects/unicodeobject.c:2924:13: note: expanded from macro 'SPRINT'
sprintf(buffer, "%" SIZE_SPEC FMT_CHAR, va_arg(*vargs, TYPE))
^
/Library/Developer/CommandLineTools/SDKs/MacOSX.sdk/usr/include/stdio.h:180:1: note: 'sprintf' has been explicitly marked deprecated here
__deprecated_msg("This function is provided for compatibility reasons only. Due to security concerns inherent in the design of sprintf(3), it is highly recommended that you use snprintf(3) instead.")
^
/Library/Developer/CommandLineTools/SDKs/MacOSX.sdk/usr/include/sys/cdefs.h:215:48: note: expanded from macro '__deprecated_msg'
#define __deprecated_msg(_msg) __attribute__((__deprecated__(_msg)))
^
Objects/unicodeobject.c:2939:30: warning: 'sprintf' is deprecated: This function is provided for compatibility reasons only. Due to security concerns inherent in the design of sprintf(3), it is highly recommended that you use snprintf(3) instead. [-Wdeprecated-declarations]
case F_LONGLONG: DO_SPRINTS("ll", long long, unsigned long long); break;
^
Objects/unicodeobject.c:2929:33: note: expanded from macro 'DO_SPRINTS'
case 'o': len = SPRINT(SIZE_SPEC, "o", UNSIGNED_TYPE); break; \
^
Objects/unicodeobject.c:2924:13: note: expanded from macro 'SPRINT'
sprintf(buffer, "%" SIZE_SPEC FMT_CHAR, va_arg(*vargs, TYPE))
^
/Library/Developer/CommandLineTools/SDKs/MacOSX.sdk/usr/include/stdio.h:180:1: note: 'sprintf' has been explicitly marked deprecated here
__deprecated_msg("This function is provided for compatibility reasons only. Due to security concerns inherent in the design of sprintf(3), it is highly recommended that you use snprintf(3) instead.")
^
/Library/Developer/CommandLineTools/SDKs/MacOSX.sdk/usr/include/sys/cdefs.h:215:48: note: expanded from macro '__deprecated_msg'
#define __deprecated_msg(_msg) __attribute__((__deprecated__(_msg)))
^
Objects/unicodeobject.c:2939:30: warning: 'sprintf' is deprecated: This function is provided for compatibility reasons only. Due to security concerns inherent in the design of sprintf(3), it is highly recommended that you use snprintf(3) instead. [-Wdeprecated-declarations]
case F_LONGLONG: DO_SPRINTS("ll", long long, unsigned long long); break;
^
Objects/unicodeobject.c:2930:33: note: expanded from macro 'DO_SPRINTS'
case 'u': len = SPRINT(SIZE_SPEC, "u", UNSIGNED_TYPE); break; \
^
Objects/unicodeobject.c:2924:13: note: expanded from macro 'SPRINT'
sprintf(buffer, "%" SIZE_SPEC FMT_CHAR, va_arg(*vargs, TYPE))
^
/Library/Developer/CommandLineTools/SDKs/MacOSX.sdk/usr/include/stdio.h:180:1: note: 'sprintf' has been explicitly marked deprecated here
__deprecated_msg("This function is provided for compatibility reasons only. Due to security concerns inherent in the design of sprintf(3), it is highly recommended that you use snprintf(3) instead.")
^
/Library/Developer/CommandLineTools/SDKs/MacOSX.sdk/usr/include/sys/cdefs.h:215:48: note: expanded from macro '__deprecated_msg'
#define __deprecated_msg(_msg) __attribute__((__deprecated__(_msg)))
^
Objects/unicodeobject.c:2939:30: warning: 'sprintf' is deprecated: This function is provided for compatibility reasons only. Due to security concerns inherent in the design of sprintf(3), it is highly recommended that you use snprintf(3) instead. [-Wdeprecated-declarations]
case F_LONGLONG: DO_SPRINTS("ll", long long, unsigned long long); break;
^
Objects/unicodeobject.c:2931:33: note: expanded from macro 'DO_SPRINTS'
case 'x': len = SPRINT(SIZE_SPEC, "x", UNSIGNED_TYPE); break; \
^
Objects/unicodeobject.c:2924:13: note: expanded from macro 'SPRINT'
sprintf(buffer, "%" SIZE_SPEC FMT_CHAR, va_arg(*vargs, TYPE))
^
/Library/Developer/CommandLineTools/SDKs/MacOSX.sdk/usr/include/stdio.h:180:1: note: 'sprintf' has been explicitly marked deprecated here
__deprecated_msg("This function is provided for compatibility reasons only. Due to security concerns inherent in the design of sprintf(3), it is highly recommended that you use snprintf(3) instead.")
^
/Library/Developer/CommandLineTools/SDKs/MacOSX.sdk/usr/include/sys/cdefs.h:215:48: note: expanded from macro '__deprecated_msg'
#define __deprecated_msg(_msg) __attribute__((__deprecated__(_msg)))
^
Objects/unicodeobject.c:2939:30: warning: 'sprintf' is deprecated: This function is provided for compatibility reasons only. Due to security concerns inherent in the design of sprintf(3), it is highly recommended that you use snprintf(3) instead. [-Wdeprecated-declarations]
case F_LONGLONG: DO_SPRINTS("ll", long long, unsigned long long); break;
^
Objects/unicodeobject.c:2932:33: note: expanded from macro 'DO_SPRINTS'
case 'X': len = SPRINT(SIZE_SPEC, "X", UNSIGNED_TYPE); break; \
^
Objects/unicodeobject.c:2924:13: note: expanded from macro 'SPRINT'
sprintf(buffer, "%" SIZE_SPEC FMT_CHAR, va_arg(*vargs, TYPE))
^
/Library/Developer/CommandLineTools/SDKs/MacOSX.sdk/usr/include/stdio.h:180:1: note: 'sprintf' has been explicitly marked deprecated here
__deprecated_msg("This function is provided for compatibility reasons only. Due to security concerns inherent in the design of sprintf(3), it is highly recommended that you use snprintf(3) instead.")
^
/Library/Developer/CommandLineTools/SDKs/MacOSX.sdk/usr/include/sys/cdefs.h:215:48: note: expanded from macro '__deprecated_msg'
#define __deprecated_msg(_msg) __attribute__((__deprecated__(_msg)))
^
Objects/unicodeobject.c:2939:30: warning: 'sprintf' is deprecated: This function is provided for compatibility reasons only. Due to security concerns inherent in the design of sprintf(3), it is highly recommended that you use snprintf(3) instead. [-Wdeprecated-declarations]
case F_LONGLONG: DO_SPRINTS("ll", long long, unsigned long long); break;
^
Objects/unicodeobject.c:2933:33: note: expanded from macro 'DO_SPRINTS'
default: len = SPRINT(SIZE_SPEC, "d", SIGNED_TYPE); break; \
^
Objects/unicodeobject.c:2924:13: note: expanded from macro 'SPRINT'
sprintf(buffer, "%" SIZE_SPEC FMT_CHAR, va_arg(*vargs, TYPE))
^
/Library/Developer/CommandLineTools/SDKs/MacOSX.sdk/usr/include/stdio.h:180:1: note: 'sprintf' has been explicitly marked deprecated here
__deprecated_msg("This function is provided for compatibility reasons only. Due to security concerns inherent in the design of sprintf(3), it is highly recommended that you use snprintf(3) instead.")
^
/Library/Developer/CommandLineTools/SDKs/MacOSX.sdk/usr/include/sys/cdefs.h:215:48: note: expanded from macro '__deprecated_msg'
#define __deprecated_msg(_msg) __attribute__((__deprecated__(_msg)))
^
Objects/unicodeobject.c:2940:30: warning: 'sprintf' is deprecated: This function is provided for compatibility reasons only. Due to security concerns inherent in the design of sprintf(3), it is highly recommended that you use snprintf(3) instead. [-Wdeprecated-declarations]
case F_SIZE: DO_SPRINTS("z", Py_ssize_t, size_t); break;
^
Objects/unicodeobject.c:2929:33: note: expanded from macro 'DO_SPRINTS'
case 'o': len = SPRINT(SIZE_SPEC, "o", UNSIGNED_TYPE); break; \
^
Objects/unicodeobject.c:2924:13: note: expanded from macro 'SPRINT'
sprintf(buffer, "%" SIZE_SPEC FMT_CHAR, va_arg(*vargs, TYPE))
^
/Library/Developer/CommandLineTools/SDKs/MacOSX.sdk/usr/include/stdio.h:180:1: note: 'sprintf' has been explicitly marked deprecated here
__deprecated_msg("This function is provided for compatibility reasons only. Due to security concerns inherent in the design of sprintf(3), it is highly recommended that you use snprintf(3) instead.")
^
/Library/Developer/CommandLineTools/SDKs/MacOSX.sdk/usr/include/sys/cdefs.h:215:48: note: expanded from macro '__deprecated_msg'
#define __deprecated_msg(_msg) __attribute__((__deprecated__(_msg)))
^
Objects/unicodeobject.c:2940:30: warning: 'sprintf' is deprecated: This function is provided for compatibility reasons only. Due to security concerns inherent in the design of sprintf(3), it is highly recommended that you use snprintf(3) instead. [-Wdeprecated-declarations]
case F_SIZE: DO_SPRINTS("z", Py_ssize_t, size_t); break;
^
Objects/unicodeobject.c:2930:33: note: expanded from macro 'DO_SPRINTS'
case 'u': len = SPRINT(SIZE_SPEC, "u", UNSIGNED_TYPE); break; \
^
Objects/unicodeobject.c:2924:13: note: expanded from macro 'SPRINT'
sprintf(buffer, "%" SIZE_SPEC FMT_CHAR, va_arg(*vargs, TYPE))
^
/Library/Developer/CommandLineTools/SDKs/MacOSX.sdk/usr/include/stdio.h:180:1: note: 'sprintf' has been explicitly marked deprecated here
__deprecated_msg("This function is provided for compatibility reasons only. Due to security concerns inherent in the design of sprintf(3), it is highly recommended that you use snprintf(3) instead.")
^
/Library/Developer/CommandLineTools/SDKs/MacOSX.sdk/usr/include/sys/cdefs.h:215:48: note: expanded from macro '__deprecated_msg'
#define __deprecated_msg(_msg) __attribute__((__deprecated__(_msg)))
^
Objects/unicodeobject.c:2940:30: warning: 'sprintf' is deprecated: This function is provided for compatibility reasons only. Due to security concerns inherent in the design of sprintf(3), it is highly recommended that you use snprintf(3) instead. [-Wdeprecated-declarations]
case F_SIZE: DO_SPRINTS("z", Py_ssize_t, size_t); break;
^
Objects/unicodeobject.c:2931:33: note: expanded from macro 'DO_SPRINTS'
case 'x': len = SPRINT(SIZE_SPEC, "x", UNSIGNED_TYPE); break; \
^
Objects/unicodeobject.c:2924:13: note: expanded from macro 'SPRINT'
sprintf(buffer, "%" SIZE_SPEC FMT_CHAR, va_arg(*vargs, TYPE))
^
/Library/Developer/CommandLineTools/SDKs/MacOSX.sdk/usr/include/stdio.h:180:1: note: 'sprintf' has been explicitly marked deprecated here
__deprecated_msg("This function is provided for compatibility reasons only. Due to security concerns inherent in the design of sprintf(3), it is highly recommended that you use snprintf(3) instead.")
^
/Library/Developer/CommandLineTools/SDKs/MacOSX.sdk/usr/include/sys/cdefs.h:215:48: note: expanded from macro '__deprecated_msg'
#define __deprecated_msg(_msg) __attribute__((__deprecated__(_msg)))
^
Objects/unicodeobject.c:2940:30: warning: 'sprintf' is deprecated: This function is provided for compatibility reasons only. Due to security concerns inherent in the design of sprintf(3), it is highly recommended that you use snprintf(3) instead. [-Wdeprecated-declarations]
case F_SIZE: DO_SPRINTS("z", Py_ssize_t, size_t); break;
^
Objects/unicodeobject.c:2932:33: note: expanded from macro 'DO_SPRINTS'
case 'X': len = SPRINT(SIZE_SPEC, "X", UNSIGNED_TYPE); break; \
^
Objects/unicodeobject.c:2924:13: note: expanded from macro 'SPRINT'
sprintf(buffer, "%" SIZE_SPEC FMT_CHAR, va_arg(*vargs, TYPE))
^
/Library/Developer/CommandLineTools/SDKs/MacOSX.sdk/usr/include/stdio.h:180:1: note: 'sprintf' has been explicitly marked deprecated here
__deprecated_msg("This function is provided for compatibility reasons only. Due to security concerns inherent in the design of sprintf(3), it is highly recommended that you use snprintf(3) instead.")
^
/Library/Developer/CommandLineTools/SDKs/MacOSX.sdk/usr/include/sys/cdefs.h:215:48: note: expanded from macro '__deprecated_msg'
#define __deprecated_msg(_msg) __attribute__((__deprecated__(_msg)))
^
Objects/unicodeobject.c:2940:30: warning: 'sprintf' is deprecated: This function is provided for compatibility reasons only. Due to security concerns inherent in the design of sprintf(3), it is highly recommended that you use snprintf(3) instead. [-Wdeprecated-declarations]
case F_SIZE: DO_SPRINTS("z", Py_ssize_t, size_t); break;
^
Objects/unicodeobject.c:2933:33: note: expanded from macro 'DO_SPRINTS'
default: len = SPRINT(SIZE_SPEC, "d", SIGNED_TYPE); break; \
^
Objects/unicodeobject.c:2924:13: note: expanded from macro 'SPRINT'
sprintf(buffer, "%" SIZE_SPEC FMT_CHAR, va_arg(*vargs, TYPE))
^
/Library/Developer/CommandLineTools/SDKs/MacOSX.sdk/usr/include/stdio.h:180:1: note: 'sprintf' has been explicitly marked deprecated here
__deprecated_msg("This function is provided for compatibility reasons only. Due to security concerns inherent in the design of sprintf(3), it is highly recommended that you use snprintf(3) instead.")
^
/Library/Developer/CommandLineTools/SDKs/MacOSX.sdk/usr/include/sys/cdefs.h:215:48: note: expanded from macro '__deprecated_msg'
#define __deprecated_msg(_msg) __attribute__((__deprecated__(_msg)))
^
Objects/unicodeobject.c:2941:30: warning: 'sprintf' is deprecated: This function is provided for compatibility reasons only. Due to security concerns inherent in the design of sprintf(3), it is highly recommended that you use snprintf(3) instead. [-Wdeprecated-declarations]
case F_PTRDIFF: DO_SPRINTS("t", ptrdiff_t, ptrdiff_t); break;
^
Objects/unicodeobject.c:2929:33: note: expanded from macro 'DO_SPRINTS'
case 'o': len = SPRINT(SIZE_SPEC, "o", UNSIGNED_TYPE); break; \
^
Objects/unicodeobject.c:2924:13: note: expanded from macro 'SPRINT'
sprintf(buffer, "%" SIZE_SPEC FMT_CHAR, va_arg(*vargs, TYPE))
^
/Library/Developer/CommandLineTools/SDKs/MacOSX.sdk/usr/include/stdio.h:180:1: note: 'sprintf' has been explicitly marked deprecated here
__deprecated_msg("This function is provided for compatibility reasons only. Due to security concerns inherent in the design of sprintf(3), it is highly recommended that you use snprintf(3) instead.")
^
/Library/Developer/CommandLineTools/SDKs/MacOSX.sdk/usr/include/sys/cdefs.h:215:48: note: expanded from macro '__deprecated_msg'
#define __deprecated_msg(_msg) __attribute__((__deprecated__(_msg)))
^
Objects/unicodeobject.c:2941:30: warning: 'sprintf' is deprecated: This function is provided for compatibility reasons only. Due to security concerns inherent in the design of sprintf(3), it is highly recommended that you use snprintf(3) instead. [-Wdeprecated-declarations]
case F_PTRDIFF: DO_SPRINTS("t", ptrdiff_t, ptrdiff_t); break;
^
Objects/unicodeobject.c:2930:33: note: expanded from macro 'DO_SPRINTS'
case 'u': len = SPRINT(SIZE_SPEC, "u", UNSIGNED_TYPE); break; \
^
Objects/unicodeobject.c:2924:13: note: expanded from macro 'SPRINT'
sprintf(buffer, "%" SIZE_SPEC FMT_CHAR, va_arg(*vargs, TYPE))
^
/Library/Developer/CommandLineTools/SDKs/MacOSX.sdk/usr/include/stdio.h:180:1: note: 'sprintf' has been explicitly marked deprecated here
__deprecated_msg("This function is provided for compatibility reasons only. Due to security concerns inherent in the design of sprintf(3), it is highly recommended that you use snprintf(3) instead.")
^
/Library/Developer/CommandLineTools/SDKs/MacOSX.sdk/usr/include/sys/cdefs.h:215:48: note: expanded from macro '__deprecated_msg'
#define __deprecated_msg(_msg) __attribute__((__deprecated__(_msg)))
^
Objects/unicodeobject.c:2941:30: warning: 'sprintf' is deprecated: This function is provided for compatibility reasons only. Due to security concerns inherent in the design of sprintf(3), it is highly recommended that you use snprintf(3) instead. [-Wdeprecated-declarations]
case F_PTRDIFF: DO_SPRINTS("t", ptrdiff_t, ptrdiff_t); break;
^
Objects/unicodeobject.c:2931:33: note: expanded from macro 'DO_SPRINTS'
case 'x': len = SPRINT(SIZE_SPEC, "x", UNSIGNED_TYPE); break; \
^
Objects/unicodeobject.c:2924:13: note: expanded from macro 'SPRINT'
sprintf(buffer, "%" SIZE_SPEC FMT_CHAR, va_arg(*vargs, TYPE))
^
/Library/Developer/CommandLineTools/SDKs/MacOSX.sdk/usr/include/stdio.h:180:1: note: 'sprintf' has been explicitly marked deprecated here
__deprecated_msg("This function is provided for compatibility reasons only. Due to security concerns inherent in the design of sprintf(3), it is highly recommended that you use snprintf(3) instead.")
^
/Library/Developer/CommandLineTools/SDKs/MacOSX.sdk/usr/include/sys/cdefs.h:215:48: note: expanded from macro '__deprecated_msg'
#define __deprecated_msg(_msg) __attribute__((__deprecated__(_msg)))
^
Objects/unicodeobject.c:2941:30: warning: 'sprintf' is deprecated: This function is provided for compatibility reasons only. Due to security concerns inherent in the design of sprintf(3), it is highly recommended that you use snprintf(3) instead. [-Wdeprecated-declarations]
case F_PTRDIFF: DO_SPRINTS("t", ptrdiff_t, ptrdiff_t); break;
^
Objects/unicodeobject.c:2932:33: note: expanded from macro 'DO_SPRINTS'
case 'X': len = SPRINT(SIZE_SPEC, "X", UNSIGNED_TYPE); break; \
^
Objects/unicodeobject.c:2924:13: note: expanded from macro 'SPRINT'
sprintf(buffer, "%" SIZE_SPEC FMT_CHAR, va_arg(*vargs, TYPE))
^
/Library/Developer/CommandLineTools/SDKs/MacOSX.sdk/usr/include/stdio.h:180:1: note: 'sprintf' has been explicitly marked deprecated here
__deprecated_msg("This function is provided for compatibility reasons only. Due to security concerns inherent in the design of sprintf(3), it is highly recommended that you use snprintf(3) instead.")
^
/Library/Developer/CommandLineTools/SDKs/MacOSX.sdk/usr/include/sys/cdefs.h:215:48: note: expanded from macro '__deprecated_msg'
#define __deprecated_msg(_msg) __attribute__((__deprecated__(_msg)))
^
Objects/unicodeobject.c:2941:30: warning: 'sprintf' is deprecated: This function is provided for compatibility reasons only. Due to security concerns inherent in the design of sprintf(3), it is highly recommended that you use snprintf(3) instead. [-Wdeprecated-declarations]
case F_PTRDIFF: DO_SPRINTS("t", ptrdiff_t, ptrdiff_t); break;
^
Objects/unicodeobject.c:2933:33: note: expanded from macro 'DO_SPRINTS'
default: len = SPRINT(SIZE_SPEC, "d", SIGNED_TYPE); break; \
^
Objects/unicodeobject.c:2924:13: note: expanded from macro 'SPRINT'
sprintf(buffer, "%" SIZE_SPEC FMT_CHAR, va_arg(*vargs, TYPE))
^
/Library/Developer/CommandLineTools/SDKs/MacOSX.sdk/usr/include/stdio.h:180:1: note: 'sprintf' has been explicitly marked deprecated here
__deprecated_msg("This function is provided for compatibility reasons only. Due to security concerns inherent in the design of sprintf(3), it is highly recommended that you use snprintf(3) instead.")
^
/Library/Developer/CommandLineTools/SDKs/MacOSX.sdk/usr/include/sys/cdefs.h:215:48: note: expanded from macro '__deprecated_msg'
#define __deprecated_msg(_msg) __attribute__((__deprecated__(_msg)))
^
Objects/unicodeobject.c:2942:30: warning: 'sprintf' is deprecated: This function is provided for compatibility reasons only. Due to security concerns inherent in the design of sprintf(3), it is highly recommended that you use snprintf(3) instead. [-Wdeprecated-declarations]
case F_INTMAX: DO_SPRINTS("j", intmax_t, uintmax_t); break;
^
Objects/unicodeobject.c:2929:33: note: expanded from macro 'DO_SPRINTS'
case 'o': len = SPRINT(SIZE_SPEC, "o", UNSIGNED_TYPE); break; \
^
Objects/unicodeobject.c:2924:13: note: expanded from macro 'SPRINT'
sprintf(buffer, "%" SIZE_SPEC FMT_CHAR, va_arg(*vargs, TYPE))
^
/Library/Developer/CommandLineTools/SDKs/MacOSX.sdk/usr/include/stdio.h:180:1: note: 'sprintf' has been explicitly marked deprecated here
__deprecated_msg("This function is provided for compatibility reasons only. Due to security concerns inherent in the design of sprintf(3), it is highly recommended that you use snprintf(3) instead.")
^
/Library/Developer/CommandLineTools/SDKs/MacOSX.sdk/usr/include/sys/cdefs.h:215:48: note: expanded from macro '__deprecated_msg'
#define __deprecated_msg(_msg) __attribute__((__deprecated__(_msg)))
^
Objects/unicodeobject.c:2942:30: warning: 'sprintf' is deprecated: This function is provided for compatibility reasons only. Due to security concerns inherent in the design of sprintf(3), it is highly recommended that you use snprintf(3) instead. [-Wdeprecated-declarations]
case F_INTMAX: DO_SPRINTS("j", intmax_t, uintmax_t); break;
^
Objects/unicodeobject.c:2930:33: note: expanded from macro 'DO_SPRINTS'
case 'u': len = SPRINT(SIZE_SPEC, "u", UNSIGNED_TYPE); break; \
^
Objects/unicodeobject.c:2924:13: note: expanded from macro 'SPRINT'
sprintf(buffer, "%" SIZE_SPEC FMT_CHAR, va_arg(*vargs, TYPE))
^
/Library/Developer/CommandLineTools/SDKs/MacOSX.sdk/usr/include/stdio.h:180:1: note: 'sprintf' has been explicitly marked deprecated here
__deprecated_msg("This function is provided for compatibility reasons only. Due to security concerns inherent in the design of sprintf(3), it is highly recommended that you use snprintf(3) instead.")
^
/Library/Developer/CommandLineTools/SDKs/MacOSX.sdk/usr/include/sys/cdefs.h:215:48: note: expanded from macro '__deprecated_msg'
#define __deprecated_msg(_msg) __attribute__((__deprecated__(_msg)))
^
Objects/unicodeobject.c:2942:30: warning: 'sprintf' is deprecated: This function is provided for compatibility reasons only. Due to security concerns inherent in the design of sprintf(3), it is highly recommended that you use snprintf(3) instead. [-Wdeprecated-declarations]
case F_INTMAX: DO_SPRINTS("j", intmax_t, uintmax_t); break;
^
Objects/unicodeobject.c:2931:33: note: expanded from macro 'DO_SPRINTS'
case 'x': len = SPRINT(SIZE_SPEC, "x", UNSIGNED_TYPE); break; \
^
Objects/unicodeobject.c:2924:13: note: expanded from macro 'SPRINT'
sprintf(buffer, "%" SIZE_SPEC FMT_CHAR, va_arg(*vargs, TYPE))
^
/Library/Developer/CommandLineTools/SDKs/MacOSX.sdk/usr/include/stdio.h:180:1: note: 'sprintf' has been explicitly marked deprecated here
__deprecated_msg("This function is provided for compatibility reasons only. Due to security concerns inherent in the design of sprintf(3), it is highly recommended that you use snprintf(3) instead.")
^
/Library/Developer/CommandLineTools/SDKs/MacOSX.sdk/usr/include/sys/cdefs.h:215:48: note: expanded from macro '__deprecated_msg'
#define __deprecated_msg(_msg) __attribute__((__deprecated__(_msg)))
^
Objects/unicodeobject.c:2942:30: warning: 'sprintf' is deprecated: This function is provided for compatibility reasons only. Due to security concerns inherent in the design of sprintf(3), it is highly recommended that you use snprintf(3) instead. [-Wdeprecated-declarations]
case F_INTMAX: DO_SPRINTS("j", intmax_t, uintmax_t); break;
^
Objects/unicodeobject.c:2932:33: note: expanded from macro 'DO_SPRINTS'
case 'X': len = SPRINT(SIZE_SPEC, "X", UNSIGNED_TYPE); break; \
^
Objects/unicodeobject.c:2924:13: note: expanded from macro 'SPRINT'
sprintf(buffer, "%" SIZE_SPEC FMT_CHAR, va_arg(*vargs, TYPE))
^
/Library/Developer/CommandLineTools/SDKs/MacOSX.sdk/usr/include/stdio.h:180:1: note: 'sprintf' has been explicitly marked deprecated here
__deprecated_msg("This function is provided for compatibility reasons only. Due to security concerns inherent in the design of sprintf(3), it is highly recommended that you use snprintf(3) instead.")
^
/Library/Developer/CommandLineTools/SDKs/MacOSX.sdk/usr/include/sys/cdefs.h:215:48: note: expanded from macro '__deprecated_msg'
#define __deprecated_msg(_msg) __attribute__((__deprecated__(_msg)))
^
Objects/unicodeobject.c:2942:30: warning: 'sprintf' is deprecated: This function is provided for compatibility reasons only. Due to security concerns inherent in the design of sprintf(3), it is highly recommended that you use snprintf(3) instead. [-Wdeprecated-declarations]
case F_INTMAX: DO_SPRINTS("j", intmax_t, uintmax_t); break;
^
Objects/unicodeobject.c:2933:33: note: expanded from macro 'DO_SPRINTS'
default: len = SPRINT(SIZE_SPEC, "d", SIGNED_TYPE); break; \
^
Objects/unicodeobject.c:2924:13: note: expanded from macro 'SPRINT'
sprintf(buffer, "%" SIZE_SPEC FMT_CHAR, va_arg(*vargs, TYPE))
^
/Library/Developer/CommandLineTools/SDKs/MacOSX.sdk/usr/include/stdio.h:180:1: note: 'sprintf' has been explicitly marked deprecated here
__deprecated_msg("This function is provided for compatibility reasons only. Due to security concerns inherent in the design of sprintf(3), it is highly recommended that you use snprintf(3) instead.")
^
/Library/Developer/CommandLineTools/SDKs/MacOSX.sdk/usr/include/sys/cdefs.h:215:48: note: expanded from macro '__deprecated_msg'
#define __deprecated_msg(_msg) __attribute__((__deprecated__(_msg)))
^
Objects/unicodeobject.c:2943:30: warning: 'sprintf' is deprecated: This function is provided for compatibility reasons only. Due to security concerns inherent in the design of sprintf(3), it is highly recommended that you use snprintf(3) instead. [-Wdeprecated-declarations]
default: DO_SPRINTS("", int, unsigned int); break;
^
Objects/unicodeobject.c:2929:33: note: expanded from macro 'DO_SPRINTS'
case 'o': len = SPRINT(SIZE_SPEC, "o", UNSIGNED_TYPE); break; \
^
Objects/unicodeobject.c:2924:13: note: expanded from macro 'SPRINT'
sprintf(buffer, "%" SIZE_SPEC FMT_CHAR, va_arg(*vargs, TYPE))
^
/Library/Developer/CommandLineTools/SDKs/MacOSX.sdk/usr/include/stdio.h:180:1: note: 'sprintf' has been explicitly marked deprecated here
__deprecated_msg("This function is provided for compatibility reasons only. Due to security concerns inherent in the design of sprintf(3), it is highly recommended that you use snprintf(3) instead.")
^
/Library/Developer/CommandLineTools/SDKs/MacOSX.sdk/usr/include/sys/cdefs.h:215:48: note: expanded from macro '__deprecated_msg'
#define __deprecated_msg(_msg) __attribute__((__deprecated__(_msg)))
^
Objects/unicodeobject.c:2943:30: warning: 'sprintf' is deprecated: This function is provided for compatibility reasons only. Due to security concerns inherent in the design of sprintf(3), it is highly recommended that you use snprintf(3) instead. [-Wdeprecated-declarations]
default: DO_SPRINTS("", int, unsigned int); break;
^
Objects/unicodeobject.c:2930:33: note: expanded from macro 'DO_SPRINTS'
case 'u': len = SPRINT(SIZE_SPEC, "u", UNSIGNED_TYPE); break; \
^
Objects/unicodeobject.c:2924:13: note: expanded from macro 'SPRINT'
sprintf(buffer, "%" SIZE_SPEC FMT_CHAR, va_arg(*vargs, TYPE))
^
/Library/Developer/CommandLineTools/SDKs/MacOSX.sdk/usr/include/stdio.h:180:1: note: 'sprintf' has been explicitly marked deprecated here
__deprecated_msg("This function is provided for compatibility reasons only. Due to security concerns inherent in the design of sprintf(3), it is highly recommended that you use snprintf(3) instead.")
^
/Library/Developer/CommandLineTools/SDKs/MacOSX.sdk/usr/include/sys/cdefs.h:215:48: note: expanded from macro '__deprecated_msg'
#define __deprecated_msg(_msg) __attribute__((__deprecated__(_msg)))
^
Objects/unicodeobject.c:2943:30: warning: 'sprintf' is deprecated: This function is provided for compatibility reasons only. Due to security concerns inherent in the design of sprintf(3), it is highly recommended that you use snprintf(3) instead. [-Wdeprecated-declarations]
default: DO_SPRINTS("", int, unsigned int); break;
^
Objects/unicodeobject.c:2931:33: note: expanded from macro 'DO_SPRINTS'
case 'x': len = SPRINT(SIZE_SPEC, "x", UNSIGNED_TYPE); break; \
^
Objects/unicodeobject.c:2924:13: note: expanded from macro 'SPRINT'
sprintf(buffer, "%" SIZE_SPEC FMT_CHAR, va_arg(*vargs, TYPE))
^
/Library/Developer/CommandLineTools/SDKs/MacOSX.sdk/usr/include/stdio.h:180:1: note: 'sprintf' has been explicitly marked deprecated here
__deprecated_msg("This function is provided for compatibility reasons only. Due to security concerns inherent in the design of sprintf(3), it is highly recommended that you use snprintf(3) instead.")
^
/Library/Developer/CommandLineTools/SDKs/MacOSX.sdk/usr/include/sys/cdefs.h:215:48: note: expanded from macro '__deprecated_msg'
#define __deprecated_msg(_msg) __attribute__((__deprecated__(_msg)))
^
Objects/unicodeobject.c:2943:30: warning: 'sprintf' is deprecated: This function is provided for compatibility reasons only. Due to security concerns inherent in the design of sprintf(3), it is highly recommended that you use snprintf(3) instead. [-Wdeprecated-declarations]
default: DO_SPRINTS("", int, unsigned int); break;
^
Objects/unicodeobject.c:2932:33: note: expanded from macro 'DO_SPRINTS'
case 'X': len = SPRINT(SIZE_SPEC, "X", UNSIGNED_TYPE); break; \
^
Objects/unicodeobject.c:2924:13: note: expanded from macro 'SPRINT'
sprintf(buffer, "%" SIZE_SPEC FMT_CHAR, va_arg(*vargs, TYPE))
^
/Library/Developer/CommandLineTools/SDKs/MacOSX.sdk/usr/include/stdio.h:180:1: note: 'sprintf' has been explicitly marked deprecated here
__deprecated_msg("This function is provided for compatibility reasons only. Due to security concerns inherent in the design of sprintf(3), it is highly recommended that you use snprintf(3) instead.")
^
/Library/Developer/CommandLineTools/SDKs/MacOSX.sdk/usr/include/sys/cdefs.h:215:48: note: expanded from macro '__deprecated_msg'
#define __deprecated_msg(_msg) __attribute__((__deprecated__(_msg)))
^
Objects/unicodeobject.c:2943:30: warning: 'sprintf' is deprecated: This function is provided for compatibility reasons only. Due to security concerns inherent in the design of sprintf(3), it is highly recommended that you use snprintf(3) instead. [-Wdeprecated-declarations]
default: DO_SPRINTS("", int, unsigned int); break;
^
Objects/unicodeobject.c:2933:33: note: expanded from macro 'DO_SPRINTS'
default: len = SPRINT(SIZE_SPEC, "d", SIGNED_TYPE); break; \
^
Objects/unicodeobject.c:2924:13: note: expanded from macro 'SPRINT'
sprintf(buffer, "%" SIZE_SPEC FMT_CHAR, va_arg(*vargs, TYPE))
^
/Library/Developer/CommandLineTools/SDKs/MacOSX.sdk/usr/include/stdio.h:180:1: note: 'sprintf' has been explicitly marked deprecated here
__deprecated_msg("This function is provided for compatibility reasons only. Due to security concerns inherent in the design of sprintf(3), it is highly recommended that you use snprintf(3) instead.")
^
/Library/Developer/CommandLineTools/SDKs/MacOSX.sdk/usr/include/sys/cdefs.h:215:48: note: expanded from macro '__deprecated_msg'
#define __deprecated_msg(_msg) __attribute__((__deprecated__(_msg)))
^
Objects/unicodeobject.c:2997:15: warning: 'sprintf' is deprecated: This function is provided for compatibility reasons only. Due to security concerns inherent in the design of sprintf(3), it is highly recommended that you use snprintf(3) instead. [-Wdeprecated-declarations]
len = sprintf(number, "%p", va_arg(*vargs, void*));
^
/Library/Developer/CommandLineTools/SDKs/MacOSX.sdk/usr/include/stdio.h:180:1: note: 'sprintf' has been explicitly marked deprecated here
__deprecated_msg("This function is provided for compatibility reasons only. Due to security concerns inherent in the design of sprintf(3), it is highly recommended that you use snprintf(3) instead.")
^
/Library/Developer/CommandLineTools/SDKs/MacOSX.sdk/usr/include/sys/cdefs.h:215:48: note: expanded from macro '__deprecated_msg'
#define __deprecated_msg(_msg) __attribute__((__deprecated__(_msg)))
^
Objects/unicodeobject.c:9018:13: warning: 'sprintf' is deprecated: This function is provided for compatibility reasons only. Due to security concerns inherent in the design of sprintf(3), it is highly recommended that you use snprintf(3) instead. [-Wdeprecated-declarations]
sprintf(buffer, "&#%d;", (int)PyUnicode_READ_CHAR(unicode, collpos));
^
/Library/Developer/CommandLineTools/SDKs/MacOSX.sdk/usr/include/stdio.h:180:1: note: 'sprintf' has been explicitly marked deprecated here
__deprecated_msg("This function is provided for compatibility reasons only. Due to security concerns inherent in the design of sprintf(3), it is highly recommended that you use snprintf(3) instead.")
^
/Library/Developer/CommandLineTools/SDKs/MacOSX.sdk/usr/include/sys/cdefs.h:215:48: note: expanded from macro '__deprecated_msg'
#define __deprecated_msg(_msg) __attribute__((__deprecated__(_msg)))
^
Python/ceval_gil.c:81:24: warning: code will never be executed [-Wunreachable-code]
int32_t npending = _Py_atomic_load_int32_relaxed(
^~~~~~~~~~~~~~~~~~~~~~~~~~~~~
1 warning generated.
1 warning generated.
Python/pystrtod.c:1204:19: warning: 'sprintf' is deprecated: This function is provided for compatibility reasons only. Due to security concerns inherent in the design of sprintf(3), it is highly recommended that you use snprintf(3) instead. [-Wdeprecated-declarations]
exp_len = sprintf(p, "%+.02d", exp);
^
/Library/Developer/CommandLineTools/SDKs/MacOSX.sdk/usr/include/stdio.h:180:1: note: 'sprintf' has been explicitly marked deprecated here
__deprecated_msg("This function is provided for compatibility reasons only. Due to security concerns inherent in the design of sprintf(3), it is highly recommended that you use snprintf(3) instead.")
^
/Library/Developer/CommandLineTools/SDKs/MacOSX.sdk/usr/include/sys/cdefs.h:215:48: note: expanded from macro '__deprecated_msg'
#define __deprecated_msg(_msg) __attribute__((__deprecated__(_msg)))
^
1 warning generated.
./Modules/_datetimemodule.c:1850:9: warning: 'sprintf' is deprecated: This function is provided for compatibility reasons only. Due to security concerns inherent in the design of sprintf(3), it is highly recommended that you use snprintf(3) instead. [-Wdeprecated-declarations]
sprintf(freplacement, "%06d", TIME_GET_MICROSECOND(object));
^
/Library/Developer/CommandLineTools/SDKs/MacOSX.sdk/usr/include/stdio.h:180:1: note: 'sprintf' has been explicitly marked deprecated here
__deprecated_msg("This function is provided for compatibility reasons only. Due to security concerns inherent in the design of sprintf(3), it is highly recommended that you use snprintf(3) instead.")
^
/Library/Developer/CommandLineTools/SDKs/MacOSX.sdk/usr/include/sys/cdefs.h:215:48: note: expanded from macro '__deprecated_msg'
#define __deprecated_msg(_msg) __attribute__((__deprecated__(_msg)))
^
./Modules/_datetimemodule.c:1852:9: warning: 'sprintf' is deprecated: This function is provided for compatibility reasons only. Due to security concerns inherent in the design of sprintf(3), it is highly recommended that you use snprintf(3) instead. [-Wdeprecated-declarations]
sprintf(freplacement, "%06d", DATE_GET_MICROSECOND(object));
^
/Library/Developer/CommandLineTools/SDKs/MacOSX.sdk/usr/include/stdio.h:180:1: note: 'sprintf' has been explicitly marked deprecated here
__deprecated_msg("This function is provided for compatibility reasons only. Due to security concerns inherent in the design of sprintf(3), it is highly recommended that you use snprintf(3) instead.")
^
/Library/Developer/CommandLineTools/SDKs/MacOSX.sdk/usr/include/sys/cdefs.h:215:48: note: expanded from macro '__deprecated_msg'
#define __deprecated_msg(_msg) __attribute__((__deprecated__(_msg)))
^
./Modules/_datetimemodule.c:1854:9: warning: 'sprintf' is deprecated: This function is provided for compatibility reasons only. Due to security concerns inherent in the design of sprintf(3), it is highly recommended that you use snprintf(3) instead. [-Wdeprecated-declarations]
sprintf(freplacement, "%06d", 0);
^
/Library/Developer/CommandLineTools/SDKs/MacOSX.sdk/usr/include/stdio.h:180:1: note: 'sprintf' has been explicitly marked deprecated here
__deprecated_msg("This function is provided for compatibility reasons only. Due to security concerns inherent in the design of sprintf(3), it is highly recommended that you use snprintf(3) instead.")
^
/Library/Developer/CommandLineTools/SDKs/MacOSX.sdk/usr/include/sys/cdefs.h:215:48: note: expanded from macro '__deprecated_msg'
#define __deprecated_msg(_msg) __attribute__((__deprecated__(_msg)))
^
33 warnings generated.
3 warnings generated.
Programs/_freeze_module.c:129:5: warning: 'sprintf' is deprecated: This function is provided for compatibility reasons only. Due to security concerns inherent in the design of sprintf(3), it is highly recommended that you use snprintf(3) instead. [-Wdeprecated-declarations]
sprintf(filename, "<frozen %s>", name);
^
/Library/Developer/CommandLineTools/SDKs/MacOSX.sdk/usr/include/stdio.h:180:1: note: 'sprintf' has been explicitly marked deprecated here
__deprecated_msg("This function is provided for compatibility reasons only. Due to security concerns inherent in the design of sprintf(3), it is highly recommended that you use snprintf(3) instead.")
^
/Library/Developer/CommandLineTools/SDKs/MacOSX.sdk/usr/include/sys/cdefs.h:215:48: note: expanded from macro '__deprecated_msg'
#define __deprecated_msg(_msg) __attribute__((__deprecated__(_msg)))
^
1 warning generated.
./Modules/_pickle.c:2156:13: warning: 'sprintf' is deprecated: This function is provided for compatibility reasons only. Due to security concerns inherent in the design of sprintf(3), it is highly recommended that you use snprintf(3) instead. [-Wdeprecated-declarations]
sprintf(pdata, "%c%ld\n", INT, val);
^
/Library/Developer/CommandLineTools/SDKs/MacOSX.sdk/usr/include/stdio.h:180:1: note: 'sprintf' has been explicitly marked deprecated here
__deprecated_msg("This function is provided for compatibility reasons only. Due to security concerns inherent in the design of sprintf(3), it is highly recommended that you use snprintf(3) instead.")
^
/Library/Developer/CommandLineTools/SDKs/MacOSX.sdk/usr/include/sys/cdefs.h:215:48: note: expanded from macro '__deprecated_msg'
#define __deprecated_msg(_msg) __attribute__((__deprecated__(_msg)))
^
1 warning generated.
./Modules/unicodedata.c:1334:9: warning: 'sprintf' is deprecated: This function is provided for compatibility reasons only. Due to security concerns inherent in the design of sprintf(3), it is highly recommended that you use snprintf(3) instead. [-Wdeprecated-declarations]
sprintf(buffer, "CJK UNIFIED IDEOGRAPH-%X", code);
^
/Library/Developer/CommandLineTools/SDKs/MacOSX.sdk/usr/include/stdio.h:180:1: note: 'sprintf' has been explicitly marked deprecated here
__deprecated_msg("This function is provided for compatibility reasons only. Due to security concerns inherent in the design of sprintf(3), it is highly recommended that you use snprintf(3) instead.")
^
/Library/Developer/CommandLineTools/SDKs/MacOSX.sdk/usr/include/sys/cdefs.h:215:48: note: expanded from macro '__deprecated_msg'
#define __deprecated_msg(_msg) __attribute__((__deprecated__(_msg)))
^
1 warning generated.
./Modules/_ctypes/_ctypes.c:389:17: warning: 'sprintf' is deprecated: This function is provided for compatibility reasons only. Due to security concerns inherent in the design of sprintf(3), it is highly recommended that you use snprintf(3) instead. [-Wdeprecated-declarations]
sprintf(buf, "%zd,", shape[k]);
^
/Library/Developer/CommandLineTools/SDKs/MacOSX.sdk/usr/include/stdio.h:180:1: note: 'sprintf' has been explicitly marked deprecated here
__deprecated_msg("This function is provided for compatibility reasons only. Due to security concerns inherent in the design of sprintf(3), it is highly recommended that you use snprintf(3) instead.")
^
/Library/Developer/CommandLineTools/SDKs/MacOSX.sdk/usr/include/sys/cdefs.h:215:48: note: expanded from macro '__deprecated_msg'
#define __deprecated_msg(_msg) __attribute__((__deprecated__(_msg)))
^
./Modules/_ctypes/_ctypes.c:391:17: warning: 'sprintf' is deprecated: This function is provided for compatibility reasons only. Due to security concerns inherent in the design of sprintf(3), it is highly recommended that you use snprintf(3) instead. [-Wdeprecated-declarations]
sprintf(buf, "%zd)", shape[k]);
^
/Library/Developer/CommandLineTools/SDKs/MacOSX.sdk/usr/include/stdio.h:180:1: note: 'sprintf' has been explicitly marked deprecated here
__deprecated_msg("This function is provided for compatibility reasons only. Due to security concerns inherent in the design of sprintf(3), it is highly recommended that you use snprintf(3) instead.")
^
/Library/Developer/CommandLineTools/SDKs/MacOSX.sdk/usr/include/sys/cdefs.h:215:48: note: expanded from macro '__deprecated_msg'
#define __deprecated_msg(_msg) __attribute__((__deprecated__(_msg)))
^
./Modules/_ctypes/_ctypes.c:2925:11: warning: 'sprintf' is deprecated: This function is provided for compatibility reasons only. Due to security concerns inherent in the design of sprintf(3), it is highly recommended that you use snprintf(3) instead. [-Wdeprecated-declarations]
cp += sprintf(cp, "%x", Py_SAFE_DOWNCAST(index, Py_ssize_t, int));
^
/Library/Developer/CommandLineTools/SDKs/MacOSX.sdk/usr/include/stdio.h:180:1: note: 'sprintf' has been explicitly marked deprecated here
__deprecated_msg("This function is provided for compatibility reasons only. Due to security concerns inherent in the design of sprintf(3), it is highly recommended that you use snprintf(3) instead.")
^
/Library/Developer/CommandLineTools/SDKs/MacOSX.sdk/usr/include/sys/cdefs.h:215:48: note: expanded from macro '__deprecated_msg'
#define __deprecated_msg(_msg) __attribute__((__deprecated__(_msg)))
^
./Modules/_ctypes/_ctypes.c:2934:15: warning: 'sprintf' is deprecated: This function is provided for compatibility reasons only. Due to security concerns inherent in the design of sprintf(3), it is highly recommended that you use snprintf(3) instead. [-Wdeprecated-declarations]
cp += sprintf(cp, ":%x", Py_SAFE_DOWNCAST(target->b_index, Py_ssize_t, int));
^
/Library/Developer/CommandLineTools/SDKs/MacOSX.sdk/usr/include/stdio.h:180:1: note: 'sprintf' has been explicitly marked deprecated here
__deprecated_msg("This function is provided for compatibility reasons only. Due to security concerns inherent in the design of sprintf(3), it is highly recommended that you use snprintf(3) instead.")
^
/Library/Developer/CommandLineTools/SDKs/MacOSX.sdk/usr/include/sys/cdefs.h:215:48: note: expanded from macro '__deprecated_msg'
#define __deprecated_msg(_msg) __attribute__((__deprecated__(_msg)))
^
./Modules/_ctypes/_ctypes.c:5355:5: warning: 'sprintf' is deprecated: This function is provided for compatibility reasons only. Due to security concerns inherent in the design of sprintf(3), it is highly recommended that you use snprintf(3) instead. [-Wdeprecated-declarations]
sprintf(name, "%.200s_Array_%ld",
^
/Library/Developer/CommandLineTools/SDKs/MacOSX.sdk/usr/include/stdio.h:180:1: note: 'sprintf' has been explicitly marked deprecated here
__deprecated_msg("This function is provided for compatibility reasons only. Due to security concerns inherent in the design of sprintf(3), it is highly recommended that you use snprintf(3) instead.")
^
/Library/Developer/CommandLineTools/SDKs/MacOSX.sdk/usr/include/sys/cdefs.h:215:48: note: expanded from macro '__deprecated_msg'
#define __deprecated_msg(_msg) __attribute__((__deprecated__(_msg)))
^
./Modules/_testcapimodule.c:786:17: warning: 'sprintf' is deprecated: This function is provided for compatibility reasons only. Due to security concerns inherent in the design of sprintf(3), it is highly recommended that you use snprintf(3) instead. [-Wdeprecated-declarations]
FAIL("PyCapsule_GetPointer returned NULL unexpectedly!");
^
./Modules/_testcapimodule.c:775:13: note: expanded from macro 'FAIL'
sprintf(buffer, "%s module: \"%s\" attribute: \"%s\"", \
^
/Library/Developer/CommandLineTools/SDKs/MacOSX.sdk/usr/include/stdio.h:180:1: note: 'sprintf' has been explicitly marked deprecated here
__deprecated_msg("This function is provided for compatibility reasons only. Due to security concerns inherent in the design of sprintf(3), it is highly recommended that you use snprintf(3) instead.")
^
/Library/Developer/CommandLineTools/SDKs/MacOSX.sdk/usr/include/sys/cdefs.h:215:48: note: expanded from macro '__deprecated_msg'
#define __deprecated_msg(_msg) __attribute__((__deprecated__(_msg)))
^
./Modules/_testcapimodule.c:798:17: warning: 'sprintf' is deprecated: This function is provided for compatibility reasons only. Due to security concerns inherent in the design of sprintf(3), it is highly recommended that you use snprintf(3) instead. [-Wdeprecated-declarations]
FAIL("PyCapsule_GetPointer should have failed but did not!");
^
./Modules/_testcapimodule.c:775:13: note: expanded from macro 'FAIL'
sprintf(buffer, "%s module: \"%s\" attribute: \"%s\"", \
^
/Library/Developer/CommandLineTools/SDKs/MacOSX.sdk/usr/include/stdio.h:180:1: note: 'sprintf' has been explicitly marked deprecated here
__deprecated_msg("This function is provided for compatibility reasons only. Due to security concerns inherent in the design of sprintf(3), it is highly recommended that you use snprintf(3) instead.")
^
/Library/Developer/CommandLineTools/SDKs/MacOSX.sdk/usr/include/sys/cdefs.h:215:48: note: expanded from macro '__deprecated_msg'
#define __deprecated_msg(_msg) __attribute__((__deprecated__(_msg)))
^
./Modules/_testcapimodule.c:805:21: warning: 'sprintf' is deprecated: This function is provided for compatibility reasons only. Due to security concerns inherent in the design of sprintf(3), it is highly recommended that you use snprintf(3) instead. [-Wdeprecated-declarations]
FAIL("PyCapsule_GetPointer should not have"
^
./Modules/_testcapimodule.c:775:13: note: expanded from macro 'FAIL'
sprintf(buffer, "%s module: \"%s\" attribute: \"%s\"", \
^
/Library/Developer/CommandLineTools/SDKs/MacOSX.sdk/usr/include/stdio.h:180:1: note: 'sprintf' has been explicitly marked deprecated here
__deprecated_msg("This function is provided for compatibility reasons only. Due to security concerns inherent in the design of sprintf(3), it is highly recommended that you use snprintf(3) instead.")
^
/Library/Developer/CommandLineTools/SDKs/MacOSX.sdk/usr/include/sys/cdefs.h:215:48: note: expanded from macro '__deprecated_msg'
#define __deprecated_msg(_msg) __attribute__((__deprecated__(_msg)))
^
./Modules/_testcapimodule.c:808:21: warning: 'sprintf' is deprecated: This function is provided for compatibility reasons only. Due to security concerns inherent in the design of sprintf(3), it is highly recommended that you use snprintf(3) instead. [-Wdeprecated-declarations]
FAIL("PyCapsule_GetPointer should have"
^
./Modules/_testcapimodule.c:775:13: note: expanded from macro 'FAIL'
sprintf(buffer, "%s module: \"%s\" attribute: \"%s\"", \
^
/Library/Developer/CommandLineTools/SDKs/MacOSX.sdk/usr/include/stdio.h:180:1: note: 'sprintf' has been explicitly marked deprecated here
__deprecated_msg("This function is provided for compatibility reasons only. Due to security concerns inherent in the design of sprintf(3), it is highly recommended that you use snprintf(3) instead.")
^
/Library/Developer/CommandLineTools/SDKs/MacOSX.sdk/usr/include/sys/cdefs.h:215:48: note: expanded from macro '__deprecated_msg'
#define __deprecated_msg(_msg) __attribute__((__deprecated__(_msg)))
^
5 warnings generated.
4 warnings generated.
ld: warning: search path '/opt/homebrew/lib' not found
ld: warning: search path '/opt/homebrew/lib' not found
ld: warning: search path '/opt/homebrew/lib' not found
ld: warning: search path '/opt/homebrew/lib' not found
ld: warning: search path '/opt/homebrew/lib' not found
ld: warning: search path '/opt/homebrew/lib' not found
ld: warning: search path '/opt/homebrew/lib' not found
ld: warning: search path '/opt/homebrew/lib' not found
ld: warning: search path '/opt/homebrew/lib' not found
ld: warning: search path '/opt/homebrew/lib' not found
ld: warning: search path '/opt/homebrew/lib' not found
ld: warning: search path '/opt/homebrew/lib' not found
ld: warning: search path '/opt/homebrew/lib' not found
ld: warning: search path '/opt/homebrew/lib' not found
ld: warning: search path '/opt/homebrew/lib' not found
ld: warning: search path '/opt/homebrew/lib' not found
ld: warning: search path '/opt/homebrew/lib' not found
ld: warning: search path '/opt/homebrew/lib' not found
ld: warning: search path '/opt/homebrew/lib' not found
ld: warning: search path '/opt/homebrew/lib' not found
ld: warning: search path '/opt/homebrew/lib' not found
ld: warning: search path '/opt/homebrew/lib' not found
ld: warning: search path '/opt/homebrew/lib' not found
ld: warning: search path '/opt/homebrew/lib' not found
ld: warning: search path '/opt/homebrew/lib' not found
ld: warning: search path '/opt/homebrew/lib' not found
ld: warning: search path '/opt/homebrew/lib' not found
ld: warning: search path '/opt/homebrew/lib' not found
ld: warning: search path '/opt/homebrew/lib' not found
ld: warning: search path '/opt/homebrew/lib' not found
ld: warning: search path '/opt/homebrew/lib' not found
ld: warning: search path '/opt/homebrew/lib' not found
ld: warning: search path '/opt/homebrew/lib' not found
ld: warning: search path '/opt/homebrew/lib' not found
ld: warning: search path '/opt/homebrew/lib' not found
ld: warning: search path '/opt/homebrew/lib' not found
ld: warning: search path '/opt/homebrew/lib' not found
ld: warning: search path '/opt/homebrew/lib' not found
ld: warning: search path '/opt/homebrew/lib' not found
ld: warning: search path '/opt/homebrew/lib' not found
ld: warning: search path '/opt/homebrew/lib' not found
ld: warning: search path '/opt/homebrew/lib' not found
ld: warning: search path '/opt/homebrew/lib' not found
ld: warning: search path '/opt/homebrew/lib' not found
ld: warning: search path '/opt/homebrew/lib' not found
ld: warning: search path '/opt/homebrew/lib' not found
ld: warning: search path '/opt/homebrew/lib' not found
ld: warning: search path '/opt/homebrew/lib' not found
ld: warning: search path '/opt/homebrew/lib' not found
ld: warning: search path '/opt/homebrew/lib' not found
ld: warning: search path '/opt/homebrew/lib' not found
ld: warning: search path '/opt/homebrew/lib' not found
ld: warning: search path '/opt/homebrew/lib' not found
ld: warning: search path '/opt/homebrew/lib' not found
ld: warning: search path '/opt/homebrew/lib' not found
ld: warning: search path '/opt/homebrew/lib' not found
ld: warning: search path '/opt/homebrew/lib' not found
ld: warning: search path '/opt/homebrew/lib' not found
ld: warning: search path '/opt/homebrew/lib' not found
ld: warning: search path '/opt/homebrew/lib' not found
ld: warning: search path '/opt/homebrew/lib' not found
ld: warning: search path '/opt/homebrew/lib' not found
ld: warning: search path '/opt/homebrew/lib' not found
ld: warning: search path '/opt/homebrew/lib' not found
ld: warning: search path '/opt/homebrew/lib' not found
ld: warning: search path '/opt/homebrew/lib' not found
ld: warning: search path '/opt/homebrew/lib' not found
ld: warning: search path '/opt/homebrew/lib' not found
ld: warning: search path '/opt/homebrew/lib' not found
ld: warning: search path '/opt/homebrew/lib' not found
ld: warning: search path '/opt/homebrew/lib' not found
ld: warning: search path '/opt/homebrew/lib' not found
ld: warning: search path '/opt/homebrew/lib' not found
ld: warning: search path '/opt/homebrew/lib' not found
ld: warning: search path '/opt/homebrew/lib' not found
ld: warning: search path '/opt/homebrew/lib' not found
make: *** [buildbottest] Error 2
Test report
===========
Failed tests:
- test_tracemalloc
Sincerely,
-The Buildbot
1
0
☠ Buildbot (Python): python/cpython - failed test (failure) (3.13)
by buildbot@python.org Sept. 18, 2025
by buildbot@python.org Sept. 18, 2025
Sept. 18, 2025
The Buildbot has detected a new failure on builder ARM64 MacOS M1 Refleaks NoGIL 3.13 while building python/cpython.
Full details are available at:
https://buildbot.python.org/#/builders/1396/builds/1603
Buildbot URL: https://buildbot.python.org/
Worker for this Build: itamaro-macos-arm64-aws
Build Reason: <unknown>
Blamelist: Erlend E. Aasland <erlend(a)python.org>, Miss Islington (bot) <31488909+miss-islington(a)users.noreply.github.com>, Łukasz Langa <lukasz(a)langa.pl>
BUILD FAILED: failed test (failure)
Summary of the results of the build (if available):
===================================================
==
Captured traceback
==================
Traceback (most recent call last):
File "/Users/buildbot/buildarea/3.13.itamaro-macos-arm64-aws.macos-with-brew.refleak.nogil/build/Lib/test/_test_multiprocessing.py", line 1492, in test_repr_rlock
self.assertEqual('<RLock(SomeOtherThread, nonzero)>', repr(lock))
~~~~~~~~~~~~~~~~^^^^^^^^^^^^^^^^^^^^^^^^^^^^^^^^^^^^^^^^^^^^^^^^^
AssertionError: '<RLock(SomeOtherThread, nonzero)>' != '<RLock(None, 0)>'
- <RLock(SomeOtherThread, nonzero)>
+ <RLock(None, 0)>
Test report
===========
Failed tests:
- test.test_multiprocessing_forkserver.test_processes
Failed subtests:
- test_repr_rlock - test.test_multiprocessing_forkserver.test_processes.WithProcessesTestLock.test_repr_rlock
Sincerely,
-The Buildbot
1
0
☠ Buildbot (Python): python/cpython - failed test (failure) (3.14)
by buildbot@python.org Sept. 17, 2025
by buildbot@python.org Sept. 17, 2025
Sept. 17, 2025
The Buildbot has detected a new failure on builder AMD64 FreeBSD Refleaks 3.14 while building python/cpython.
Full details are available at:
https://buildbot.python.org/#/builders/1800/builds/479
Buildbot URL: https://buildbot.python.org/
Worker for this Build: ware-freebsd
Build Reason: <unknown>
Blamelist: Miss Islington (bot) <31488909+miss-islington(a)users.noreply.github.com>
BUILD FAILED: failed test (failure)
Summary of the results of the build (if available):
===================================================
==
Captured traceback
==================
Traceback (most recent call last):
File "/buildbot/buildarea/3.14.ware-freebsd.refleak/build/Lib/test/support/__init__.py", line 837, in gc_collect
gc.collect()
ResourceWarning: unclosed <socket.socket fd=8, family=2, type=1, proto=6, laddr=('127.0.0.1', 42032), raddr=('127.0.0.1', 42033)>
Task was destroyed but it is pending!
task: <Task pending name='Task-3151' coro=<BaseSelectorEventLoop._accept_connection2() done, defined at /buildbot/buildarea/3.14.ware-freebsd.refleak/build/Lib/asyncio/selector_events.py:217> wait_for=<Future pending cb=[Task.task_wakeup()]>>
Warning -- Unraisable exception
Exception ignored while calling deallocator <function _SelectorTransport.__del__ at 0x8465a3590>:
Traceback (most recent call last):
File "/buildbot/buildarea/3.14.ware-freebsd.refleak/build/Lib/asyncio/selector_events.py", line 873, in __del__
_warn(f"unclosed transport {self!r}", ResourceWarning, source=self)
ResourceWarning: unclosed transport <_SelectorSocketTransport closing fd=8>
k
Traceback (most recent call last):
File "/buildbot/buildarea/3.14.ware-freebsd.refleak/build/Lib/test/support/__init__.py", line 837, in gc_collect
gc.collect()
ResourceWarning: unclosed <socket.socket fd=9, family=2, type=1, proto=6, laddr=('127.0.0.1', 52691), raddr=('127.0.0.1', 52692)>
Task was destroyed but it is pending!
task: <Task pending name='Task-3374' coro=<BaseSelectorEventLoop._accept_connection2() done, defined at /buildbot/buildarea/3.14.ware-freebsd.refleak/build/Lib/asyncio/selector_events.py:217> wait_for=<Future pending cb=[Task.task_wakeup()]>>
Warning -- Unraisable exception
Exception ignored while calling deallocator <function _SelectorTransport.__del__ at 0x845663590>:
Traceback (most recent call last):
File "/buildbot/buildarea/3.14.ware-freebsd.refleak/build/Lib/asyncio/selector_events.py", line 873, in __del__
_warn(f"unclosed transport {self!r}", ResourceWarning, source=self)
ResourceWarning: unclosed transport <_SelectorSocketTransport closing fd=9>
k
Test report
===========
Sincerely,
-The Buildbot
1
0
☠ Buildbot (Python): python/cpython - failed test (failure) (main)
by buildbot@python.org Sept. 17, 2025
by buildbot@python.org Sept. 17, 2025
Sept. 17, 2025
The Buildbot has detected a new failure on builder AMD64 FreeBSD Refleaks 3.x while building python/cpython.
Full details are available at:
https://buildbot.python.org/#/builders/1613/builds/2015
Buildbot URL: https://buildbot.python.org/
Worker for this Build: ware-freebsd
Build Reason: <unknown>
Blamelist: Sergey Miryanov <sergey.miryanov(a)gmail.com>
BUILD FAILED: failed test (failure)
Summary of the results of the build (if available):
===================================================
==
Captured traceback
==================
Traceback (most recent call last):
File "/buildbot/buildarea/3.x.ware-freebsd.refleak/build/Lib/test/support/__init__.py", line 837, in gc_collect
gc.collect()
~~~~~~~~~~^^
ResourceWarning: unclosed <socket.socket fd=9, family=2, type=1, proto=6, laddr=('127.0.0.1', 25427), raddr=('127.0.0.1', 25428)>
Task was destroyed but it is pending!
task: <Task pending name='Task-1035' coro=<BaseSelectorEventLoop._accept_connection2() done, defined at /buildbot/buildarea/3.x.ware-freebsd.refleak/build/Lib/asyncio/selector_events.py:217> wait_for=<Future pending cb=[Task.task_wakeup()]>>
Warning -- Unraisable exception
Exception ignored while calling deallocator <function _SelectorTransport.__del__ at 0x842e88890>:
Traceback (most recent call last):
File "/buildbot/buildarea/3.x.ware-freebsd.refleak/build/Lib/asyncio/selector_events.py", line 873, in __del__
_warn(f"unclosed transport {self!r}", ResourceWarning, source=self)
~~~~~^^^^^^^^^^^^^^^^^^^^^^^^^^^^^^^^^^^^^^^^^^^^^^^^^^^^^^^^^^^^^^
ResourceWarning: unclosed transport <_SelectorSocketTransport closing fd=9>
k
Traceback (most recent call last):
File "/buildbot/buildarea/3.x.ware-freebsd.refleak/build/Lib/test/support/__init__.py", line 837, in gc_collect
gc.collect()
~~~~~~~~~~^^
ResourceWarning: unclosed <socket.socket fd=10, family=2, type=1, proto=6, laddr=('127.0.0.1', 25385), raddr=('127.0.0.1', 25386)>
Task was destroyed but it is pending!
task: <Task pending name='Task-803' coro=<BaseSelectorEventLoop._accept_connection2() done, defined at /buildbot/buildarea/3.x.ware-freebsd.refleak/build/Lib/asyncio/selector_events.py:217> wait_for=<Future pending cb=[Task.task_wakeup()]>>
Warning -- Unraisable exception
Exception ignored while calling deallocator <function _SelectorTransport.__del__ at 0x842e88890>:
Traceback (most recent call last):
File "/buildbot/buildarea/3.x.ware-freebsd.refleak/build/Lib/asyncio/selector_events.py", line 873, in __del__
_warn(f"unclosed transport {self!r}", ResourceWarning, source=self)
~~~~~^^^^^^^^^^^^^^^^^^^^^^^^^^^^^^^^^^^^^^^^^^^^^^^^^^^^^^^^^^^^^^
ResourceWarning: unclosed transport <_SelectorSocketTransport closing fd=10>
k
Traceback (most recent call last):
File "/buildbot/buildarea/3.x.ware-freebsd.refleak/build/Lib/test/support/__init__.py", line 837, in gc_collect
gc.collect()
~~~~~~~~~~^^
ResourceWarning: unclosed <socket.socket fd=9, family=2, type=1, proto=6, laddr=('127.0.0.1', 38584), raddr=('127.0.0.1', 38585)>
Task was destroyed but it is pending!
task: <Task pending name='Task-1972' coro=<BaseSelectorEventLoop._accept_connection2() done, defined at /buildbot/buildarea/3.x.ware-freebsd.refleak/build/Lib/asyncio/selector_events.py:217> wait_for=<Future pending cb=[Task.task_wakeup()]>>
Warning -- Unraisable exception
Exception ignored while calling deallocator <function _SelectorTransport.__del__ at 0x847218890>:
Traceback (most recent call last):
File "/buildbot/buildarea/3.x.ware-freebsd.refleak/build/Lib/asyncio/selector_events.py", line 873, in __del__
_warn(f"unclosed transport {self!r}", ResourceWarning, source=self)
~~~~~^^^^^^^^^^^^^^^^^^^^^^^^^^^^^^^^^^^^^^^^^^^^^^^^^^^^^^^^^^^^^^
ResourceWarning: unclosed transport <_SelectorSocketTransport closing fd=9>
k
Test report
===========
Sincerely,
-The Buildbot
1
0
☠ Buildbot (Python): python/cpython - failed test (failure) (main)
by buildbot@python.org Sept. 17, 2025
by buildbot@python.org Sept. 17, 2025
Sept. 17, 2025
The Buildbot has detected a new failure on builder s390x RHEL8 LTO 3.x while building python/cpython.
Full details are available at:
https://buildbot.python.org/#/builders/567/builds/10144
Buildbot URL: https://buildbot.python.org/
Worker for this Build: cstratak-rhel8-s390x
Build Reason: <unknown>
Blamelist: Sergey Miryanov <sergey.miryanov(a)gmail.com>
BUILD FAILED: failed test (failure)
Summary of the results of the build (if available):
===================================================
==
Captured traceback
==================
Traceback (most recent call last):
File "/home/buildbot/buildarea/3.x.cstratak-rhel8-s390x.lto/build/Lib/contextlib.py", line 112, in __init__
doc = getattr(func, "__doc__", None)
ValueError: flush of closed file
Warning -- Unraisable exception
Exception ignored while finalizing file <_io.BufferedWriter>:
Traceback (most recent call last):
File "/home/buildbot/buildarea/3.x.cstratak-rhel8-s390x.lto/build/Lib/contextlib.py", line 112, in __init__
doc = getattr(func, "__doc__", None)
ValueError: flush of closed file
k
Test report
===========
Sincerely,
-The Buildbot
1
0