Buildbot-status
Threads by month
- ----- 2026 -----
- October
- September
- August
- July
- June
- May
- April
- March
- February
- January
- ----- 2025 -----
- December
- November
- October
- September
- August
- July
- June
- May
- April
- March
- February
- January
- ----- 2024 -----
- December
- November
- October
- September
- August
- July
- June
- May
- April
- March
- February
- January
- ----- 2023 -----
- December
- November
- October
- September
- August
- July
- June
- May
- April
- March
- February
- January
- ----- 2022 -----
- December
- November
- October
- September
- August
- July
- June
- May
- April
- March
- February
- January
- ----- 2021 -----
- December
- November
- October
- September
- August
- July
- June
- May
- April
- March
- February
- January
- ----- 2020 -----
- December
- November
- October
- September
- August
- July
- June
- May
- April
- March
- February
- January
- ----- 2019 -----
- December
- November
- October
- September
- August
- July
- June
- May
- April
- March
- February
- January
- ----- 2018 -----
- December
- November
- October
- September
- August
- July
- June
- May
- April
- March
- February
- January
- ----- 2017 -----
- December
- November
- October
- September
- August
- July
- June
- May
September 2025
- 1 participants
- 90 discussions
☠ Buildbot (Python): python/cpython - failed test (failure) (main)
by buildbot@python.org Sept. 17, 2025
by buildbot@python.org Sept. 17, 2025
Sept. 17, 2025
The Buildbot has detected a new failure on builder AMD64 CentOS9 NoGIL Refleaks 3.x while building python/cpython.
Full details are available at:
https://buildbot.python.org/#/builders/1610/builds/2086
Buildbot URL: https://buildbot.python.org/
Worker for this Build: itamaro-centos-aws
Build Reason: <unknown>
Blamelist: Adam Turner <9087854+AA-Turner(a)users.noreply.github.com>, Aniket <148300120+Aniketsy(a)users.noreply.github.com>, Bénédikt Tran <10796600+picnixz(a)users.noreply.github.com>, Dino Viehland <dinoviehland(a)meta.com>, Donghee Na <donghee.na(a)python.org>, Donghoon Nam <54799053+codenamenam(a)users.noreply.github.com>, Gyeongjae Choi <def6488(a)gmail.com>, Hans Then <hans.then(a)gmail.com>, Hood Chatham <roberthoodchatham(a)gmail.com>, Moshe Kaplan <mosheekaplan(a)gmail.com>, Paul Ganssle <1377457+pganssle(a)users.noreply.github.com>, Peter Bierma <zintensitydev(a)gmail.com>, Petr Viktorin <encukou(a)gmail.com>, PrinceNaroliya <naroliyaprince(a)gmail.com>, Rajhans Jadhao <rajhans.jadhao(a)gmail.com>, Serhiy Storchaka <storchaka(a)gmail.com>, Stan Ulbrych <89152624+StanFromIreland(a)users.noreply.github.com>, Stefan Tatschner <stefan(a)rumpelsepp.org>, Victor Stinner <vstinner(a)python.org>, adang1345 <adang1345(a)gmail.com>, chiri <chirizxc(a)proton.me>, Łukasz Langa <lukasz(a)langa.pl>
BUILD FAILED: failed test (failure)
Summary of the results of the build (if available):
===================================================
==
Captured traceback
==================
Traceback (most recent call last):
File "/home/buildbot/buildarea/3.x.itamaro-centos-aws.refleak.nogil/build/Lib/contextlib.py", line 85, in inner
return func(*args, **kwds)
File "/home/buildbot/buildarea/3.x.itamaro-centos-aws.refleak.nogil/build/Lib/test/test_concurrent_futures/executor.py", line 233, in test_free_reference
for _ in support.sleeping_retry(support.SHORT_TIMEOUT):
~~~~~~~~~~~~~~~~~~~~~~^^^^^^^^^^^^^^^^^^^^^^^
File "/home/buildbot/buildarea/3.x.itamaro-centos-aws.refleak.nogil/build/Lib/test/support/__init__.py", line 2624, in sleeping_retry
for _ in busy_retry(timeout, err_msg, error=error):
~~~~~~~~~~^^^^^^^^^^^^^^^^^^^^^^^^^^^^^^^
File "/home/buildbot/buildarea/3.x.itamaro-centos-aws.refleak.nogil/build/Lib/test/support/__init__.py", line 2594, in busy_retry
raise AssertionError(msg)
AssertionError: timeout (68.3 seconds)
Test report
===========
Failed tests:
- test.test_concurrent_futures.test_thread_pool
- test_free_threading
Failed subtests:
- test_free_reference - test.test_concurrent_futures.test_thread_pool.ThreadPoolExecutorTest.test_free_reference
Sincerely,
-The Buildbot
1
0
☠ Buildbot (Python): python/cpython - failed test (failure) (main)
by buildbot@python.org Sept. 17, 2025
by buildbot@python.org Sept. 17, 2025
Sept. 17, 2025
The Buildbot has detected a new failure on builder AMD64 RHEL8 LTO + PGO 3.x while building python/cpython.
Full details are available at:
https://buildbot.python.org/#/builders/568/builds/9809
Buildbot URL: https://buildbot.python.org/
Worker for this Build: cstratak-RHEL8-x86_64
Build Reason: <unknown>
Blamelist: Adam Turner <9087854+AA-Turner(a)users.noreply.github.com>, Aniket <148300120+Aniketsy(a)users.noreply.github.com>, Dino Viehland <dinoviehland(a)meta.com>, Donghee Na <donghee.na(a)python.org>, Hans Then <hans.then(a)gmail.com>, Hood Chatham <roberthoodchatham(a)gmail.com>, Moshe Kaplan <mosheekaplan(a)gmail.com>, Paul Ganssle <1377457+pganssle(a)users.noreply.github.com>, Peter Bierma <zintensitydev(a)gmail.com>, PrinceNaroliya <naroliyaprince(a)gmail.com>, Rajhans Jadhao <rajhans.jadhao(a)gmail.com>, Stefan Tatschner <stefan(a)rumpelsepp.org>, Victor Stinner <vstinner(a)python.org>, chiri <chirizxc(a)proton.me>
BUILD FAILED: failed test (failure)
Summary of the results of the build (if available):
===================================================
==
Captured traceback
==================
Traceback (most recent call last):
File "/home/buildbot/buildarea/3.x.cstratak-RHEL8-x86_64.lto-pgo/build/Lib/contextlib.py", line 112, in __init__
doc = getattr(func, "__doc__", None)
ValueError: flush of closed file
Warning -- Unraisable exception
Exception ignored while finalizing file <_io.BufferedWriter>:
Traceback (most recent call last):
File "/home/buildbot/buildarea/3.x.cstratak-RHEL8-x86_64.lto-pgo/build/Lib/contextlib.py", line 112, in __init__
doc = getattr(func, "__doc__", None)
ValueError: flush of closed file
k
Test report
===========
Sincerely,
-The Buildbot
1
0
☠ Buildbot (Python): python/cpython - failed test (failure) (main)
by buildbot@python.org Sept. 17, 2025
by buildbot@python.org Sept. 17, 2025
Sept. 17, 2025
The Buildbot has detected a new failure on builder s390x RHEL8 LTO + PGO 3.x while building python/cpython.
Full details are available at:
https://buildbot.python.org/#/builders/442/builds/10226
Buildbot URL: https://buildbot.python.org/
Worker for this Build: cstratak-rhel8-s390x
Build Reason: <unknown>
Blamelist: Adam Turner <9087854+AA-Turner(a)users.noreply.github.com>, Dino Viehland <dinoviehland(a)meta.com>, Moshe Kaplan <mosheekaplan(a)gmail.com>, Stefan Tatschner <stefan(a)rumpelsepp.org>
BUILD FAILED: failed test (failure)
Summary of the results of the build (if available):
===================================================
==
Captured traceback
==================
Traceback (most recent call last):
File "/home/buildbot/buildarea/3.x.cstratak-rhel8-s390x.lto-pgo/build/Lib/contextlib.py", line 112, in __init__
doc = getattr(func, "__doc__", None)
ValueError: flush of closed file
Warning -- Unraisable exception
Exception ignored while finalizing file <_io.BufferedWriter>:
Traceback (most recent call last):
File "/home/buildbot/buildarea/3.x.cstratak-rhel8-s390x.lto-pgo/build/Lib/contextlib.py", line 112, in __init__
doc = getattr(func, "__doc__", None)
ValueError: flush of closed file
k
Test report
===========
Sincerely,
-The Buildbot
1
0
☠ Buildbot (Python): python/cpython - failed test (failure) (main)
by buildbot@python.org Sept. 17, 2025
by buildbot@python.org Sept. 17, 2025
Sept. 17, 2025
The Buildbot has detected a new failure on builder s390x RHEL8 LTO 3.x while building python/cpython.
Full details are available at:
https://buildbot.python.org/#/builders/567/builds/10141
Buildbot URL: https://buildbot.python.org/
Worker for this Build: cstratak-rhel8-s390x
Build Reason: <unknown>
Blamelist: Victor Stinner <vstinner(a)python.org>, chiri <chirizxc(a)proton.me>
BUILD FAILED: failed test (failure)
Summary of the results of the build (if available):
===================================================
==
Captured traceback
==================
Traceback (most recent call last):
File "/home/buildbot/buildarea/3.x.cstratak-rhel8-s390x.lto/build/Lib/contextlib.py", line 112, in __init__
doc = getattr(func, "__doc__", None)
ValueError: flush of closed file
Warning -- Unraisable exception
Exception ignored while finalizing file <_io.BufferedWriter>:
Traceback (most recent call last):
File "/home/buildbot/buildarea/3.x.cstratak-rhel8-s390x.lto/build/Lib/contextlib.py", line 112, in __init__
doc = getattr(func, "__doc__", None)
ValueError: flush of closed file
k
Test report
===========
Sincerely,
-The Buildbot
1
0
☠ Buildbot (Python): python/cpython - failed test (failure) (main)
by buildbot@python.org Sept. 17, 2025
by buildbot@python.org Sept. 17, 2025
Sept. 17, 2025
The Buildbot has detected a new failure on builder AMD64 Windows PGO NoGIL 3.x while building python/cpython.
Full details are available at:
https://buildbot.python.org/#/builders/1622/builds/2671
Buildbot URL: https://buildbot.python.org/
Worker for this Build: itamaro-win64-srv-22-aws
Build Reason: <unknown>
Blamelist: Aniket <148300120+Aniketsy(a)users.noreply.github.com>, Dino Viehland <dinoviehland(a)meta.com>, Peter Bierma <zintensitydev(a)gmail.com>, Rajhans Jadhao <rajhans.jadhao(a)gmail.com>
BUILD FAILED: failed test (failure)
Summary of the results of the build (if available):
===================================================
==
Captured traceback
==================
remote: Enumerating objects: 85, done.
remote: Counting objects: 1% (1/85)
remote: Counting objects: 2% (2/85)
remote: Counting objects: 3% (3/85)
remote: Counting objects: 4% (4/85)
remote: Counting objects: 5% (5/85)
remote: Counting objects: 7% (6/85)
remote: Counting objects: 8% (7/85)
remote: Counting objects: 9% (8/85)
remote: Counting objects: 10% (9/85)
remote: Counting objects: 11% (10/85)
remote: Counting objects: 12% (11/85)
remote: Counting objects: 14% (12/85)
remote: Counting objects: 15% (13/85)
remote: Counting objects: 16% (14/85)
remote: Counting objects: 17% (15/85)
remote: Counting objects: 18% (16/85)
remote: Counting objects: 20% (17/85)
remote: Counting objects: 21% (18/85)
remote: Counting objects: 22% (19/85)
remote: Counting objects: 23% (20/85)
remote: Counting objects: 24% (21/85)
remote: Counting objects: 25% (22/85)
remote: Counting objects: 27% (23/85)
remote: Counting objects: 28% (24/85)
remote: Counting objects: 29% (25/85)
remote: Counting objects: 30% (26/85)
remote: Counting objects: 31% (27/85)
remote: Counting objects: 32% (28/85)
remote: Counting objects: 34% (29/85)
remote: Counting objects: 35% (30/85)
remote: Counting objects: 36% (31/85)
remote: Counting objects: 37% (32/85)
remote: Counting objects: 38% (33/85)
remote: Counting objects: 40% (34/85)
remote: Counting objects: 41% (35/85)
remote: Counting objects: 42% (36/85)
remote: Counting objects: 43% (37/85)
remote: Counting objects: 44% (38/85)
remote: Counting objects: 45% (39/85)
remote: Counting objects: 47% (40/85)
remote: Counting objects: 48% (41/85)
remote: Counting objects: 49% (42/85)
remote: Counting objects: 50% (43/85)
remote: Counting objects: 51% (44/85)
remote: Counting objects: 52% (45/85)
remote: Counting objects: 54% (46/85)
remote: Counting objects: 55% (47/85)
remote: Counting objects: 56% (48/85)
remote: Counting objects: 57% (49/85)
remote: Counting objects: 58% (50/85)
remote: Counting objects: 60% (51/85)
remote: Counting objects: 61% (52/85)
remote: Counting objects: 62% (53/85)
remote: Counting objects: 63% (54/85)
remote: Counting objects: 64% (55/85)
remote: Counting objects: 65% (56/85)
remote: Counting objects: 67% (57/85)
remote: Counting objects: 68% (58/85)
remote: Counting objects: 69% (59/85)
remote: Counting objects: 70% (60/85)
remote: Counting objects: 71% (61/85)
remote: Counting objects: 72% (62/85)
remote: Counting objects: 74% (63/85)
remote: Counting objects: 75% (64/85)
remote: Counting objects: 76% (65/85)
remote: Counting objects: 77% (66/85)
remote: Counting objects: 78% (67/85)
remote: Counting objects: 80% (68/85)
remote: Counting objects: 81% (69/85)
remote: Counting objects: 82% (70/85)
remote: Counting objects: 83% (71/85)
remote: Counting objects: 84% (72/85)
remote: Counting objects: 85% (73/85)
remote: Counting objects: 87% (74/85)
remote: Counting objects: 88% (75/85)
remote: Counting objects: 89% (76/85)
remote: Counting objects: 90% (77/85)
remote: Counting objects: 91% (78/85)
remote: Counting objects: 92% (79/85)
remote: Counting objects: 94% (80/85)
remote: Counting objects: 95% (81/85)
remote: Counting objects: 96% (82/85)
remote: Counting objects: 97% (83/85)
remote: Counting objects: 98% (84/85)
remote: Counting objects: 100% (85/85)
remote: Counting objects: 100% (85/85), done.
remote: Compressing objects: 2% (1/40)
remote: Compressing objects: 5% (2/40)
remote: Compressing objects: 7% (3/40)
remote: Compressing objects: 10% (4/40)
remote: Compressing objects: 12% (5/40)
remote: Compressing objects: 15% (6/40)
remote: Compressing objects: 17% (7/40)
remote: Compressing objects: 20% (8/40)
remote: Compressing objects: 22% (9/40)
remote: Compressing objects: 25% (10/40)
remote: Compressing objects: 27% (11/40)
remote: Compressing objects: 30% (12/40)
remote: Compressing objects: 32% (13/40)
remote: Compressing objects: 35% (14/40)
remote: Compressing objects: 37% (15/40)
remote: Compressing objects: 40% (16/40)
remote: Compressing objects: 42% (17/40)
remote: Compressing objects: 45% (18/40)
remote: Compressing objects: 47% (19/40)
remote: Compressing objects: 50% (20/40)
remote: Compressing objects: 52% (21/40)
remote: Compressing objects: 55% (22/40)
remote: Compressing objects: 57% (23/40)
remote: Compressing objects: 60% (24/40)
remote: Compressing objects: 62% (25/40)
remote: Compressing objects: 65% (26/40)
remote: Compressing objects: 67% (27/40)
remote: Compressing objects: 70% (28/40)
remote: Compressing objects: 72% (29/40)
remote: Compressing objects: 75% (30/40)
remote: Compressing objects: 77% (31/40)
remote: Compressing objects: 80% (32/40)
remote: Compressing objects: 82% (33/40)
remote: Compressing objects: 85% (34/40)
remote: Compressing objects: 87% (35/40)
remote: Compressing objects: 90% (36/40)
remote: Compressing objects: 92% (37/40)
remote: Compressing objects: 95% (38/40)
remote: Compressing objects: 97% (39/40)
remote: Compressing objects: 100% (40/40)
remote: Compressing objects: 100% (40/40), done.
remote: Total 50 (delta 43), reused 16 (delta 10), pack-reused 0 (from 0)
From https://github.com/python/cpython
* branch main -> FETCH_HEAD
Note: switching to 'a64881363b836b95fb4512a5689d69c1aa07ecb8'.
You are in 'detached HEAD' state. You can look around, make experimental
changes and commit them, and you can discard any commits you make in this
state without impacting any branches by switching back to a branch.
If you want to create a new branch to retain commits you create, you may
do so (now or later) by using -c with the switch command. Example:
git switch -c <new-branch-name>
Or undo this operation with:
git switch -
Turn off this advice by setting config variable advice.detachedHead to false
HEAD is now at a64881363b8 gh-128639: Don't assume one thread in subinterpreter finalization with fixed daemon thread support (GH-134606)
Switched to and reset branch 'main'
Could Not Find C:\Users\Administrator\buildarea\3.x.itamaro-win64-srv-22-aws.nogil.pgo\build\PCbuild\*.pgc
Could Not Find C:\Users\Administrator\buildarea\3.x.itamaro-win64-srv-22-aws.nogil.pgo\build\Lib\*.pyc
'"C:\Users\Administrator\buildarea\3.x.itamaro-win64-srv-22-aws.nogil.pgo\build\PCbuild\\..\python.bat"' is not recognized as an internal or external command,
operable program or batch file.
Could Not Find C:\Users\Administrator\buildarea\3.x.itamaro-win64-srv-22-aws.nogil.pgo\build\PCbuild\*.pgc
Could Not Find C:\Users\Administrator\buildarea\3.x.itamaro-win64-srv-22-aws.nogil.pgo\build\Lib\*.pyc
'"C:\Users\Administrator\buildarea\3.x.itamaro-win64-srv-22-aws.nogil.pgo\build\PCbuild\\..\python.bat"' is not recognized as an internal or external command,
operable program or batch file.
Could Not Find C:\Users\Administrator\buildarea\3.x.itamaro-win64-srv-22-aws.nogil.pgo\build\Lib\*.pyc
The system cannot find the file specified.
Could Not Find C:\Users\Administrator\buildarea\3.x.itamaro-win64-srv-22-aws.nogil.pgo\build\PCbuild\python*.zip
Could Not Find C:\Users\Administrator\buildarea\3.x.itamaro-win64-srv-22-aws.nogil.pgo\build\PCbuild\*.pgc
Could Not Find C:\Users\Administrator\buildarea\3.x.itamaro-win64-srv-22-aws.nogil.pgo\build\Lib\*.pyc
Could Not Find C:\Users\Administrator\buildarea\3.x.itamaro-win64-srv-22-aws.nogil.pgo\build\PCbuild\python*.zip
Test report
===========
Failed tests:
- test_tracemalloc
Sincerely,
-The Buildbot
1
0
☠ Buildbot (Python): python/cpython - failed test (failure) (3.13)
by buildbot@python.org Sept. 17, 2025
by buildbot@python.org Sept. 17, 2025
Sept. 17, 2025
The Buildbot has detected a new failure on builder ARM64 MacOS M1 Refleaks NoGIL 3.13 while building python/cpython.
Full details are available at:
https://buildbot.python.org/#/builders/1396/builds/1600
Buildbot URL: https://buildbot.python.org/
Worker for this Build: itamaro-macos-arm64-aws
Build Reason: <unknown>
Blamelist: Miss Islington (bot) <31488909+miss-islington(a)users.noreply.github.com>, Łukasz Langa <lukasz(a)langa.pl>
BUILD FAILED: failed test (failure)
Summary of the results of the build (if available):
===================================================
==
Captured traceback
==================
Traceback (most recent call last):
File "/Users/buildbot/buildarea/3.13.itamaro-macos-arm64-aws.macos-with-brew.refleak.nogil/build/Lib/test/_test_multiprocessing.py", line 1492, in test_repr_rlock
self.assertEqual('<RLock(SomeOtherThread, nonzero)>', repr(lock))
~~~~~~~~~~~~~~~~^^^^^^^^^^^^^^^^^^^^^^^^^^^^^^^^^^^^^^^^^^^^^^^^^
AssertionError: '<RLock(SomeOtherThread, nonzero)>' != '<RLock(None, 0)>'
- <RLock(SomeOtherThread, nonzero)>
+ <RLock(None, 0)>
Test report
===========
Failed tests:
- test.test_multiprocessing_forkserver.test_processes
Failed subtests:
- test_repr_rlock - test.test_multiprocessing_forkserver.test_processes.WithProcessesTestLock.test_repr_rlock
- test_repr_rlock - test.test_multiprocessing_spawn.test_processes.WithProcessesTestLock.test_repr_rlock
Test leaking resources:
- test_processes: memory blocks
Sincerely,
-The Buildbot
1
0
☠ Buildbot (Python): python/cpython - failed test (failure) (main)
by buildbot@python.org Sept. 16, 2025
by buildbot@python.org Sept. 16, 2025
Sept. 16, 2025
The Buildbot has detected a new failure on builder x86-64 MacOS Intel ASAN NoGIL 3.x while building python/cpython.
Full details are available at:
https://buildbot.python.org/#/builders/1366/builds/5052
Buildbot URL: https://buildbot.python.org/
Worker for this Build: itamaro-macos-intel-aws
Build Reason: <unknown>
Blamelist: Benjamin Johnson <benjohnson2040(a)gmail.com>, Steve Dower <steve.dower(a)python.org>, Victor Stinner <vstinner(a)python.org>
BUILD FAILED: failed test (failure)
Summary of the results of the build (if available):
===================================================
==
Captured traceback
==================
remote: Enumerating objects: 26, done.
remote: Counting objects: 4% (1/24)
remote: Counting objects: 8% (2/24)
remote: Counting objects: 12% (3/24)
remote: Counting objects: 16% (4/24)
remote: Counting objects: 20% (5/24)
remote: Counting objects: 25% (6/24)
remote: Counting objects: 29% (7/24)
remote: Counting objects: 33% (8/24)
remote: Counting objects: 37% (9/24)
remote: Counting objects: 41% (10/24)
remote: Counting objects: 45% (11/24)
remote: Counting objects: 50% (12/24)
remote: Counting objects: 54% (13/24)
remote: Counting objects: 58% (14/24)
remote: Counting objects: 62% (15/24)
remote: Counting objects: 66% (16/24)
remote: Counting objects: 70% (17/24)
remote: Counting objects: 75% (18/24)
remote: Counting objects: 79% (19/24)
remote: Counting objects: 83% (20/24)
remote: Counting objects: 87% (21/24)
remote: Counting objects: 91% (22/24)
remote: Counting objects: 95% (23/24)
remote: Counting objects: 100% (24/24)
remote: Counting objects: 100% (24/24), done.
remote: Compressing objects: 5% (1/17)
remote: Compressing objects: 11% (2/17)
remote: Compressing objects: 17% (3/17)
remote: Compressing objects: 23% (4/17)
remote: Compressing objects: 29% (5/17)
remote: Compressing objects: 35% (6/17)
remote: Compressing objects: 41% (7/17)
remote: Compressing objects: 47% (8/17)
remote: Compressing objects: 52% (9/17)
remote: Compressing objects: 58% (10/17)
remote: Compressing objects: 64% (11/17)
remote: Compressing objects: 70% (12/17)
remote: Compressing objects: 76% (13/17)
remote: Compressing objects: 82% (14/17)
remote: Compressing objects: 88% (15/17)
remote: Compressing objects: 94% (16/17)
remote: Compressing objects: 100% (17/17)
remote: Compressing objects: 100% (17/17), done.
remote: Total 26 (delta 9), reused 7 (delta 7), pack-reused 2 (from 2)
From https://github.com/python/cpython
* branch main -> FETCH_HEAD
Note: switching to 'ab6893ab5c04fecf71c94f7d65527df124155df5'.
You are in 'detached HEAD' state. You can look around, make experimental
changes and commit them, and you can discard any commits you make in this
state without impacting any branches by switching back to a branch.
If you want to create a new branch to retain commits you create, you may
do so (now or later) by using -c with the switch command. Example:
git switch -c <new-branch-name>
Or undo this operation with:
git switch -
Turn off this advice by setting config variable advice.detachedHead to false
HEAD is now at ab6893ab5c0 gh-138514: getpass: restrict `echo_char` to a single ASCII character (#138591)
Switched to and reset branch 'main'
configure: WARNING: pkg-config is missing. Some dependencies may not be detected correctly.
Parser/string_parser.c:185:17: warning: 'sprintf' is deprecated: This function is provided for compatibility reasons only. Due to security concerns inherent in the design of sprintf(3), it is highly recommended that you use snprintf(3) instead. [-Wdeprecated-declarations]
sprintf(p, "\\U%08x", chr);
^
/Library/Developer/CommandLineTools/SDKs/MacOSX.sdk/usr/include/stdio.h:180:1: note: 'sprintf' has been explicitly marked deprecated here
__deprecated_msg("This function is provided for compatibility reasons only. Due to security concerns inherent in the design of sprintf(3), it is highly recommended that you use snprintf(3) instead.")
^
/Library/Developer/CommandLineTools/SDKs/MacOSX.sdk/usr/include/sys/cdefs.h:215:48: note: expanded from macro '__deprecated_msg'
#define __deprecated_msg(_msg) __attribute__((__deprecated__(_msg)))
^
1 warning generated.
Objects/bytesobject.c:290:17: warning: 'sprintf' is deprecated: This function is provided for compatibility reasons only. Due to security concerns inherent in the design of sprintf(3), it is highly recommended that you use snprintf(3) instead. [-Wdeprecated-declarations]
sprintf(buffer, "%ld", va_arg(vargs, long));
^
/Library/Developer/CommandLineTools/SDKs/MacOSX.sdk/usr/include/stdio.h:180:1: note: 'sprintf' has been explicitly marked deprecated here
__deprecated_msg("This function is provided for compatibility reasons only. Due to security concerns inherent in the design of sprintf(3), it is highly recommended that you use snprintf(3) instead.")
^
/Library/Developer/CommandLineTools/SDKs/MacOSX.sdk/usr/include/sys/cdefs.h:215:48: note: expanded from macro '__deprecated_msg'
#define __deprecated_msg(_msg) __attribute__((__deprecated__(_msg)))
^
Objects/bytesobject.c:293:17: warning: 'sprintf' is deprecated: This function is provided for compatibility reasons only. Due to security concerns inherent in the design of sprintf(3), it is highly recommended that you use snprintf(3) instead. [-Wdeprecated-declarations]
sprintf(buffer, "%zd", va_arg(vargs, Py_ssize_t));
^
/Library/Developer/CommandLineTools/SDKs/MacOSX.sdk/usr/include/stdio.h:180:1: note: 'sprintf' has been explicitly marked deprecated here
__deprecated_msg("This function is provided for compatibility reasons only. Due to security concerns inherent in the design of sprintf(3), it is highly recommended that you use snprintf(3) instead.")
^
/Library/Developer/CommandLineTools/SDKs/MacOSX.sdk/usr/include/sys/cdefs.h:215:48: note: expanded from macro '__deprecated_msg'
#define __deprecated_msg(_msg) __attribute__((__deprecated__(_msg)))
^
Objects/bytesobject.c:296:17: warning: 'sprintf' is deprecated: This function is provided for compatibility reasons only. Due to security concerns inherent in the design of sprintf(3), it is highly recommended that you use snprintf(3) instead. [-Wdeprecated-declarations]
sprintf(buffer, "%d", va_arg(vargs, int));
^
/Library/Developer/CommandLineTools/SDKs/MacOSX.sdk/usr/include/stdio.h:180:1: note: 'sprintf' has been explicitly marked deprecated here
__deprecated_msg("This function is provided for compatibility reasons only. Due to security concerns inherent in the design of sprintf(3), it is highly recommended that you use snprintf(3) instead.")
^
/Library/Developer/CommandLineTools/SDKs/MacOSX.sdk/usr/include/sys/cdefs.h:215:48: note: expanded from macro '__deprecated_msg'
#define __deprecated_msg(_msg) __attribute__((__deprecated__(_msg)))
^
Objects/bytesobject.c:304:17: warning: 'sprintf' is deprecated: This function is provided for compatibility reasons only. Due to security concerns inherent in the design of sprintf(3), it is highly recommended that you use snprintf(3) instead. [-Wdeprecated-declarations]
sprintf(buffer, "%lu", va_arg(vargs, unsigned long));
^
/Library/Developer/CommandLineTools/SDKs/MacOSX.sdk/usr/include/stdio.h:180:1: note: 'sprintf' has been explicitly marked deprecated here
__deprecated_msg("This function is provided for compatibility reasons only. Due to security concerns inherent in the design of sprintf(3), it is highly recommended that you use snprintf(3) instead.")
^
/Library/Developer/CommandLineTools/SDKs/MacOSX.sdk/usr/include/sys/cdefs.h:215:48: note: expanded from macro '__deprecated_msg'
#define __deprecated_msg(_msg) __attribute__((__deprecated__(_msg)))
^
Objects/bytesobject.c:307:17: warning: 'sprintf' is deprecated: This function is provided for compatibility reasons only. Due to security concerns inherent in the design of sprintf(3), it is highly recommended that you use snprintf(3) instead. [-Wdeprecated-declarations]
sprintf(buffer, "%zu", va_arg(vargs, size_t));
^
/Library/Developer/CommandLineTools/SDKs/MacOSX.sdk/usr/include/stdio.h:180:1: note: 'sprintf' has been explicitly marked deprecated here
__deprecated_msg("This function is provided for compatibility reasons only. Due to security concerns inherent in the design of sprintf(3), it is highly recommended that you use snprintf(3) instead.")
^
/Library/Developer/CommandLineTools/SDKs/MacOSX.sdk/usr/include/sys/cdefs.h:215:48: note: expanded from macro '__deprecated_msg'
#define __deprecated_msg(_msg) __attribute__((__deprecated__(_msg)))
^
Objects/bytesobject.c:310:17: warning: 'sprintf' is deprecated: This function is provided for compatibility reasons only. Due to security concerns inherent in the design of sprintf(3), it is highly recommended that you use snprintf(3) instead. [-Wdeprecated-declarations]
sprintf(buffer, "%u", va_arg(vargs, unsigned int));
^
/Library/Developer/CommandLineTools/SDKs/MacOSX.sdk/usr/include/stdio.h:180:1: note: 'sprintf' has been explicitly marked deprecated here
__deprecated_msg("This function is provided for compatibility reasons only. Due to security concerns inherent in the design of sprintf(3), it is highly recommended that you use snprintf(3) instead.")
^
/Library/Developer/CommandLineTools/SDKs/MacOSX.sdk/usr/include/sys/cdefs.h:215:48: note: expanded from macro '__deprecated_msg'
#define __deprecated_msg(_msg) __attribute__((__deprecated__(_msg)))
^
Objects/bytesobject.c:317:13: warning: 'sprintf' is deprecated: This function is provided for compatibility reasons only. Due to security concerns inherent in the design of sprintf(3), it is highly recommended that you use snprintf(3) instead. [-Wdeprecated-declarations]
sprintf(buffer, "%i", va_arg(vargs, int));
^
/Library/Developer/CommandLineTools/SDKs/MacOSX.sdk/usr/include/stdio.h:180:1: note: 'sprintf' has been explicitly marked deprecated here
__deprecated_msg("This function is provided for compatibility reasons only. Due to security concerns inherent in the design of sprintf(3), it is highly recommended that you use snprintf(3) instead.")
^
/Library/Developer/CommandLineTools/SDKs/MacOSX.sdk/usr/include/sys/cdefs.h:215:48: note: expanded from macro '__deprecated_msg'
#define __deprecated_msg(_msg) __attribute__((__deprecated__(_msg)))
^
Objects/bytesobject.c:323:13: warning: 'sprintf' is deprecated: This function is provided for compatibility reasons only. Due to security concerns inherent in the design of sprintf(3), it is highly recommended that you use snprintf(3) instead. [-Wdeprecated-declarations]
sprintf(buffer, "%x", va_arg(vargs, int));
^
/Library/Developer/CommandLineTools/SDKs/MacOSX.sdk/usr/include/stdio.h:180:1: note: 'sprintf' has been explicitly marked deprecated here
__deprecated_msg("This function is provided for compatibility reasons only. Due to security concerns inherent in the design of sprintf(3), it is highly recommended that you use snprintf(3) instead.")
^
/Library/Developer/CommandLineTools/SDKs/MacOSX.sdk/usr/include/sys/cdefs.h:215:48: note: expanded from macro '__deprecated_msg'
#define __deprecated_msg(_msg) __attribute__((__deprecated__(_msg)))
^
Objects/bytesobject.c:347:13: warning: 'sprintf' is deprecated: This function is provided for compatibility reasons only. Due to security concerns inherent in the design of sprintf(3), it is highly recommended that you use snprintf(3) instead. [-Wdeprecated-declarations]
sprintf(buffer, "%p", va_arg(vargs, void*));
^
/Library/Developer/CommandLineTools/SDKs/MacOSX.sdk/usr/include/stdio.h:180:1: note: 'sprintf' has been explicitly marked deprecated here
__deprecated_msg("This function is provided for compatibility reasons only. Due to security concerns inherent in the design of sprintf(3), it is highly recommended that you use snprintf(3) instead.")
^
/Library/Developer/CommandLineTools/SDKs/MacOSX.sdk/usr/include/sys/cdefs.h:215:48: note: expanded from macro '__deprecated_msg'
#define __deprecated_msg(_msg) __attribute__((__deprecated__(_msg)))
^
9 warnings generated.
Objects/typeobject.c:6883:9: warning: 'sprintf' is deprecated: This function is provided for compatibility reasons only. Due to security concerns inherent in the design of sprintf(3), it is highly recommended that you use snprintf(3) instead. [-Wdeprecated-declarations]
sprintf(msg, "type_traverse() called on non-heap type '%.100s'",
^
/Library/Developer/CommandLineTools/SDKs/MacOSX.sdk/usr/include/stdio.h:180:1: note: 'sprintf' has been explicitly marked deprecated here
__deprecated_msg("This function is provided for compatibility reasons only. Due to security concerns inherent in the design of sprintf(3), it is highly recommended that you use snprintf(3) instead.")
^
/Library/Developer/CommandLineTools/SDKs/MacOSX.sdk/usr/include/sys/cdefs.h:215:48: note: expanded from macro '__deprecated_msg'
#define __deprecated_msg(_msg) __attribute__((__deprecated__(_msg)))
^
Objects/unicodeobject.c:944:16: warning: 'sprintf' is deprecated: This function is provided for compatibility reasons only. Due to security concerns inherent in the design of sprintf(3), it is highly recommended that you use snprintf(3) instead. [-Wdeprecated-declarations]
size = sprintf(str, "&#%d;", PyUnicode_READ(kind, data, i));
^
/Library/Developer/CommandLineTools/SDKs/MacOSX.sdk/usr/include/stdio.h:180:1: note: 'sprintf' has been explicitly marked deprecated here
__deprecated_msg("This function is provided for compatibility reasons only. Due to security concerns inherent in the design of sprintf(3), it is highly recommended that you use snprintf(3) instead.")
^
/Library/Developer/CommandLineTools/SDKs/MacOSX.sdk/usr/include/sys/cdefs.h:215:48: note: expanded from macro '__deprecated_msg'
#define __deprecated_msg(_msg) __attribute__((__deprecated__(_msg)))
^
Objects/unicodeobject.c:2938:30: warning: 'sprintf' is deprecated: This function is provided for compatibility reasons only. Due to security concerns inherent in the design of sprintf(3), it is highly recommended that you use snprintf(3) instead. [-Wdeprecated-declarations]
case F_LONG: DO_SPRINTS("l", long, unsigned long); break;
^
Objects/unicodeobject.c:2929:33: note: expanded from macro 'DO_SPRINTS'
case 'o': len = SPRINT(SIZE_SPEC, "o", UNSIGNED_TYPE); break; \
^
Objects/unicodeobject.c:2924:13: note: expanded from macro 'SPRINT'
sprintf(buffer, "%" SIZE_SPEC FMT_CHAR, va_arg(*vargs, TYPE))
^
/Library/Developer/CommandLineTools/SDKs/MacOSX.sdk/usr/include/stdio.h:180:1: note: 'sprintf' has been explicitly marked deprecated here
__deprecated_msg("This function is provided for compatibility reasons only. Due to security concerns inherent in the design of sprintf(3), it is highly recommended that you use snprintf(3) instead.")
^
/Library/Developer/CommandLineTools/SDKs/MacOSX.sdk/usr/include/sys/cdefs.h:215:48: note: expanded from macro '__deprecated_msg'
#define __deprecated_msg(_msg) __attribute__((__deprecated__(_msg)))
^
Objects/unicodeobject.c:2938:30: warning: 'sprintf' is deprecated: This function is provided for compatibility reasons only. Due to security concerns inherent in the design of sprintf(3), it is highly recommended that you use snprintf(3) instead. [-Wdeprecated-declarations]
case F_LONG: DO_SPRINTS("l", long, unsigned long); break;
^
Objects/unicodeobject.c:2930:33: note: expanded from macro 'DO_SPRINTS'
case 'u': len = SPRINT(SIZE_SPEC, "u", UNSIGNED_TYPE); break; \
^
Objects/unicodeobject.c:2924:13: note: expanded from macro 'SPRINT'
sprintf(buffer, "%" SIZE_SPEC FMT_CHAR, va_arg(*vargs, TYPE))
^
/Library/Developer/CommandLineTools/SDKs/MacOSX.sdk/usr/include/stdio.h:180:1: note: 'sprintf' has been explicitly marked deprecated here
__deprecated_msg("This function is provided for compatibility reasons only. Due to security concerns inherent in the design of sprintf(3), it is highly recommended that you use snprintf(3) instead.")
^
/Library/Developer/CommandLineTools/SDKs/MacOSX.sdk/usr/include/sys/cdefs.h:215:48: note: expanded from macro '__deprecated_msg'
#define __deprecated_msg(_msg) __attribute__((__deprecated__(_msg)))
^
Objects/unicodeobject.c:2938:30: warning: 'sprintf' is deprecated: This function is provided for compatibility reasons only. Due to security concerns inherent in the design of sprintf(3), it is highly recommended that you use snprintf(3) instead. [-Wdeprecated-declarations]
case F_LONG: DO_SPRINTS("l", long, unsigned long); break;
^
Objects/unicodeobject.c:2931:33: note: expanded from macro 'DO_SPRINTS'
case 'x': len = SPRINT(SIZE_SPEC, "x", UNSIGNED_TYPE); break; \
^
Objects/unicodeobject.c:2924:13: note: expanded from macro 'SPRINT'
sprintf(buffer, "%" SIZE_SPEC FMT_CHAR, va_arg(*vargs, TYPE))
^
/Library/Developer/CommandLineTools/SDKs/MacOSX.sdk/usr/include/stdio.h:180:1: note: 'sprintf' has been explicitly marked deprecated here
__deprecated_msg("This function is provided for compatibility reasons only. Due to security concerns inherent in the design of sprintf(3), it is highly recommended that you use snprintf(3) instead.")
^
/Library/Developer/CommandLineTools/SDKs/MacOSX.sdk/usr/include/sys/cdefs.h:215:48: note: expanded from macro '__deprecated_msg'
#define __deprecated_msg(_msg) __attribute__((__deprecated__(_msg)))
^
Objects/unicodeobject.c:2938:30: warning: 'sprintf' is deprecated: This function is provided for compatibility reasons only. Due to security concerns inherent in the design of sprintf(3), it is highly recommended that you use snprintf(3) instead. [-Wdeprecated-declarations]
case F_LONG: DO_SPRINTS("l", long, unsigned long); break;
^
Objects/unicodeobject.c:2932:33: note: expanded from macro 'DO_SPRINTS'
case 'X': len = SPRINT(SIZE_SPEC, "X", UNSIGNED_TYPE); break; \
^
Objects/unicodeobject.c:2924:13: note: expanded from macro 'SPRINT'
sprintf(buffer, "%" SIZE_SPEC FMT_CHAR, va_arg(*vargs, TYPE))
^
/Library/Developer/CommandLineTools/SDKs/MacOSX.sdk/usr/include/stdio.h:180:1: note: 'sprintf' has been explicitly marked deprecated here
__deprecated_msg("This function is provided for compatibility reasons only. Due to security concerns inherent in the design of sprintf(3), it is highly recommended that you use snprintf(3) instead.")
^
/Library/Developer/CommandLineTools/SDKs/MacOSX.sdk/usr/include/sys/cdefs.h:215:48: note: expanded from macro '__deprecated_msg'
#define __deprecated_msg(_msg) __attribute__((__deprecated__(_msg)))
^
Objects/unicodeobject.c:2938:30: warning: 'sprintf' is deprecated: This function is provided for compatibility reasons only. Due to security concerns inherent in the design of sprintf(3), it is highly recommended that you use snprintf(3) instead. [-Wdeprecated-declarations]
case F_LONG: DO_SPRINTS("l", long, unsigned long); break;
^
Objects/unicodeobject.c:2933:33: note: expanded from macro 'DO_SPRINTS'
default: len = SPRINT(SIZE_SPEC, "d", SIGNED_TYPE); break; \
^
Objects/unicodeobject.c:2924:13: note: expanded from macro 'SPRINT'
sprintf(buffer, "%" SIZE_SPEC FMT_CHAR, va_arg(*vargs, TYPE))
^
/Library/Developer/CommandLineTools/SDKs/MacOSX.sdk/usr/include/stdio.h:180:1: note: 'sprintf' has been explicitly marked deprecated here
__deprecated_msg("This function is provided for compatibility reasons only. Due to security concerns inherent in the design of sprintf(3), it is highly recommended that you use snprintf(3) instead.")
^
/Library/Developer/CommandLineTools/SDKs/MacOSX.sdk/usr/include/sys/cdefs.h:215:48: note: expanded from macro '__deprecated_msg'
#define __deprecated_msg(_msg) __attribute__((__deprecated__(_msg)))
^
Objects/unicodeobject.c:2939:30: warning: 'sprintf' is deprecated: This function is provided for compatibility reasons only. Due to security concerns inherent in the design of sprintf(3), it is highly recommended that you use snprintf(3) instead. [-Wdeprecated-declarations]
case F_LONGLONG: DO_SPRINTS("ll", long long, unsigned long long); break;
^
Objects/unicodeobject.c:2929:33: note: expanded from macro 'DO_SPRINTS'
case 'o': len = SPRINT(SIZE_SPEC, "o", UNSIGNED_TYPE); break; \
^
Objects/unicodeobject.c:2924:13: note: expanded from macro 'SPRINT'
sprintf(buffer, "%" SIZE_SPEC FMT_CHAR, va_arg(*vargs, TYPE))
^
/Library/Developer/CommandLineTools/SDKs/MacOSX.sdk/usr/include/stdio.h:180:1: note: 'sprintf' has been explicitly marked deprecated here
__deprecated_msg("This function is provided for compatibility reasons only. Due to security concerns inherent in the design of sprintf(3), it is highly recommended that you use snprintf(3) instead.")
^
/Library/Developer/CommandLineTools/SDKs/MacOSX.sdk/usr/include/sys/cdefs.h:215:48: note: expanded from macro '__deprecated_msg'
#define __deprecated_msg(_msg) __attribute__((__deprecated__(_msg)))
^
Objects/unicodeobject.c:2939:30: warning: 'sprintf' is deprecated: This function is provided for compatibility reasons only. Due to security concerns inherent in the design of sprintf(3), it is highly recommended that you use snprintf(3) instead. [-Wdeprecated-declarations]
case F_LONGLONG: DO_SPRINTS("ll", long long, unsigned long long); break;
^
Objects/unicodeobject.c:2930:33: note: expanded from macro 'DO_SPRINTS'
case 'u': len = SPRINT(SIZE_SPEC, "u", UNSIGNED_TYPE); break; \
^
Objects/unicodeobject.c:2924:13: note: expanded from macro 'SPRINT'
sprintf(buffer, "%" SIZE_SPEC FMT_CHAR, va_arg(*vargs, TYPE))
^
/Library/Developer/CommandLineTools/SDKs/MacOSX.sdk/usr/include/stdio.h:180:1: note: 'sprintf' has been explicitly marked deprecated here
__deprecated_msg("This function is provided for compatibility reasons only. Due to security concerns inherent in the design of sprintf(3), it is highly recommended that you use snprintf(3) instead.")
^
/Library/Developer/CommandLineTools/SDKs/MacOSX.sdk/usr/include/sys/cdefs.h:215:48: note: expanded from macro '__deprecated_msg'
#define __deprecated_msg(_msg) __attribute__((__deprecated__(_msg)))
^
Objects/unicodeobject.c:2939:30: warning: 'sprintf' is deprecated: This function is provided for compatibility reasons only. Due to security concerns inherent in the design of sprintf(3), it is highly recommended that you use snprintf(3) instead. [-Wdeprecated-declarations]
case F_LONGLONG: DO_SPRINTS("ll", long long, unsigned long long); break;
^
Objects/unicodeobject.c:2931:33: note: expanded from macro 'DO_SPRINTS'
case 'x': len = SPRINT(SIZE_SPEC, "x", UNSIGNED_TYPE); break; \
^
Objects/unicodeobject.c:2924:13: note: expanded from macro 'SPRINT'
sprintf(buffer, "%" SIZE_SPEC FMT_CHAR, va_arg(*vargs, TYPE))
^
/Library/Developer/CommandLineTools/SDKs/MacOSX.sdk/usr/include/stdio.h:180:1: note: 'sprintf' has been explicitly marked deprecated here
__deprecated_msg("This function is provided for compatibility reasons only. Due to security concerns inherent in the design of sprintf(3), it is highly recommended that you use snprintf(3) instead.")
^
/Library/Developer/CommandLineTools/SDKs/MacOSX.sdk/usr/include/sys/cdefs.h:215:48: note: expanded from macro '__deprecated_msg'
#define __deprecated_msg(_msg) __attribute__((__deprecated__(_msg)))
^
Objects/unicodeobject.c:2939:30: warning: 'sprintf' is deprecated: This function is provided for compatibility reasons only. Due to security concerns inherent in the design of sprintf(3), it is highly recommended that you use snprintf(3) instead. [-Wdeprecated-declarations]
case F_LONGLONG: DO_SPRINTS("ll", long long, unsigned long long); break;
^
Objects/unicodeobject.c:2932:33: note: expanded from macro 'DO_SPRINTS'
case 'X': len = SPRINT(SIZE_SPEC, "X", UNSIGNED_TYPE); break; \
^
Objects/unicodeobject.c:2924:13: note: expanded from macro 'SPRINT'
sprintf(buffer, "%" SIZE_SPEC FMT_CHAR, va_arg(*vargs, TYPE))
^
/Library/Developer/CommandLineTools/SDKs/MacOSX.sdk/usr/include/stdio.h:180:1: note: 'sprintf' has been explicitly marked deprecated here
__deprecated_msg("This function is provided for compatibility reasons only. Due to security concerns inherent in the design of sprintf(3), it is highly recommended that you use snprintf(3) instead.")
^
/Library/Developer/CommandLineTools/SDKs/MacOSX.sdk/usr/include/sys/cdefs.h:215:48: note: expanded from macro '__deprecated_msg'
#define __deprecated_msg(_msg) __attribute__((__deprecated__(_msg)))
^
Objects/unicodeobject.c:2939:30: warning: 'sprintf' is deprecated: This function is provided for compatibility reasons only. Due to security concerns inherent in the design of sprintf(3), it is highly recommended that you use snprintf(3) instead. [-Wdeprecated-declarations]
case F_LONGLONG: DO_SPRINTS("ll", long long, unsigned long long); break;
^
Objects/unicodeobject.c:2933:33: note: expanded from macro 'DO_SPRINTS'
default: len = SPRINT(SIZE_SPEC, "d", SIGNED_TYPE); break; \
^
Objects/unicodeobject.c:2924:13: note: expanded from macro 'SPRINT'
sprintf(buffer, "%" SIZE_SPEC FMT_CHAR, va_arg(*vargs, TYPE))
^
/Library/Developer/CommandLineTools/SDKs/MacOSX.sdk/usr/include/stdio.h:180:1: note: 'sprintf' has been explicitly marked deprecated here
__deprecated_msg("This function is provided for compatibility reasons only. Due to security concerns inherent in the design of sprintf(3), it is highly recommended that you use snprintf(3) instead.")
^
/Library/Developer/CommandLineTools/SDKs/MacOSX.sdk/usr/include/sys/cdefs.h:215:48: note: expanded from macro '__deprecated_msg'
#define __deprecated_msg(_msg) __attribute__((__deprecated__(_msg)))
^
Objects/unicodeobject.c:2940:30: warning: 'sprintf' is deprecated: This function is provided for compatibility reasons only. Due to security concerns inherent in the design of sprintf(3), it is highly recommended that you use snprintf(3) instead. [-Wdeprecated-declarations]
case F_SIZE: DO_SPRINTS("z", Py_ssize_t, size_t); break;
^
Objects/unicodeobject.c:2929:33: note: expanded from macro 'DO_SPRINTS'
case 'o': len = SPRINT(SIZE_SPEC, "o", UNSIGNED_TYPE); break; \
^
Objects/unicodeobject.c:2924:13: note: expanded from macro 'SPRINT'
sprintf(buffer, "%" SIZE_SPEC FMT_CHAR, va_arg(*vargs, TYPE))
^
/Library/Developer/CommandLineTools/SDKs/MacOSX.sdk/usr/include/stdio.h:180:1: note: 'sprintf' has been explicitly marked deprecated here
__deprecated_msg("This function is provided for compatibility reasons only. Due to security concerns inherent in the design of sprintf(3), it is highly recommended that you use snprintf(3) instead.")
^
/Library/Developer/CommandLineTools/SDKs/MacOSX.sdk/usr/include/sys/cdefs.h:215:48: note: expanded from macro '__deprecated_msg'
#define __deprecated_msg(_msg) __attribute__((__deprecated__(_msg)))
^
Objects/unicodeobject.c:2940:30: warning: 'sprintf' is deprecated: This function is provided for compatibility reasons only. Due to security concerns inherent in the design of sprintf(3), it is highly recommended that you use snprintf(3) instead. [-Wdeprecated-declarations]
case F_SIZE: DO_SPRINTS("z", Py_ssize_t, size_t); break;
^
Objects/unicodeobject.c:2930:33: note: expanded from macro 'DO_SPRINTS'
case 'u': len = SPRINT(SIZE_SPEC, "u", UNSIGNED_TYPE); break; \
^
Objects/unicodeobject.c:2924:13: note: expanded from macro 'SPRINT'
sprintf(buffer, "%" SIZE_SPEC FMT_CHAR, va_arg(*vargs, TYPE))
^
/Library/Developer/CommandLineTools/SDKs/MacOSX.sdk/usr/include/stdio.h:180:1: note: 'sprintf' has been explicitly marked deprecated here
__deprecated_msg("This function is provided for compatibility reasons only. Due to security concerns inherent in the design of sprintf(3), it is highly recommended that you use snprintf(3) instead.")
^
/Library/Developer/CommandLineTools/SDKs/MacOSX.sdk/usr/include/sys/cdefs.h:215:48: note: expanded from macro '__deprecated_msg'
#define __deprecated_msg(_msg) __attribute__((__deprecated__(_msg)))
^
Objects/unicodeobject.c:2940:30: warning: 'sprintf' is deprecated: This function is provided for compatibility reasons only. Due to security concerns inherent in the design of sprintf(3), it is highly recommended that you use snprintf(3) instead. [-Wdeprecated-declarations]
case F_SIZE: DO_SPRINTS("z", Py_ssize_t, size_t); break;
^
Objects/unicodeobject.c:2931:33: note: expanded from macro 'DO_SPRINTS'
case 'x': len = SPRINT(SIZE_SPEC, "x", UNSIGNED_TYPE); break; \
^
Objects/unicodeobject.c:2924:13: note: expanded from macro 'SPRINT'
sprintf(buffer, "%" SIZE_SPEC FMT_CHAR, va_arg(*vargs, TYPE))
^
/Library/Developer/CommandLineTools/SDKs/MacOSX.sdk/usr/include/stdio.h:180:1: note: 'sprintf' has been explicitly marked deprecated here
__deprecated_msg("This function is provided for compatibility reasons only. Due to security concerns inherent in the design of sprintf(3), it is highly recommended that you use snprintf(3) instead.")
^
/Library/Developer/CommandLineTools/SDKs/MacOSX.sdk/usr/include/sys/cdefs.h:215:48: note: expanded from macro '__deprecated_msg'
#define __deprecated_msg(_msg) __attribute__((__deprecated__(_msg)))
^
Objects/unicodeobject.c:2940:30: warning: 'sprintf' is deprecated: This function is provided for compatibility reasons only. Due to security concerns inherent in the design of sprintf(3), it is highly recommended that you use snprintf(3) instead. [-Wdeprecated-declarations]
case F_SIZE: DO_SPRINTS("z", Py_ssize_t, size_t); break;
^
Objects/unicodeobject.c:2932:33: note: expanded from macro 'DO_SPRINTS'
case 'X': len = SPRINT(SIZE_SPEC, "X", UNSIGNED_TYPE); break; \
^
Objects/unicodeobject.c:2924:13: note: expanded from macro 'SPRINT'
sprintf(buffer, "%" SIZE_SPEC FMT_CHAR, va_arg(*vargs, TYPE))
^
/Library/Developer/CommandLineTools/SDKs/MacOSX.sdk/usr/include/stdio.h:180:1: note: 'sprintf' has been explicitly marked deprecated here
__deprecated_msg("This function is provided for compatibility reasons only. Due to security concerns inherent in the design of sprintf(3), it is highly recommended that you use snprintf(3) instead.")
^
/Library/Developer/CommandLineTools/SDKs/MacOSX.sdk/usr/include/sys/cdefs.h:215:48: note: expanded from macro '__deprecated_msg'
#define __deprecated_msg(_msg) __attribute__((__deprecated__(_msg)))
^
Objects/unicodeobject.c:2940:30: warning: 'sprintf' is deprecated: This function is provided for compatibility reasons only. Due to security concerns inherent in the design of sprintf(3), it is highly recommended that you use snprintf(3) instead. [-Wdeprecated-declarations]
case F_SIZE: DO_SPRINTS("z", Py_ssize_t, size_t); break;
^
Objects/unicodeobject.c:2933:33: note: expanded from macro 'DO_SPRINTS'
default: len = SPRINT(SIZE_SPEC, "d", SIGNED_TYPE); break; \
^
Objects/unicodeobject.c:2924:13: note: expanded from macro 'SPRINT'
sprintf(buffer, "%" SIZE_SPEC FMT_CHAR, va_arg(*vargs, TYPE))
^
/Library/Developer/CommandLineTools/SDKs/MacOSX.sdk/usr/include/stdio.h:180:1: note: 'sprintf' has been explicitly marked deprecated here
__deprecated_msg("This function is provided for compatibility reasons only. Due to security concerns inherent in the design of sprintf(3), it is highly recommended that you use snprintf(3) instead.")
^
/Library/Developer/CommandLineTools/SDKs/MacOSX.sdk/usr/include/sys/cdefs.h:215:48: note: expanded from macro '__deprecated_msg'
#define __deprecated_msg(_msg) __attribute__((__deprecated__(_msg)))
^
Objects/unicodeobject.c:2941:30: warning: 'sprintf' is deprecated: This function is provided for compatibility reasons only. Due to security concerns inherent in the design of sprintf(3), it is highly recommended that you use snprintf(3) instead. [-Wdeprecated-declarations]
case F_PTRDIFF: DO_SPRINTS("t", ptrdiff_t, ptrdiff_t); break;
^
Objects/unicodeobject.c:2929:33: note: expanded from macro 'DO_SPRINTS'
case 'o': len = SPRINT(SIZE_SPEC, "o", UNSIGNED_TYPE); break; \
^
Objects/unicodeobject.c:2924:13: note: expanded from macro 'SPRINT'
sprintf(buffer, "%" SIZE_SPEC FMT_CHAR, va_arg(*vargs, TYPE))
^
/Library/Developer/CommandLineTools/SDKs/MacOSX.sdk/usr/include/stdio.h:180:1: note: 'sprintf' has been explicitly marked deprecated here
__deprecated_msg("This function is provided for compatibility reasons only. Due to security concerns inherent in the design of sprintf(3), it is highly recommended that you use snprintf(3) instead.")
^
/Library/Developer/CommandLineTools/SDKs/MacOSX.sdk/usr/include/sys/cdefs.h:215:48: note: expanded from macro '__deprecated_msg'
#define __deprecated_msg(_msg) __attribute__((__deprecated__(_msg)))
^
Objects/unicodeobject.c:2941:30: warning: 'sprintf' is deprecated: This function is provided for compatibility reasons only. Due to security concerns inherent in the design of sprintf(3), it is highly recommended that you use snprintf(3) instead. [-Wdeprecated-declarations]
case F_PTRDIFF: DO_SPRINTS("t", ptrdiff_t, ptrdiff_t); break;
^
Objects/unicodeobject.c:2930:33: note: expanded from macro 'DO_SPRINTS'
case 'u': len = SPRINT(SIZE_SPEC, "u", UNSIGNED_TYPE); break; \
^
Objects/unicodeobject.c:2924:13: note: expanded from macro 'SPRINT'
sprintf(buffer, "%" SIZE_SPEC FMT_CHAR, va_arg(*vargs, TYPE))
^
/Library/Developer/CommandLineTools/SDKs/MacOSX.sdk/usr/include/stdio.h:180:1: note: 'sprintf' has been explicitly marked deprecated here
__deprecated_msg("This function is provided for compatibility reasons only. Due to security concerns inherent in the design of sprintf(3), it is highly recommended that you use snprintf(3) instead.")
^
/Library/Developer/CommandLineTools/SDKs/MacOSX.sdk/usr/include/sys/cdefs.h:215:48: note: expanded from macro '__deprecated_msg'
#define __deprecated_msg(_msg) __attribute__((__deprecated__(_msg)))
^
Objects/unicodeobject.c:2941:30: warning: 'sprintf' is deprecated: This function is provided for compatibility reasons only. Due to security concerns inherent in the design of sprintf(3), it is highly recommended that you use snprintf(3) instead. [-Wdeprecated-declarations]
case F_PTRDIFF: DO_SPRINTS("t", ptrdiff_t, ptrdiff_t); break;
^
Objects/unicodeobject.c:2931:33: note: expanded from macro 'DO_SPRINTS'
case 'x': len = SPRINT(SIZE_SPEC, "x", UNSIGNED_TYPE); break; \
^
Objects/unicodeobject.c:2924:13: note: expanded from macro 'SPRINT'
sprintf(buffer, "%" SIZE_SPEC FMT_CHAR, va_arg(*vargs, TYPE))
^
/Library/Developer/CommandLineTools/SDKs/MacOSX.sdk/usr/include/stdio.h:180:1: note: 'sprintf' has been explicitly marked deprecated here
__deprecated_msg("This function is provided for compatibility reasons only. Due to security concerns inherent in the design of sprintf(3), it is highly recommended that you use snprintf(3) instead.")
^
/Library/Developer/CommandLineTools/SDKs/MacOSX.sdk/usr/include/sys/cdefs.h:215:48: note: expanded from macro '__deprecated_msg'
#define __deprecated_msg(_msg) __attribute__((__deprecated__(_msg)))
^
Objects/unicodeobject.c:2941:30: warning: 'sprintf' is deprecated: This function is provided for compatibility reasons only. Due to security concerns inherent in the design of sprintf(3), it is highly recommended that you use snprintf(3) instead. [-Wdeprecated-declarations]
case F_PTRDIFF: DO_SPRINTS("t", ptrdiff_t, ptrdiff_t); break;
^
Objects/unicodeobject.c:2932:33: note: expanded from macro 'DO_SPRINTS'
case 'X': len = SPRINT(SIZE_SPEC, "X", UNSIGNED_TYPE); break; \
^
Objects/unicodeobject.c:2924:13: note: expanded from macro 'SPRINT'
sprintf(buffer, "%" SIZE_SPEC FMT_CHAR, va_arg(*vargs, TYPE))
^
/Library/Developer/CommandLineTools/SDKs/MacOSX.sdk/usr/include/stdio.h:180:1: note: 'sprintf' has been explicitly marked deprecated here
__deprecated_msg("This function is provided for compatibility reasons only. Due to security concerns inherent in the design of sprintf(3), it is highly recommended that you use snprintf(3) instead.")
^
/Library/Developer/CommandLineTools/SDKs/MacOSX.sdk/usr/include/sys/cdefs.h:215:48: note: expanded from macro '__deprecated_msg'
#define __deprecated_msg(_msg) __attribute__((__deprecated__(_msg)))
^
Objects/unicodeobject.c:2941:30: warning: 'sprintf' is deprecated: This function is provided for compatibility reasons only. Due to security concerns inherent in the design of sprintf(3), it is highly recommended that you use snprintf(3) instead. [-Wdeprecated-declarations]
case F_PTRDIFF: DO_SPRINTS("t", ptrdiff_t, ptrdiff_t); break;
^
Objects/unicodeobject.c:2933:33: note: expanded from macro 'DO_SPRINTS'
default: len = SPRINT(SIZE_SPEC, "d", SIGNED_TYPE); break; \
^
Objects/unicodeobject.c:2924:13: note: expanded from macro 'SPRINT'
sprintf(buffer, "%" SIZE_SPEC FMT_CHAR, va_arg(*vargs, TYPE))
^
/Library/Developer/CommandLineTools/SDKs/MacOSX.sdk/usr/include/stdio.h:180:1: note: 'sprintf' has been explicitly marked deprecated here
__deprecated_msg("This function is provided for compatibility reasons only. Due to security concerns inherent in the design of sprintf(3), it is highly recommended that you use snprintf(3) instead.")
^
/Library/Developer/CommandLineTools/SDKs/MacOSX.sdk/usr/include/sys/cdefs.h:215:48: note: expanded from macro '__deprecated_msg'
#define __deprecated_msg(_msg) __attribute__((__deprecated__(_msg)))
^
Objects/unicodeobject.c:2942:30: warning: 'sprintf' is deprecated: This function is provided for compatibility reasons only. Due to security concerns inherent in the design of sprintf(3), it is highly recommended that you use snprintf(3) instead. [-Wdeprecated-declarations]
case F_INTMAX: DO_SPRINTS("j", intmax_t, uintmax_t); break;
^
Objects/unicodeobject.c:2929:33: note: expanded from macro 'DO_SPRINTS'
case 'o': len = SPRINT(SIZE_SPEC, "o", UNSIGNED_TYPE); break; \
^
Objects/unicodeobject.c:2924:13: note: expanded from macro 'SPRINT'
sprintf(buffer, "%" SIZE_SPEC FMT_CHAR, va_arg(*vargs, TYPE))
^
/Library/Developer/CommandLineTools/SDKs/MacOSX.sdk/usr/include/stdio.h:180:1: note: 'sprintf' has been explicitly marked deprecated here
__deprecated_msg("This function is provided for compatibility reasons only. Due to security concerns inherent in the design of sprintf(3), it is highly recommended that you use snprintf(3) instead.")
^
/Library/Developer/CommandLineTools/SDKs/MacOSX.sdk/usr/include/sys/cdefs.h:215:48: note: expanded from macro '__deprecated_msg'
#define __deprecated_msg(_msg) __attribute__((__deprecated__(_msg)))
^
Objects/unicodeobject.c:2942:30: warning: 'sprintf' is deprecated: This function is provided for compatibility reasons only. Due to security concerns inherent in the design of sprintf(3), it is highly recommended that you use snprintf(3) instead. [-Wdeprecated-declarations]
case F_INTMAX: DO_SPRINTS("j", intmax_t, uintmax_t); break;
^
Objects/unicodeobject.c:2930:33: note: expanded from macro 'DO_SPRINTS'
case 'u': len = SPRINT(SIZE_SPEC, "u", UNSIGNED_TYPE); break; \
^
Objects/unicodeobject.c:2924:13: note: expanded from macro 'SPRINT'
sprintf(buffer, "%" SIZE_SPEC FMT_CHAR, va_arg(*vargs, TYPE))
^
/Library/Developer/CommandLineTools/SDKs/MacOSX.sdk/usr/include/stdio.h:180:1: note: 'sprintf' has been explicitly marked deprecated here
__deprecated_msg("This function is provided for compatibility reasons only. Due to security concerns inherent in the design of sprintf(3), it is highly recommended that you use snprintf(3) instead.")
^
/Library/Developer/CommandLineTools/SDKs/MacOSX.sdk/usr/include/sys/cdefs.h:215:48: note: expanded from macro '__deprecated_msg'
#define __deprecated_msg(_msg) __attribute__((__deprecated__(_msg)))
^
Objects/unicodeobject.c:2942:30: warning: 'sprintf' is deprecated: This function is provided for compatibility reasons only. Due to security concerns inherent in the design of sprintf(3), it is highly recommended that you use snprintf(3) instead. [-Wdeprecated-declarations]
case F_INTMAX: DO_SPRINTS("j", intmax_t, uintmax_t); break;
^
Objects/unicodeobject.c:2931:33: note: expanded from macro 'DO_SPRINTS'
case 'x': len = SPRINT(SIZE_SPEC, "x", UNSIGNED_TYPE); break; \
^
Objects/unicodeobject.c:2924:13: note: expanded from macro 'SPRINT'
sprintf(buffer, "%" SIZE_SPEC FMT_CHAR, va_arg(*vargs, TYPE))
^
/Library/Developer/CommandLineTools/SDKs/MacOSX.sdk/usr/include/stdio.h:180:1: note: 'sprintf' has been explicitly marked deprecated here
__deprecated_msg("This function is provided for compatibility reasons only. Due to security concerns inherent in the design of sprintf(3), it is highly recommended that you use snprintf(3) instead.")
^
/Library/Developer/CommandLineTools/SDKs/MacOSX.sdk/usr/include/sys/cdefs.h:215:48: note: expanded from macro '__deprecated_msg'
#define __deprecated_msg(_msg) __attribute__((__deprecated__(_msg)))
^
Objects/unicodeobject.c:2942:30: warning: 'sprintf' is deprecated: This function is provided for compatibility reasons only. Due to security concerns inherent in the design of sprintf(3), it is highly recommended that you use snprintf(3) instead. [-Wdeprecated-declarations]
case F_INTMAX: DO_SPRINTS("j", intmax_t, uintmax_t); break;
^
Objects/unicodeobject.c:2932:33: note: expanded from macro 'DO_SPRINTS'
case 'X': len = SPRINT(SIZE_SPEC, "X", UNSIGNED_TYPE); break; \
^
Objects/unicodeobject.c:2924:13: note: expanded from macro 'SPRINT'
sprintf(buffer, "%" SIZE_SPEC FMT_CHAR, va_arg(*vargs, TYPE))
^
/Library/Developer/CommandLineTools/SDKs/MacOSX.sdk/usr/include/stdio.h:180:1: note: 'sprintf' has been explicitly marked deprecated here
__deprecated_msg("This function is provided for compatibility reasons only. Due to security concerns inherent in the design of sprintf(3), it is highly recommended that you use snprintf(3) instead.")
^
/Library/Developer/CommandLineTools/SDKs/MacOSX.sdk/usr/include/sys/cdefs.h:215:48: note: expanded from macro '__deprecated_msg'
#define __deprecated_msg(_msg) __attribute__((__deprecated__(_msg)))
^
Objects/unicodeobject.c:2942:30: warning: 'sprintf' is deprecated: This function is provided for compatibility reasons only. Due to security concerns inherent in the design of sprintf(3), it is highly recommended that you use snprintf(3) instead. [-Wdeprecated-declarations]
case F_INTMAX: DO_SPRINTS("j", intmax_t, uintmax_t); break;
^
Objects/unicodeobject.c:2933:33: note: expanded from macro 'DO_SPRINTS'
default: len = SPRINT(SIZE_SPEC, "d", SIGNED_TYPE); break; \
^
Objects/unicodeobject.c:2924:13: note: expanded from macro 'SPRINT'
sprintf(buffer, "%" SIZE_SPEC FMT_CHAR, va_arg(*vargs, TYPE))
^
/Library/Developer/CommandLineTools/SDKs/MacOSX.sdk/usr/include/stdio.h:180:1: note: 'sprintf' has been explicitly marked deprecated here
__deprecated_msg("This function is provided for compatibility reasons only. Due to security concerns inherent in the design of sprintf(3), it is highly recommended that you use snprintf(3) instead.")
^
/Library/Developer/CommandLineTools/SDKs/MacOSX.sdk/usr/include/sys/cdefs.h:215:48: note: expanded from macro '__deprecated_msg'
#define __deprecated_msg(_msg) __attribute__((__deprecated__(_msg)))
^
Objects/unicodeobject.c:2943:30: warning: 'sprintf' is deprecated: This function is provided for compatibility reasons only. Due to security concerns inherent in the design of sprintf(3), it is highly recommended that you use snprintf(3) instead. [-Wdeprecated-declarations]
default: DO_SPRINTS("", int, unsigned int); break;
^
Objects/unicodeobject.c:2929:33: note: expanded from macro 'DO_SPRINTS'
case 'o': len = SPRINT(SIZE_SPEC, "o", UNSIGNED_TYPE); break; \
^
Objects/unicodeobject.c:2924:13: note: expanded from macro 'SPRINT'
sprintf(buffer, "%" SIZE_SPEC FMT_CHAR, va_arg(*vargs, TYPE))
^
/Library/Developer/CommandLineTools/SDKs/MacOSX.sdk/usr/include/stdio.h:180:1: note: 'sprintf' has been explicitly marked deprecated here
__deprecated_msg("This function is provided for compatibility reasons only. Due to security concerns inherent in the design of sprintf(3), it is highly recommended that you use snprintf(3) instead.")
^
/Library/Developer/CommandLineTools/SDKs/MacOSX.sdk/usr/include/sys/cdefs.h:215:48: note: expanded from macro '__deprecated_msg'
#define __deprecated_msg(_msg) __attribute__((__deprecated__(_msg)))
^
Objects/unicodeobject.c:2943:30: warning: 'sprintf' is deprecated: This function is provided for compatibility reasons only. Due to security concerns inherent in the design of sprintf(3), it is highly recommended that you use snprintf(3) instead. [-Wdeprecated-declarations]
default: DO_SPRINTS("", int, unsigned int); break;
^
Objects/unicodeobject.c:2930:33: note: expanded from macro 'DO_SPRINTS'
case 'u': len = SPRINT(SIZE_SPEC, "u", UNSIGNED_TYPE); break; \
^
Objects/unicodeobject.c:2924:13: note: expanded from macro 'SPRINT'
sprintf(buffer, "%" SIZE_SPEC FMT_CHAR, va_arg(*vargs, TYPE))
^
/Library/Developer/CommandLineTools/SDKs/MacOSX.sdk/usr/include/stdio.h:180:1: note: 'sprintf' has been explicitly marked deprecated here
__deprecated_msg("This function is provided for compatibility reasons only. Due to security concerns inherent in the design of sprintf(3), it is highly recommended that you use snprintf(3) instead.")
^
/Library/Developer/CommandLineTools/SDKs/MacOSX.sdk/usr/include/sys/cdefs.h:215:48: note: expanded from macro '__deprecated_msg'
#define __deprecated_msg(_msg) __attribute__((__deprecated__(_msg)))
^
Objects/unicodeobject.c:2943:30: warning: 'sprintf' is deprecated: This function is provided for compatibility reasons only. Due to security concerns inherent in the design of sprintf(3), it is highly recommended that you use snprintf(3) instead. [-Wdeprecated-declarations]
default: DO_SPRINTS("", int, unsigned int); break;
^
Objects/unicodeobject.c:2931:33: note: expanded from macro 'DO_SPRINTS'
case 'x': len = SPRINT(SIZE_SPEC, "x", UNSIGNED_TYPE); break; \
^
Objects/unicodeobject.c:2924:13: note: expanded from macro 'SPRINT'
sprintf(buffer, "%" SIZE_SPEC FMT_CHAR, va_arg(*vargs, TYPE))
^
/Library/Developer/CommandLineTools/SDKs/MacOSX.sdk/usr/include/stdio.h:180:1: note: 'sprintf' has been explicitly marked deprecated here
__deprecated_msg("This function is provided for compatibility reasons only. Due to security concerns inherent in the design of sprintf(3), it is highly recommended that you use snprintf(3) instead.")
^
/Library/Developer/CommandLineTools/SDKs/MacOSX.sdk/usr/include/sys/cdefs.h:215:48: note: expanded from macro '__deprecated_msg'
#define __deprecated_msg(_msg) __attribute__((__deprecated__(_msg)))
^
Objects/unicodeobject.c:2943:30: warning: 'sprintf' is deprecated: This function is provided for compatibility reasons only. Due to security concerns inherent in the design of sprintf(3), it is highly recommended that you use snprintf(3) instead. [-Wdeprecated-declarations]
default: DO_SPRINTS("", int, unsigned int); break;
^
Objects/unicodeobject.c:2932:33: note: expanded from macro 'DO_SPRINTS'
case 'X': len = SPRINT(SIZE_SPEC, "X", UNSIGNED_TYPE); break; \
^
Objects/unicodeobject.c:2924:13: note: expanded from macro 'SPRINT'
sprintf(buffer, "%" SIZE_SPEC FMT_CHAR, va_arg(*vargs, TYPE))
^
/Library/Developer/CommandLineTools/SDKs/MacOSX.sdk/usr/include/stdio.h:180:1: note: 'sprintf' has been explicitly marked deprecated here
__deprecated_msg("This function is provided for compatibility reasons only. Due to security concerns inherent in the design of sprintf(3), it is highly recommended that you use snprintf(3) instead.")
^
/Library/Developer/CommandLineTools/SDKs/MacOSX.sdk/usr/include/sys/cdefs.h:215:48: note: expanded from macro '__deprecated_msg'
#define __deprecated_msg(_msg) __attribute__((__deprecated__(_msg)))
^
Objects/unicodeobject.c:2943:30: warning: 'sprintf' is deprecated: This function is provided for compatibility reasons only. Due to security concerns inherent in the design of sprintf(3), it is highly recommended that you use snprintf(3) instead. [-Wdeprecated-declarations]
default: DO_SPRINTS("", int, unsigned int); break;
^
Objects/unicodeobject.c:2933:33: note: expanded from macro 'DO_SPRINTS'
default: len = SPRINT(SIZE_SPEC, "d", SIGNED_TYPE); break; \
^
Objects/unicodeobject.c:2924:13: note: expanded from macro 'SPRINT'
sprintf(buffer, "%" SIZE_SPEC FMT_CHAR, va_arg(*vargs, TYPE))
^
/Library/Developer/CommandLineTools/SDKs/MacOSX.sdk/usr/include/stdio.h:180:1: note: 'sprintf' has been explicitly marked deprecated here
__deprecated_msg("This function is provided for compatibility reasons only. Due to security concerns inherent in the design of sprintf(3), it is highly recommended that you use snprintf(3) instead.")
^
/Library/Developer/CommandLineTools/SDKs/MacOSX.sdk/usr/include/sys/cdefs.h:215:48: note: expanded from macro '__deprecated_msg'
#define __deprecated_msg(_msg) __attribute__((__deprecated__(_msg)))
^
Objects/unicodeobject.c:2997:15: warning: 'sprintf' is deprecated: This function is provided for compatibility reasons only. Due to security concerns inherent in the design of sprintf(3), it is highly recommended that you use snprintf(3) instead. [-Wdeprecated-declarations]
len = sprintf(number, "%p", va_arg(*vargs, void*));
^
/Library/Developer/CommandLineTools/SDKs/MacOSX.sdk/usr/include/stdio.h:180:1: note: 'sprintf' has been explicitly marked deprecated here
__deprecated_msg("This function is provided for compatibility reasons only. Due to security concerns inherent in the design of sprintf(3), it is highly recommended that you use snprintf(3) instead.")
^
/Library/Developer/CommandLineTools/SDKs/MacOSX.sdk/usr/include/sys/cdefs.h:215:48: note: expanded from macro '__deprecated_msg'
#define __deprecated_msg(_msg) __attribute__((__deprecated__(_msg)))
^
Objects/unicodeobject.c:9018:13: warning: 'sprintf' is deprecated: This function is provided for compatibility reasons only. Due to security concerns inherent in the design of sprintf(3), it is highly recommended that you use snprintf(3) instead. [-Wdeprecated-declarations]
sprintf(buffer, "&#%d;", (int)PyUnicode_READ_CHAR(unicode, collpos));
^
/Library/Developer/CommandLineTools/SDKs/MacOSX.sdk/usr/include/stdio.h:180:1: note: 'sprintf' has been explicitly marked deprecated here
__deprecated_msg("This function is provided for compatibility reasons only. Due to security concerns inherent in the design of sprintf(3), it is highly recommended that you use snprintf(3) instead.")
^
/Library/Developer/CommandLineTools/SDKs/MacOSX.sdk/usr/include/sys/cdefs.h:215:48: note: expanded from macro '__deprecated_msg'
#define __deprecated_msg(_msg) __attribute__((__deprecated__(_msg)))
^
Python/ceval_gil.c:81:24: warning: code will never be executed [-Wunreachable-code]
int32_t npending = _Py_atomic_load_int32_relaxed(
^~~~~~~~~~~~~~~~~~~~~~~~~~~~~
1 warning generated.
1 warning generated.
Python/pystrtod.c:1204:19: warning: 'sprintf' is deprecated: This function is provided for compatibility reasons only. Due to security concerns inherent in the design of sprintf(3), it is highly recommended that you use snprintf(3) instead. [-Wdeprecated-declarations]
exp_len = sprintf(p, "%+.02d", exp);
^
/Library/Developer/CommandLineTools/SDKs/MacOSX.sdk/usr/include/stdio.h:180:1: note: 'sprintf' has been explicitly marked deprecated here
__deprecated_msg("This function is provided for compatibility reasons only. Due to security concerns inherent in the design of sprintf(3), it is highly recommended that you use snprintf(3) instead.")
^
/Library/Developer/CommandLineTools/SDKs/MacOSX.sdk/usr/include/sys/cdefs.h:215:48: note: expanded from macro '__deprecated_msg'
#define __deprecated_msg(_msg) __attribute__((__deprecated__(_msg)))
^
1 warning generated.
./Modules/_datetimemodule.c:1850:9: warning: 'sprintf' is deprecated: This function is provided for compatibility reasons only. Due to security concerns inherent in the design of sprintf(3), it is highly recommended that you use snprintf(3) instead. [-Wdeprecated-declarations]
sprintf(freplacement, "%06d", TIME_GET_MICROSECOND(object));
^
/Library/Developer/CommandLineTools/SDKs/MacOSX.sdk/usr/include/stdio.h:180:1: note: 'sprintf' has been explicitly marked deprecated here
__deprecated_msg("This function is provided for compatibility reasons only. Due to security concerns inherent in the design of sprintf(3), it is highly recommended that you use snprintf(3) instead.")
^
/Library/Developer/CommandLineTools/SDKs/MacOSX.sdk/usr/include/sys/cdefs.h:215:48: note: expanded from macro '__deprecated_msg'
#define __deprecated_msg(_msg) __attribute__((__deprecated__(_msg)))
^
./Modules/_datetimemodule.c:1852:9: warning: 'sprintf' is deprecated: This function is provided for compatibility reasons only. Due to security concerns inherent in the design of sprintf(3), it is highly recommended that you use snprintf(3) instead. [-Wdeprecated-declarations]
sprintf(freplacement, "%06d", DATE_GET_MICROSECOND(object));
^
/Library/Developer/CommandLineTools/SDKs/MacOSX.sdk/usr/include/stdio.h:180:1: note: 'sprintf' has been explicitly marked deprecated here
__deprecated_msg("This function is provided for compatibility reasons only. Due to security concerns inherent in the design of sprintf(3), it is highly recommended that you use snprintf(3) instead.")
^
/Library/Developer/CommandLineTools/SDKs/MacOSX.sdk/usr/include/sys/cdefs.h:215:48: note: expanded from macro '__deprecated_msg'
#define __deprecated_msg(_msg) __attribute__((__deprecated__(_msg)))
^
./Modules/_datetimemodule.c:1854:9: warning: 'sprintf' is deprecated: This function is provided for compatibility reasons only. Due to security concerns inherent in the design of sprintf(3), it is highly recommended that you use snprintf(3) instead. [-Wdeprecated-declarations]
sprintf(freplacement, "%06d", 0);
^
/Library/Developer/CommandLineTools/SDKs/MacOSX.sdk/usr/include/stdio.h:180:1: note: 'sprintf' has been explicitly marked deprecated here
__deprecated_msg("This function is provided for compatibility reasons only. Due to security concerns inherent in the design of sprintf(3), it is highly recommended that you use snprintf(3) instead.")
^
/Library/Developer/CommandLineTools/SDKs/MacOSX.sdk/usr/include/sys/cdefs.h:215:48: note: expanded from macro '__deprecated_msg'
#define __deprecated_msg(_msg) __attribute__((__deprecated__(_msg)))
^
33 warnings generated.
3 warnings generated.
Programs/_freeze_module.c:129:5: warning: 'sprintf' is deprecated: This function is provided for compatibility reasons only. Due to security concerns inherent in the design of sprintf(3), it is highly recommended that you use snprintf(3) instead. [-Wdeprecated-declarations]
sprintf(filename, "<frozen %s>", name);
^
/Library/Developer/CommandLineTools/SDKs/MacOSX.sdk/usr/include/stdio.h:180:1: note: 'sprintf' has been explicitly marked deprecated here
__deprecated_msg("This function is provided for compatibility reasons only. Due to security concerns inherent in the design of sprintf(3), it is highly recommended that you use snprintf(3) instead.")
^
/Library/Developer/CommandLineTools/SDKs/MacOSX.sdk/usr/include/sys/cdefs.h:215:48: note: expanded from macro '__deprecated_msg'
#define __deprecated_msg(_msg) __attribute__((__deprecated__(_msg)))
^
1 warning generated.
./Modules/_pickle.c:2156:13: warning: 'sprintf' is deprecated: This function is provided for compatibility reasons only. Due to security concerns inherent in the design of sprintf(3), it is highly recommended that you use snprintf(3) instead. [-Wdeprecated-declarations]
sprintf(pdata, "%c%ld\n", INT, val);
^
/Library/Developer/CommandLineTools/SDKs/MacOSX.sdk/usr/include/stdio.h:180:1: note: 'sprintf' has been explicitly marked deprecated here
__deprecated_msg("This function is provided for compatibility reasons only. Due to security concerns inherent in the design of sprintf(3), it is highly recommended that you use snprintf(3) instead.")
^
/Library/Developer/CommandLineTools/SDKs/MacOSX.sdk/usr/include/sys/cdefs.h:215:48: note: expanded from macro '__deprecated_msg'
#define __deprecated_msg(_msg) __attribute__((__deprecated__(_msg)))
^
1 warning generated.
./Modules/unicodedata.c:1334:9: warning: 'sprintf' is deprecated: This function is provided for compatibility reasons only. Due to security concerns inherent in the design of sprintf(3), it is highly recommended that you use snprintf(3) instead. [-Wdeprecated-declarations]
sprintf(buffer, "CJK UNIFIED IDEOGRAPH-%X", code);
^
/Library/Developer/CommandLineTools/SDKs/MacOSX.sdk/usr/include/stdio.h:180:1: note: 'sprintf' has been explicitly marked deprecated here
__deprecated_msg("This function is provided for compatibility reasons only. Due to security concerns inherent in the design of sprintf(3), it is highly recommended that you use snprintf(3) instead.")
^
/Library/Developer/CommandLineTools/SDKs/MacOSX.sdk/usr/include/sys/cdefs.h:215:48: note: expanded from macro '__deprecated_msg'
#define __deprecated_msg(_msg) __attribute__((__deprecated__(_msg)))
^
./Modules/_ctypes/_ctypes.c:389:17: warning: 'sprintf' is deprecated: This function is provided for compatibility reasons only. Due to security concerns inherent in the design of sprintf(3), it is highly recommended that you use snprintf(3) instead. [-Wdeprecated-declarations]
sprintf(buf, "%zd,", shape[k]);
^
/Library/Developer/CommandLineTools/SDKs/MacOSX.sdk/usr/include/stdio.h:180:1: note: 'sprintf' has been explicitly marked deprecated here
__deprecated_msg("This function is provided for compatibility reasons only. Due to security concerns inherent in the design of sprintf(3), it is highly recommended that you use snprintf(3) instead.")
^
/Library/Developer/CommandLineTools/SDKs/MacOSX.sdk/usr/include/sys/cdefs.h:215:48: note: expanded from macro '__deprecated_msg'
#define __deprecated_msg(_msg) __attribute__((__deprecated__(_msg)))
^
./Modules/_ctypes/_ctypes.c:391:17: warning: 'sprintf' is deprecated: This function is provided for compatibility reasons only. Due to security concerns inherent in the design of sprintf(3), it is highly recommended that you use snprintf(3) instead. [-Wdeprecated-declarations]
sprintf(buf, "%zd)", shape[k]);
^
/Library/Developer/CommandLineTools/SDKs/MacOSX.sdk/usr/include/stdio.h:180:1: note: 'sprintf' has been explicitly marked deprecated here
__deprecated_msg("This function is provided for compatibility reasons only. Due to security concerns inherent in the design of sprintf(3), it is highly recommended that you use snprintf(3) instead.")
^
/Library/Developer/CommandLineTools/SDKs/MacOSX.sdk/usr/include/sys/cdefs.h:215:48: note: expanded from macro '__deprecated_msg'
#define __deprecated_msg(_msg) __attribute__((__deprecated__(_msg)))
^
1 warning generated.
./Modules/_ctypes/_ctypes.c:2925:11: warning: 'sprintf' is deprecated: This function is provided for compatibility reasons only. Due to security concerns inherent in the design of sprintf(3), it is highly recommended that you use snprintf(3) instead. [-Wdeprecated-declarations]
cp += sprintf(cp, "%x", Py_SAFE_DOWNCAST(index, Py_ssize_t, int));
^
/Library/Developer/CommandLineTools/SDKs/MacOSX.sdk/usr/include/stdio.h:180:1: note: 'sprintf' has been explicitly marked deprecated here
__deprecated_msg("This function is provided for compatibility reasons only. Due to security concerns inherent in the design of sprintf(3), it is highly recommended that you use snprintf(3) instead.")
^
/Library/Developer/CommandLineTools/SDKs/MacOSX.sdk/usr/include/sys/cdefs.h:215:48: note: expanded from macro '__deprecated_msg'
#define __deprecated_msg(_msg) __attribute__((__deprecated__(_msg)))
^
./Modules/_ctypes/_ctypes.c:2934:15: warning: 'sprintf' is deprecated: This function is provided for compatibility reasons only. Due to security concerns inherent in the design of sprintf(3), it is highly recommended that you use snprintf(3) instead. [-Wdeprecated-declarations]
cp += sprintf(cp, ":%x", Py_SAFE_DOWNCAST(target->b_index, Py_ssize_t, int));
^
/Library/Developer/CommandLineTools/SDKs/MacOSX.sdk/usr/include/stdio.h:180:1: note: 'sprintf' has been explicitly marked deprecated here
__deprecated_msg("This function is provided for compatibility reasons only. Due to security concerns inherent in the design of sprintf(3), it is highly recommended that you use snprintf(3) instead.")
^
/Library/Developer/CommandLineTools/SDKs/MacOSX.sdk/usr/include/sys/cdefs.h:215:48: note: expanded from macro '__deprecated_msg'
#define __deprecated_msg(_msg) __attribute__((__deprecated__(_msg)))
^
./Modules/_ctypes/_ctypes.c:5355:5: warning: 'sprintf' is deprecated: This function is provided for compatibility reasons only. Due to security concerns inherent in the design of sprintf(3), it is highly recommended that you use snprintf(3) instead. [-Wdeprecated-declarations]
sprintf(name, "%.200s_Array_%ld",
^
/Library/Developer/CommandLineTools/SDKs/MacOSX.sdk/usr/include/stdio.h:180:1: note: 'sprintf' has been explicitly marked deprecated here
__deprecated_msg("This function is provided for compatibility reasons only. Due to security concerns inherent in the design of sprintf(3), it is highly recommended that you use snprintf(3) instead.")
^
/Library/Developer/CommandLineTools/SDKs/MacOSX.sdk/usr/include/sys/cdefs.h:215:48: note: expanded from macro '__deprecated_msg'
#define __deprecated_msg(_msg) __attribute__((__deprecated__(_msg)))
^
./Modules/_testcapimodule.c:786:17: warning: 'sprintf' is deprecated: This function is provided for compatibility reasons only. Due to security concerns inherent in the design of sprintf(3), it is highly recommended that you use snprintf(3) instead. [-Wdeprecated-declarations]
FAIL("PyCapsule_GetPointer returned NULL unexpectedly!");
^
./Modules/_testcapimodule.c:775:13: note: expanded from macro 'FAIL'
sprintf(buffer, "%s module: \"%s\" attribute: \"%s\"", \
^
/Library/Developer/CommandLineTools/SDKs/MacOSX.sdk/usr/include/stdio.h:180:1: note: 'sprintf' has been explicitly marked deprecated here
__deprecated_msg("This function is provided for compatibility reasons only. Due to security concerns inherent in the design of sprintf(3), it is highly recommended that you use snprintf(3) instead.")
^
/Library/Developer/CommandLineTools/SDKs/MacOSX.sdk/usr/include/sys/cdefs.h:215:48: note: expanded from macro '__deprecated_msg'
#define __deprecated_msg(_msg) __attribute__((__deprecated__(_msg)))
^
./Modules/_testcapimodule.c:798:17: warning: 'sprintf' is deprecated: This function is provided for compatibility reasons only. Due to security concerns inherent in the design of sprintf(3), it is highly recommended that you use snprintf(3) instead. [-Wdeprecated-declarations]
FAIL("PyCapsule_GetPointer should have failed but did not!");
^
./Modules/_testcapimodule.c:775:13: note: expanded from macro 'FAIL'
sprintf(buffer, "%s module: \"%s\" attribute: \"%s\"", \
^
/Library/Developer/CommandLineTools/SDKs/MacOSX.sdk/usr/include/stdio.h:180:1: note: 'sprintf' has been explicitly marked deprecated here
__deprecated_msg("This function is provided for compatibility reasons only. Due to security concerns inherent in the design of sprintf(3), it is highly recommended that you use snprintf(3) instead.")
^
/Library/Developer/CommandLineTools/SDKs/MacOSX.sdk/usr/include/sys/cdefs.h:215:48: note: expanded from macro '__deprecated_msg'
#define __deprecated_msg(_msg) __attribute__((__deprecated__(_msg)))
^
./Modules/_testcapimodule.c:805:21: warning: 'sprintf' is deprecated: This function is provided for compatibility reasons only. Due to security concerns inherent in the design of sprintf(3), it is highly recommended that you use snprintf(3) instead. [-Wdeprecated-declarations]
FAIL("PyCapsule_GetPointer should not have"
^
./Modules/_testcapimodule.c:775:13: note: expanded from macro 'FAIL'
sprintf(buffer, "%s module: \"%s\" attribute: \"%s\"", \
^
/Library/Developer/CommandLineTools/SDKs/MacOSX.sdk/usr/include/stdio.h:180:1: note: 'sprintf' has been explicitly marked deprecated here
__deprecated_msg("This function is provided for compatibility reasons only. Due to security concerns inherent in the design of sprintf(3), it is highly recommended that you use snprintf(3) instead.")
^
/Library/Developer/CommandLineTools/SDKs/MacOSX.sdk/usr/include/sys/cdefs.h:215:48: note: expanded from macro '__deprecated_msg'
#define __deprecated_msg(_msg) __attribute__((__deprecated__(_msg)))
^
./Modules/_testcapimodule.c:808:21: warning: 'sprintf' is deprecated: This function is provided for compatibility reasons only. Due to security concerns inherent in the design of sprintf(3), it is highly recommended that you use snprintf(3) instead. [-Wdeprecated-declarations]
FAIL("PyCapsule_GetPointer should have"
^
./Modules/_testcapimodule.c:775:13: note: expanded from macro 'FAIL'
sprintf(buffer, "%s module: \"%s\" attribute: \"%s\"", \
^
/Library/Developer/CommandLineTools/SDKs/MacOSX.sdk/usr/include/stdio.h:180:1: note: 'sprintf' has been explicitly marked deprecated here
__deprecated_msg("This function is provided for compatibility reasons only. Due to security concerns inherent in the design of sprintf(3), it is highly recommended that you use snprintf(3) instead.")
^
/Library/Developer/CommandLineTools/SDKs/MacOSX.sdk/usr/include/sys/cdefs.h:215:48: note: expanded from macro '__deprecated_msg'
#define __deprecated_msg(_msg) __attribute__((__deprecated__(_msg)))
^
5 warnings generated.
4 warnings generated.
ld: warning: search path '/opt/homebrew/lib' not found
ld: warning: search path '/opt/homebrew/lib' not found
ld: warning: search path '/opt/homebrew/lib' not found
ld: warning: search path '/opt/homebrew/lib' not found
ld: warning: search path '/opt/homebrew/lib' not found
ld: warning: search path '/opt/homebrew/lib' not found
ld: warning: search path '/opt/homebrew/lib' not found
ld: warning: search path '/opt/homebrew/lib' not found
ld: warning: search path '/opt/homebrew/lib' not found
ld: warning: search path '/opt/homebrew/lib' not found
ld: warning: search path '/opt/homebrew/lib' not found
ld: warning: search path '/opt/homebrew/lib' not found
ld: warning: search path '/opt/homebrew/lib' not found
ld: warning: search path '/opt/homebrew/lib' not found
ld: warning: search path '/opt/homebrew/lib' not found
ld: warning: search path '/opt/homebrew/lib' not found
ld: warning: search path '/opt/homebrew/lib' not found
ld: warning: search path '/opt/homebrew/lib' not found
ld: warning: search path '/opt/homebrew/lib' not found
ld: warning: search path '/opt/homebrew/lib' not found
ld: warning: search path '/opt/homebrew/lib' not found
ld: warning: search path '/opt/homebrew/lib' not found
ld: warning: search path '/opt/homebrew/lib' not found
ld: warning: search path '/opt/homebrew/lib' not found
ld: warning: search path '/opt/homebrew/lib' not found
ld: warning: search path '/opt/homebrew/lib' not found
ld: warning: search path '/opt/homebrew/lib' not found
ld: warning: search path '/opt/homebrew/lib' not found
ld: warning: search path '/opt/homebrew/lib' not found
ld: warning: search path '/opt/homebrew/lib' not found
ld: warning: search path '/opt/homebrew/lib' not found
ld: warning: search path '/opt/homebrew/lib' not found
ld: warning: search path '/opt/homebrew/lib' not found
ld: warning: search path '/opt/homebrew/lib' not found
ld: warning: search path '/opt/homebrew/lib' not found
ld: warning: search path '/opt/homebrew/lib' not found
ld: warning: search path '/opt/homebrew/lib' not found
ld: warning: search path '/opt/homebrew/lib' not found
ld: warning: search path '/opt/homebrew/lib' not found
ld: warning: search path '/opt/homebrew/lib' not found
ld: warning: search path '/opt/homebrew/lib' not found
ld: warning: search path '/opt/homebrew/lib' not found
ld: warning: search path '/opt/homebrew/lib' not found
ld: warning: search path '/opt/homebrew/lib' not found
ld: warning: search path '/opt/homebrew/lib' not found
ld: warning: search path '/opt/homebrew/lib' not found
ld: warning: search path '/opt/homebrew/lib' not found
ld: warning: search path '/opt/homebrew/lib' not found
ld: warning: search path '/opt/homebrew/lib' not found
ld: warning: search path '/opt/homebrew/lib' not found
ld: warning: search path '/opt/homebrew/lib' not found
ld: warning: search path '/opt/homebrew/lib' not found
ld: warning: search path '/opt/homebrew/lib' not found
ld: warning: search path '/opt/homebrew/lib' not found
ld: warning: search path '/opt/homebrew/lib' not found
ld: warning: search path '/opt/homebrew/lib' not found
ld: warning: search path '/opt/homebrew/lib' not found
ld: warning: search path '/opt/homebrew/lib' not found
ld: warning: search path '/opt/homebrew/lib' not found
ld: warning: search path '/opt/homebrew/lib' not found
ld: warning: search path '/opt/homebrew/lib' not found
ld: warning: search path '/opt/homebrew/lib' not found
ld: warning: search path '/opt/homebrew/lib' not found
ld: warning: search path '/opt/homebrew/lib' not found
ld: warning: search path '/opt/homebrew/lib' not found
ld: warning: search path '/opt/homebrew/lib' not found
ld: warning: search path '/opt/homebrew/lib' not found
ld: warning: search path '/opt/homebrew/lib' not found
ld: warning: search path '/opt/homebrew/lib' not found
ld: warning: search path '/opt/homebrew/lib' not found
ld: warning: search path '/opt/homebrew/lib' not found
ld: warning: search path '/opt/homebrew/lib' not found
ld: warning: search path '/opt/homebrew/lib' not found
ld: warning: search path '/opt/homebrew/lib' not found
ld: warning: search path '/opt/homebrew/lib' not found
ld: warning: search path '/opt/homebrew/lib' not found
make: *** [buildbottest] Error 2
Test report
===========
Failed tests:
- test_tracemalloc
Sincerely,
-The Buildbot
1
0
☠ Buildbot (Python): python/cpython - failed test (failure) (main)
by buildbot@python.org Sept. 16, 2025
by buildbot@python.org Sept. 16, 2025
Sept. 16, 2025
The Buildbot has detected a new failure on builder s390x RHEL8 LTO 3.x while building python/cpython.
Full details are available at:
https://buildbot.python.org/#/builders/567/builds/10132
Buildbot URL: https://buildbot.python.org/
Worker for this Build: cstratak-rhel8-s390x
Build Reason: <unknown>
Blamelist: AN Long <aisk(a)users.noreply.github.com>, Irit Katriel <1055913+iritkatriel(a)users.noreply.github.com>
BUILD FAILED: failed test (failure)
Summary of the results of the build (if available):
===================================================
==
Captured traceback
==================
Traceback (most recent call last):
File "/home/buildbot/buildarea/3.x.cstratak-rhel8-s390x.lto/build/Lib/contextlib.py", line 112, in __init__
doc = getattr(func, "__doc__", None)
ValueError: flush of closed file
Warning -- Unraisable exception
Exception ignored while finalizing file <_io.BufferedWriter>:
Traceback (most recent call last):
File "/home/buildbot/buildarea/3.x.cstratak-rhel8-s390x.lto/build/Lib/contextlib.py", line 112, in __init__
doc = getattr(func, "__doc__", None)
ValueError: flush of closed file
k
Test report
===========
Sincerely,
-The Buildbot
1
0
☠ Buildbot (Python): python/cpython - failed test (failure) (3.13)
by buildbot@python.org Sept. 16, 2025
by buildbot@python.org Sept. 16, 2025
Sept. 16, 2025
The Buildbot has detected a new failure on builder ARM64 MacOS M1 Refleaks NoGIL 3.13 while building python/cpython.
Full details are available at:
https://buildbot.python.org/#/builders/1396/builds/1597
Buildbot URL: https://buildbot.python.org/
Worker for this Build: itamaro-macos-arm64-aws
Build Reason: <unknown>
Blamelist: Miss Islington (bot) <31488909+miss-islington(a)users.noreply.github.com>
BUILD FAILED: failed test (failure)
Summary of the results of the build (if available):
===================================================
==
Captured traceback
==================
Traceback (most recent call last):
File "/Users/buildbot/buildarea/3.13.itamaro-macos-arm64-aws.macos-with-brew.refleak.nogil/build/Lib/test/test_asyncio/test_ssl.py", line 1595, in test_remote_shutdown_receives_trailing_data_on_slow_socket
self.loop.run_until_complete(client(srv.addr))
~~~~~~~~~~~~~~~~~~~~~~~~~~~~^^^^^^^^^^^^^^^^^^
File "/Users/buildbot/buildarea/3.13.itamaro-macos-arm64-aws.macos-with-brew.refleak.nogil/build/Lib/asyncio/base_events.py", line 725, in run_until_complete
return future.result()
~~~~~~~~~~~~~^^
File "/Users/buildbot/buildarea/3.13.itamaro-macos-arm64-aws.macos-with-brew.refleak.nogil/build/Lib/test/test_asyncio/test_ssl.py", line 1573, in client
wraps=socket_transport.write,
^^^^^^^^^^^^^^^^^^^^^^
AttributeError: 'NoneType' object has no attribute 'write'
Traceback (most recent call last):
File "/Users/buildbot/buildarea/3.13.itamaro-macos-arm64-aws.macos-with-brew.refleak.nogil/build/Lib/test/_test_multiprocessing.py", line 1492, in test_repr_rlock
self.assertEqual('<RLock(SomeOtherThread, nonzero)>', repr(lock))
~~~~~~~~~~~~~~~~^^^^^^^^^^^^^^^^^^^^^^^^^^^^^^^^^^^^^^^^^^^^^^^^^
AssertionError: '<RLock(SomeOtherThread, nonzero)>' != '<RLock(None, 0)>'
- <RLock(SomeOtherThread, nonzero)>
+ <RLock(None, 0)>
Test report
===========
Failed tests:
- test.test_multiprocessing_forkserver.test_processes
Failed subtests:
- test_remote_shutdown_receives_trailing_data_on_slow_socket - test.test_asyncio.test_ssl.TestSSL.test_remote_shutdown_receives_trailing_data_on_slow_socket
- test_repr_rlock - test.test_multiprocessing_forkserver.test_processes.WithProcessesTestLock.test_repr_rlock
Sincerely,
-The Buildbot
1
0
☠ Buildbot (Python): python/cpython - failed test (failure) (main)
by buildbot@python.org Sept. 15, 2025
by buildbot@python.org Sept. 15, 2025
Sept. 15, 2025
The Buildbot has detected a new failure on builder AMD64 Windows PGO NoGIL 3.x while building python/cpython.
Full details are available at:
https://buildbot.python.org/#/builders/1622/builds/2649
Buildbot URL: https://buildbot.python.org/
Worker for this Build: itamaro-win64-srv-22-aws
Build Reason: <unknown>
Blamelist: Cody Maloney <cmaloney(a)users.noreply.github.com>, Mehdi Hassan <44486547+mehdihassan93(a)users.noreply.github.com>, Victor Stinner <vstinner(a)python.org>
BUILD FAILED: failed test (failure)
Summary of the results of the build (if available):
===================================================
==
Captured traceback
==================
remote: Enumerating objects: 10, done.
remote: Counting objects: 11% (1/9)
remote: Counting objects: 22% (2/9)
remote: Counting objects: 33% (3/9)
remote: Counting objects: 44% (4/9)
remote: Counting objects: 55% (5/9)
remote: Counting objects: 66% (6/9)
remote: Counting objects: 77% (7/9)
remote: Counting objects: 88% (8/9)
remote: Counting objects: 100% (9/9)
remote: Counting objects: 100% (9/9), done.
remote: Compressing objects: 14% (1/7)
remote: Compressing objects: 28% (2/7)
remote: Compressing objects: 42% (3/7)
remote: Compressing objects: 57% (4/7)
remote: Compressing objects: 71% (5/7)
remote: Compressing objects: 85% (6/7)
remote: Compressing objects: 100% (7/7)
remote: Compressing objects: 100% (7/7), done.
remote: Total 10 (delta 3), reused 2 (delta 2), pack-reused 1 (from 1)
From https://github.com/python/cpython
* branch main -> FETCH_HEAD
Note: switching to 'e814e6b38bc87ff91c3ba73cfe90a1b803142bc2'.
You are in 'detached HEAD' state. You can look around, make experimental
changes and commit them, and you can discard any commits you make in this
state without impacting any branches by switching back to a branch.
If you want to create a new branch to retain commits you create, you may
do so (now or later) by using -c with the switch command. Example:
git switch -c <new-branch-name>
Or undo this operation with:
git switch -
Turn off this advice by setting config variable advice.detachedHead to false
HEAD is now at e814e6b38bc gh-129813, PEP 782: Use PyBytesWriter in FileIO.read() (#138955)
Switched to and reset branch 'main'
Could Not Find C:\Users\Administrator\buildarea\3.x.itamaro-win64-srv-22-aws.nogil.pgo\build\PCbuild\*.pgc
Could Not Find C:\Users\Administrator\buildarea\3.x.itamaro-win64-srv-22-aws.nogil.pgo\build\Lib\*.pyc
'"C:\Users\Administrator\buildarea\3.x.itamaro-win64-srv-22-aws.nogil.pgo\build\PCbuild\\..\python.bat"' is not recognized as an internal or external command,
operable program or batch file.
Could Not Find C:\Users\Administrator\buildarea\3.x.itamaro-win64-srv-22-aws.nogil.pgo\build\PCbuild\*.pgc
Could Not Find C:\Users\Administrator\buildarea\3.x.itamaro-win64-srv-22-aws.nogil.pgo\build\Lib\*.pyc
'"C:\Users\Administrator\buildarea\3.x.itamaro-win64-srv-22-aws.nogil.pgo\build\PCbuild\\..\python.bat"' is not recognized as an internal or external command,
operable program or batch file.
Could Not Find C:\Users\Administrator\buildarea\3.x.itamaro-win64-srv-22-aws.nogil.pgo\build\Lib\*.pyc
The system cannot find the file specified.
Could Not Find C:\Users\Administrator\buildarea\3.x.itamaro-win64-srv-22-aws.nogil.pgo\build\PCbuild\python*.zip
Could Not Find C:\Users\Administrator\buildarea\3.x.itamaro-win64-srv-22-aws.nogil.pgo\build\PCbuild\*.pgc
Could Not Find C:\Users\Administrator\buildarea\3.x.itamaro-win64-srv-22-aws.nogil.pgo\build\Lib\*.pyc
Could Not Find C:\Users\Administrator\buildarea\3.x.itamaro-win64-srv-22-aws.nogil.pgo\build\PCbuild\python*.zip
Test report
===========
Failed tests:
- test_tracemalloc
Sincerely,
-The Buildbot
1
0