Buildbot-status
Threads by month
- ----- 2026 -----
- October
- September
- August
- July
- June
- May
- April
- March
- February
- January
- ----- 2025 -----
- December
- November
- October
- September
- August
- July
- June
- May
- April
- March
- February
- January
- ----- 2024 -----
- December
- November
- October
- September
- August
- July
- June
- May
- April
- March
- February
- January
- ----- 2023 -----
- December
- November
- October
- September
- August
- July
- June
- May
- April
- March
- February
- January
- ----- 2022 -----
- December
- November
- October
- September
- August
- July
- June
- May
- April
- March
- February
- January
- ----- 2021 -----
- December
- November
- October
- September
- August
- July
- June
- May
- April
- March
- February
- January
- ----- 2020 -----
- December
- November
- October
- September
- August
- July
- June
- May
- April
- March
- February
- January
- ----- 2019 -----
- December
- November
- October
- September
- August
- July
- June
- May
- April
- March
- February
- January
- ----- 2018 -----
- December
- November
- October
- September
- August
- July
- June
- May
- April
- March
- February
- January
- ----- 2017 -----
- December
- November
- October
- September
- August
- July
- June
- May
September 2025
- 1 participants
- 90 discussions
☠ Buildbot (Python): python/cpython - failed test (failure) (main)
by buildbot@python.org Sept. 15, 2025
by buildbot@python.org Sept. 15, 2025
Sept. 15, 2025
The Buildbot has detected a new failure on builder x86-64 MacOS Intel ASAN NoGIL 3.x while building python/cpython.
Full details are available at:
https://buildbot.python.org/#/builders/1366/builds/5043
Buildbot URL: https://buildbot.python.org/
Worker for this Build: itamaro-macos-intel-aws
Build Reason: <unknown>
Blamelist: Victor Stinner <vstinner(a)python.org>
BUILD FAILED: failed test (failure)
Summary of the results of the build (if available):
===================================================
==
Captured traceback
==================
remote: Enumerating objects: 7, done.
remote: Counting objects: 14% (1/7)
remote: Counting objects: 28% (2/7)
remote: Counting objects: 42% (3/7)
remote: Counting objects: 57% (4/7)
remote: Counting objects: 71% (5/7)
remote: Counting objects: 85% (6/7)
remote: Counting objects: 100% (7/7)
remote: Counting objects: 100% (7/7), done.
remote: Compressing objects: 25% (1/4)
remote: Compressing objects: 50% (2/4)
remote: Compressing objects: 75% (3/4)
remote: Compressing objects: 100% (4/4)
remote: Compressing objects: 100% (4/4), done.
remote: Total 4 (delta 3), reused 0 (delta 0), pack-reused 0 (from 0)
From https://github.com/python/cpython
* branch main -> FETCH_HEAD
Note: switching to 'c5fb72ea6ced51a7d20d5b203dc832558d972321'.
You are in 'detached HEAD' state. You can look around, make experimental
changes and commit them, and you can discard any commits you make in this
state without impacting any branches by switching back to a branch.
If you want to create a new branch to retain commits you create, you may
do so (now or later) by using -c with the switch command. Example:
git switch -c <new-branch-name>
Or undo this operation with:
git switch -
Turn off this advice by setting config variable advice.detachedHead to false
HEAD is now at c5fb72ea6ce gh-129813, PEP 782: Use PyBytesWriter in _winapi.PeekNamedPipe() (#138930)
Switched to and reset branch 'main'
configure: WARNING: pkg-config is missing. Some dependencies may not be detected correctly.
Parser/string_parser.c:185:17: warning: 'sprintf' is deprecated: This function is provided for compatibility reasons only. Due to security concerns inherent in the design of sprintf(3), it is highly recommended that you use snprintf(3) instead. [-Wdeprecated-declarations]
sprintf(p, "\\U%08x", chr);
^
/Library/Developer/CommandLineTools/SDKs/MacOSX.sdk/usr/include/stdio.h:180:1: note: 'sprintf' has been explicitly marked deprecated here
__deprecated_msg("This function is provided for compatibility reasons only. Due to security concerns inherent in the design of sprintf(3), it is highly recommended that you use snprintf(3) instead.")
^
/Library/Developer/CommandLineTools/SDKs/MacOSX.sdk/usr/include/sys/cdefs.h:215:48: note: expanded from macro '__deprecated_msg'
#define __deprecated_msg(_msg) __attribute__((__deprecated__(_msg)))
^
1 warning generated.
Objects/bytesobject.c:290:17: warning: 'sprintf' is deprecated: This function is provided for compatibility reasons only. Due to security concerns inherent in the design of sprintf(3), it is highly recommended that you use snprintf(3) instead. [-Wdeprecated-declarations]
sprintf(buffer, "%ld", va_arg(vargs, long));
^
/Library/Developer/CommandLineTools/SDKs/MacOSX.sdk/usr/include/stdio.h:180:1: note: 'sprintf' has been explicitly marked deprecated here
__deprecated_msg("This function is provided for compatibility reasons only. Due to security concerns inherent in the design of sprintf(3), it is highly recommended that you use snprintf(3) instead.")
^
/Library/Developer/CommandLineTools/SDKs/MacOSX.sdk/usr/include/sys/cdefs.h:215:48: note: expanded from macro '__deprecated_msg'
#define __deprecated_msg(_msg) __attribute__((__deprecated__(_msg)))
^
Objects/bytesobject.c:293:17: warning: 'sprintf' is deprecated: This function is provided for compatibility reasons only. Due to security concerns inherent in the design of sprintf(3), it is highly recommended that you use snprintf(3) instead. [-Wdeprecated-declarations]
sprintf(buffer, "%zd", va_arg(vargs, Py_ssize_t));
^
/Library/Developer/CommandLineTools/SDKs/MacOSX.sdk/usr/include/stdio.h:180:1: note: 'sprintf' has been explicitly marked deprecated here
__deprecated_msg("This function is provided for compatibility reasons only. Due to security concerns inherent in the design of sprintf(3), it is highly recommended that you use snprintf(3) instead.")
^
/Library/Developer/CommandLineTools/SDKs/MacOSX.sdk/usr/include/sys/cdefs.h:215:48: note: expanded from macro '__deprecated_msg'
#define __deprecated_msg(_msg) __attribute__((__deprecated__(_msg)))
^
Objects/bytesobject.c:296:17: warning: 'sprintf' is deprecated: This function is provided for compatibility reasons only. Due to security concerns inherent in the design of sprintf(3), it is highly recommended that you use snprintf(3) instead. [-Wdeprecated-declarations]
sprintf(buffer, "%d", va_arg(vargs, int));
^
/Library/Developer/CommandLineTools/SDKs/MacOSX.sdk/usr/include/stdio.h:180:1: note: 'sprintf' has been explicitly marked deprecated here
__deprecated_msg("This function is provided for compatibility reasons only. Due to security concerns inherent in the design of sprintf(3), it is highly recommended that you use snprintf(3) instead.")
^
/Library/Developer/CommandLineTools/SDKs/MacOSX.sdk/usr/include/sys/cdefs.h:215:48: note: expanded from macro '__deprecated_msg'
#define __deprecated_msg(_msg) __attribute__((__deprecated__(_msg)))
^
Objects/bytesobject.c:304:17: warning: 'sprintf' is deprecated: This function is provided for compatibility reasons only. Due to security concerns inherent in the design of sprintf(3), it is highly recommended that you use snprintf(3) instead. [-Wdeprecated-declarations]
sprintf(buffer, "%lu", va_arg(vargs, unsigned long));
^
/Library/Developer/CommandLineTools/SDKs/MacOSX.sdk/usr/include/stdio.h:180:1: note: 'sprintf' has been explicitly marked deprecated here
__deprecated_msg("This function is provided for compatibility reasons only. Due to security concerns inherent in the design of sprintf(3), it is highly recommended that you use snprintf(3) instead.")
^
/Library/Developer/CommandLineTools/SDKs/MacOSX.sdk/usr/include/sys/cdefs.h:215:48: note: expanded from macro '__deprecated_msg'
#define __deprecated_msg(_msg) __attribute__((__deprecated__(_msg)))
^
Objects/bytesobject.c:307:17: warning: 'sprintf' is deprecated: This function is provided for compatibility reasons only. Due to security concerns inherent in the design of sprintf(3), it is highly recommended that you use snprintf(3) instead. [-Wdeprecated-declarations]
sprintf(buffer, "%zu", va_arg(vargs, size_t));
^
/Library/Developer/CommandLineTools/SDKs/MacOSX.sdk/usr/include/stdio.h:180:1: note: 'sprintf' has been explicitly marked deprecated here
__deprecated_msg("This function is provided for compatibility reasons only. Due to security concerns inherent in the design of sprintf(3), it is highly recommended that you use snprintf(3) instead.")
^
/Library/Developer/CommandLineTools/SDKs/MacOSX.sdk/usr/include/sys/cdefs.h:215:48: note: expanded from macro '__deprecated_msg'
#define __deprecated_msg(_msg) __attribute__((__deprecated__(_msg)))
^
Objects/bytesobject.c:310:17: warning: 'sprintf' is deprecated: This function is provided for compatibility reasons only. Due to security concerns inherent in the design of sprintf(3), it is highly recommended that you use snprintf(3) instead. [-Wdeprecated-declarations]
sprintf(buffer, "%u", va_arg(vargs, unsigned int));
^
/Library/Developer/CommandLineTools/SDKs/MacOSX.sdk/usr/include/stdio.h:180:1: note: 'sprintf' has been explicitly marked deprecated here
__deprecated_msg("This function is provided for compatibility reasons only. Due to security concerns inherent in the design of sprintf(3), it is highly recommended that you use snprintf(3) instead.")
^
/Library/Developer/CommandLineTools/SDKs/MacOSX.sdk/usr/include/sys/cdefs.h:215:48: note: expanded from macro '__deprecated_msg'
#define __deprecated_msg(_msg) __attribute__((__deprecated__(_msg)))
^
Objects/bytesobject.c:317:13: warning: 'sprintf' is deprecated: This function is provided for compatibility reasons only. Due to security concerns inherent in the design of sprintf(3), it is highly recommended that you use snprintf(3) instead. [-Wdeprecated-declarations]
sprintf(buffer, "%i", va_arg(vargs, int));
^
/Library/Developer/CommandLineTools/SDKs/MacOSX.sdk/usr/include/stdio.h:180:1: note: 'sprintf' has been explicitly marked deprecated here
__deprecated_msg("This function is provided for compatibility reasons only. Due to security concerns inherent in the design of sprintf(3), it is highly recommended that you use snprintf(3) instead.")
^
/Library/Developer/CommandLineTools/SDKs/MacOSX.sdk/usr/include/sys/cdefs.h:215:48: note: expanded from macro '__deprecated_msg'
#define __deprecated_msg(_msg) __attribute__((__deprecated__(_msg)))
^
Objects/bytesobject.c:323:13: warning: 'sprintf' is deprecated: This function is provided for compatibility reasons only. Due to security concerns inherent in the design of sprintf(3), it is highly recommended that you use snprintf(3) instead. [-Wdeprecated-declarations]
sprintf(buffer, "%x", va_arg(vargs, int));
^
/Library/Developer/CommandLineTools/SDKs/MacOSX.sdk/usr/include/stdio.h:180:1: note: 'sprintf' has been explicitly marked deprecated here
__deprecated_msg("This function is provided for compatibility reasons only. Due to security concerns inherent in the design of sprintf(3), it is highly recommended that you use snprintf(3) instead.")
^
/Library/Developer/CommandLineTools/SDKs/MacOSX.sdk/usr/include/sys/cdefs.h:215:48: note: expanded from macro '__deprecated_msg'
#define __deprecated_msg(_msg) __attribute__((__deprecated__(_msg)))
^
Objects/bytesobject.c:347:13: warning: 'sprintf' is deprecated: This function is provided for compatibility reasons only. Due to security concerns inherent in the design of sprintf(3), it is highly recommended that you use snprintf(3) instead. [-Wdeprecated-declarations]
sprintf(buffer, "%p", va_arg(vargs, void*));
^
/Library/Developer/CommandLineTools/SDKs/MacOSX.sdk/usr/include/stdio.h:180:1: note: 'sprintf' has been explicitly marked deprecated here
__deprecated_msg("This function is provided for compatibility reasons only. Due to security concerns inherent in the design of sprintf(3), it is highly recommended that you use snprintf(3) instead.")
^
/Library/Developer/CommandLineTools/SDKs/MacOSX.sdk/usr/include/sys/cdefs.h:215:48: note: expanded from macro '__deprecated_msg'
#define __deprecated_msg(_msg) __attribute__((__deprecated__(_msg)))
^
9 warnings generated.
Objects/typeobject.c:6883:9: warning: 'sprintf' is deprecated: This function is provided for compatibility reasons only. Due to security concerns inherent in the design of sprintf(3), it is highly recommended that you use snprintf(3) instead. [-Wdeprecated-declarations]
sprintf(msg, "type_traverse() called on non-heap type '%.100s'",
^
/Library/Developer/CommandLineTools/SDKs/MacOSX.sdk/usr/include/stdio.h:180:1: note: 'sprintf' has been explicitly marked deprecated here
__deprecated_msg("This function is provided for compatibility reasons only. Due to security concerns inherent in the design of sprintf(3), it is highly recommended that you use snprintf(3) instead.")
^
/Library/Developer/CommandLineTools/SDKs/MacOSX.sdk/usr/include/sys/cdefs.h:215:48: note: expanded from macro '__deprecated_msg'
#define __deprecated_msg(_msg) __attribute__((__deprecated__(_msg)))
^
Objects/unicodeobject.c:944:16: warning: 'sprintf' is deprecated: This function is provided for compatibility reasons only. Due to security concerns inherent in the design of sprintf(3), it is highly recommended that you use snprintf(3) instead. [-Wdeprecated-declarations]
size = sprintf(str, "&#%d;", PyUnicode_READ(kind, data, i));
^
/Library/Developer/CommandLineTools/SDKs/MacOSX.sdk/usr/include/stdio.h:180:1: note: 'sprintf' has been explicitly marked deprecated here
__deprecated_msg("This function is provided for compatibility reasons only. Due to security concerns inherent in the design of sprintf(3), it is highly recommended that you use snprintf(3) instead.")
^
/Library/Developer/CommandLineTools/SDKs/MacOSX.sdk/usr/include/sys/cdefs.h:215:48: note: expanded from macro '__deprecated_msg'
#define __deprecated_msg(_msg) __attribute__((__deprecated__(_msg)))
^
Objects/unicodeobject.c:2938:30: warning: 'sprintf' is deprecated: This function is provided for compatibility reasons only. Due to security concerns inherent in the design of sprintf(3), it is highly recommended that you use snprintf(3) instead. [-Wdeprecated-declarations]
case F_LONG: DO_SPRINTS("l", long, unsigned long); break;
^
Objects/unicodeobject.c:2929:33: note: expanded from macro 'DO_SPRINTS'
case 'o': len = SPRINT(SIZE_SPEC, "o", UNSIGNED_TYPE); break; \
^
Objects/unicodeobject.c:2924:13: note: expanded from macro 'SPRINT'
sprintf(buffer, "%" SIZE_SPEC FMT_CHAR, va_arg(*vargs, TYPE))
^
/Library/Developer/CommandLineTools/SDKs/MacOSX.sdk/usr/include/stdio.h:180:1: note: 'sprintf' has been explicitly marked deprecated here
__deprecated_msg("This function is provided for compatibility reasons only. Due to security concerns inherent in the design of sprintf(3), it is highly recommended that you use snprintf(3) instead.")
^
/Library/Developer/CommandLineTools/SDKs/MacOSX.sdk/usr/include/sys/cdefs.h:215:48: note: expanded from macro '__deprecated_msg'
#define __deprecated_msg(_msg) __attribute__((__deprecated__(_msg)))
^
Objects/unicodeobject.c:2938:30: warning: 'sprintf' is deprecated: This function is provided for compatibility reasons only. Due to security concerns inherent in the design of sprintf(3), it is highly recommended that you use snprintf(3) instead. [-Wdeprecated-declarations]
case F_LONG: DO_SPRINTS("l", long, unsigned long); break;
^
Objects/unicodeobject.c:2930:33: note: expanded from macro 'DO_SPRINTS'
case 'u': len = SPRINT(SIZE_SPEC, "u", UNSIGNED_TYPE); break; \
^
Objects/unicodeobject.c:2924:13: note: expanded from macro 'SPRINT'
sprintf(buffer, "%" SIZE_SPEC FMT_CHAR, va_arg(*vargs, TYPE))
^
/Library/Developer/CommandLineTools/SDKs/MacOSX.sdk/usr/include/stdio.h:180:1: note: 'sprintf' has been explicitly marked deprecated here
__deprecated_msg("This function is provided for compatibility reasons only. Due to security concerns inherent in the design of sprintf(3), it is highly recommended that you use snprintf(3) instead.")
^
/Library/Developer/CommandLineTools/SDKs/MacOSX.sdk/usr/include/sys/cdefs.h:215:48: note: expanded from macro '__deprecated_msg'
#define __deprecated_msg(_msg) __attribute__((__deprecated__(_msg)))
^
Objects/unicodeobject.c:2938:30: warning: 'sprintf' is deprecated: This function is provided for compatibility reasons only. Due to security concerns inherent in the design of sprintf(3), it is highly recommended that you use snprintf(3) instead. [-Wdeprecated-declarations]
case F_LONG: DO_SPRINTS("l", long, unsigned long); break;
^
Objects/unicodeobject.c:2931:33: note: expanded from macro 'DO_SPRINTS'
case 'x': len = SPRINT(SIZE_SPEC, "x", UNSIGNED_TYPE); break; \
^
Objects/unicodeobject.c:2924:13: note: expanded from macro 'SPRINT'
sprintf(buffer, "%" SIZE_SPEC FMT_CHAR, va_arg(*vargs, TYPE))
^
/Library/Developer/CommandLineTools/SDKs/MacOSX.sdk/usr/include/stdio.h:180:1: note: 'sprintf' has been explicitly marked deprecated here
__deprecated_msg("This function is provided for compatibility reasons only. Due to security concerns inherent in the design of sprintf(3), it is highly recommended that you use snprintf(3) instead.")
^
/Library/Developer/CommandLineTools/SDKs/MacOSX.sdk/usr/include/sys/cdefs.h:215:48: note: expanded from macro '__deprecated_msg'
#define __deprecated_msg(_msg) __attribute__((__deprecated__(_msg)))
^
Objects/unicodeobject.c:2938:30: warning: 'sprintf' is deprecated: This function is provided for compatibility reasons only. Due to security concerns inherent in the design of sprintf(3), it is highly recommended that you use snprintf(3) instead. [-Wdeprecated-declarations]
case F_LONG: DO_SPRINTS("l", long, unsigned long); break;
^
Objects/unicodeobject.c:2932:33: note: expanded from macro 'DO_SPRINTS'
case 'X': len = SPRINT(SIZE_SPEC, "X", UNSIGNED_TYPE); break; \
^
Objects/unicodeobject.c:2924:13: note: expanded from macro 'SPRINT'
sprintf(buffer, "%" SIZE_SPEC FMT_CHAR, va_arg(*vargs, TYPE))
^
/Library/Developer/CommandLineTools/SDKs/MacOSX.sdk/usr/include/stdio.h:180:1: note: 'sprintf' has been explicitly marked deprecated here
__deprecated_msg("This function is provided for compatibility reasons only. Due to security concerns inherent in the design of sprintf(3), it is highly recommended that you use snprintf(3) instead.")
^
/Library/Developer/CommandLineTools/SDKs/MacOSX.sdk/usr/include/sys/cdefs.h:215:48: note: expanded from macro '__deprecated_msg'
#define __deprecated_msg(_msg) __attribute__((__deprecated__(_msg)))
^
Objects/unicodeobject.c:2938:30: warning: 'sprintf' is deprecated: This function is provided for compatibility reasons only. Due to security concerns inherent in the design of sprintf(3), it is highly recommended that you use snprintf(3) instead. [-Wdeprecated-declarations]
case F_LONG: DO_SPRINTS("l", long, unsigned long); break;
^
Objects/unicodeobject.c:2933:33: note: expanded from macro 'DO_SPRINTS'
default: len = SPRINT(SIZE_SPEC, "d", SIGNED_TYPE); break; \
^
Objects/unicodeobject.c:2924:13: note: expanded from macro 'SPRINT'
sprintf(buffer, "%" SIZE_SPEC FMT_CHAR, va_arg(*vargs, TYPE))
^
/Library/Developer/CommandLineTools/SDKs/MacOSX.sdk/usr/include/stdio.h:180:1: note: 'sprintf' has been explicitly marked deprecated here
__deprecated_msg("This function is provided for compatibility reasons only. Due to security concerns inherent in the design of sprintf(3), it is highly recommended that you use snprintf(3) instead.")
^
/Library/Developer/CommandLineTools/SDKs/MacOSX.sdk/usr/include/sys/cdefs.h:215:48: note: expanded from macro '__deprecated_msg'
#define __deprecated_msg(_msg) __attribute__((__deprecated__(_msg)))
^
Objects/unicodeobject.c:2939:30: warning: 'sprintf' is deprecated: This function is provided for compatibility reasons only. Due to security concerns inherent in the design of sprintf(3), it is highly recommended that you use snprintf(3) instead. [-Wdeprecated-declarations]
case F_LONGLONG: DO_SPRINTS("ll", long long, unsigned long long); break;
^
Objects/unicodeobject.c:2929:33: note: expanded from macro 'DO_SPRINTS'
case 'o': len = SPRINT(SIZE_SPEC, "o", UNSIGNED_TYPE); break; \
^
Objects/unicodeobject.c:2924:13: note: expanded from macro 'SPRINT'
sprintf(buffer, "%" SIZE_SPEC FMT_CHAR, va_arg(*vargs, TYPE))
^
/Library/Developer/CommandLineTools/SDKs/MacOSX.sdk/usr/include/stdio.h:180:1: note: 'sprintf' has been explicitly marked deprecated here
__deprecated_msg("This function is provided for compatibility reasons only. Due to security concerns inherent in the design of sprintf(3), it is highly recommended that you use snprintf(3) instead.")
^
/Library/Developer/CommandLineTools/SDKs/MacOSX.sdk/usr/include/sys/cdefs.h:215:48: note: expanded from macro '__deprecated_msg'
#define __deprecated_msg(_msg) __attribute__((__deprecated__(_msg)))
^
Objects/unicodeobject.c:2939:30: warning: 'sprintf' is deprecated: This function is provided for compatibility reasons only. Due to security concerns inherent in the design of sprintf(3), it is highly recommended that you use snprintf(3) instead. [-Wdeprecated-declarations]
case F_LONGLONG: DO_SPRINTS("ll", long long, unsigned long long); break;
^
Objects/unicodeobject.c:2930:33: note: expanded from macro 'DO_SPRINTS'
case 'u': len = SPRINT(SIZE_SPEC, "u", UNSIGNED_TYPE); break; \
^
Objects/unicodeobject.c:2924:13: note: expanded from macro 'SPRINT'
sprintf(buffer, "%" SIZE_SPEC FMT_CHAR, va_arg(*vargs, TYPE))
^
/Library/Developer/CommandLineTools/SDKs/MacOSX.sdk/usr/include/stdio.h:180:1: note: 'sprintf' has been explicitly marked deprecated here
__deprecated_msg("This function is provided for compatibility reasons only. Due to security concerns inherent in the design of sprintf(3), it is highly recommended that you use snprintf(3) instead.")
^
/Library/Developer/CommandLineTools/SDKs/MacOSX.sdk/usr/include/sys/cdefs.h:215:48: note: expanded from macro '__deprecated_msg'
#define __deprecated_msg(_msg) __attribute__((__deprecated__(_msg)))
^
Objects/unicodeobject.c:2939:30: warning: 'sprintf' is deprecated: This function is provided for compatibility reasons only. Due to security concerns inherent in the design of sprintf(3), it is highly recommended that you use snprintf(3) instead. [-Wdeprecated-declarations]
case F_LONGLONG: DO_SPRINTS("ll", long long, unsigned long long); break;
^
Objects/unicodeobject.c:2931:33: note: expanded from macro 'DO_SPRINTS'
case 'x': len = SPRINT(SIZE_SPEC, "x", UNSIGNED_TYPE); break; \
^
Objects/unicodeobject.c:2924:13: note: expanded from macro 'SPRINT'
sprintf(buffer, "%" SIZE_SPEC FMT_CHAR, va_arg(*vargs, TYPE))
^
/Library/Developer/CommandLineTools/SDKs/MacOSX.sdk/usr/include/stdio.h:180:1: note: 'sprintf' has been explicitly marked deprecated here
__deprecated_msg("This function is provided for compatibility reasons only. Due to security concerns inherent in the design of sprintf(3), it is highly recommended that you use snprintf(3) instead.")
^
/Library/Developer/CommandLineTools/SDKs/MacOSX.sdk/usr/include/sys/cdefs.h:215:48: note: expanded from macro '__deprecated_msg'
#define __deprecated_msg(_msg) __attribute__((__deprecated__(_msg)))
^
Objects/unicodeobject.c:2939:30: warning: 'sprintf' is deprecated: This function is provided for compatibility reasons only. Due to security concerns inherent in the design of sprintf(3), it is highly recommended that you use snprintf(3) instead. [-Wdeprecated-declarations]
case F_LONGLONG: DO_SPRINTS("ll", long long, unsigned long long); break;
^
Objects/unicodeobject.c:2932:33: note: expanded from macro 'DO_SPRINTS'
case 'X': len = SPRINT(SIZE_SPEC, "X", UNSIGNED_TYPE); break; \
^
Objects/unicodeobject.c:2924:13: note: expanded from macro 'SPRINT'
sprintf(buffer, "%" SIZE_SPEC FMT_CHAR, va_arg(*vargs, TYPE))
^
/Library/Developer/CommandLineTools/SDKs/MacOSX.sdk/usr/include/stdio.h:180:1: note: 'sprintf' has been explicitly marked deprecated here
__deprecated_msg("This function is provided for compatibility reasons only. Due to security concerns inherent in the design of sprintf(3), it is highly recommended that you use snprintf(3) instead.")
^
/Library/Developer/CommandLineTools/SDKs/MacOSX.sdk/usr/include/sys/cdefs.h:215:48: note: expanded from macro '__deprecated_msg'
#define __deprecated_msg(_msg) __attribute__((__deprecated__(_msg)))
^
Objects/unicodeobject.c:2939:30: warning: 'sprintf' is deprecated: This function is provided for compatibility reasons only. Due to security concerns inherent in the design of sprintf(3), it is highly recommended that you use snprintf(3) instead. [-Wdeprecated-declarations]
case F_LONGLONG: DO_SPRINTS("ll", long long, unsigned long long); break;
^
Objects/unicodeobject.c:2933:33: note: expanded from macro 'DO_SPRINTS'
default: len = SPRINT(SIZE_SPEC, "d", SIGNED_TYPE); break; \
^
Objects/unicodeobject.c:2924:13: note: expanded from macro 'SPRINT'
sprintf(buffer, "%" SIZE_SPEC FMT_CHAR, va_arg(*vargs, TYPE))
^
/Library/Developer/CommandLineTools/SDKs/MacOSX.sdk/usr/include/stdio.h:180:1: note: 'sprintf' has been explicitly marked deprecated here
__deprecated_msg("This function is provided for compatibility reasons only. Due to security concerns inherent in the design of sprintf(3), it is highly recommended that you use snprintf(3) instead.")
^
/Library/Developer/CommandLineTools/SDKs/MacOSX.sdk/usr/include/sys/cdefs.h:215:48: note: expanded from macro '__deprecated_msg'
#define __deprecated_msg(_msg) __attribute__((__deprecated__(_msg)))
^
Objects/unicodeobject.c:2940:30: warning: 'sprintf' is deprecated: This function is provided for compatibility reasons only. Due to security concerns inherent in the design of sprintf(3), it is highly recommended that you use snprintf(3) instead. [-Wdeprecated-declarations]
case F_SIZE: DO_SPRINTS("z", Py_ssize_t, size_t); break;
^
Objects/unicodeobject.c:2929:33: note: expanded from macro 'DO_SPRINTS'
case 'o': len = SPRINT(SIZE_SPEC, "o", UNSIGNED_TYPE); break; \
^
Objects/unicodeobject.c:2924:13: note: expanded from macro 'SPRINT'
sprintf(buffer, "%" SIZE_SPEC FMT_CHAR, va_arg(*vargs, TYPE))
^
/Library/Developer/CommandLineTools/SDKs/MacOSX.sdk/usr/include/stdio.h:180:1: note: 'sprintf' has been explicitly marked deprecated here
__deprecated_msg("This function is provided for compatibility reasons only. Due to security concerns inherent in the design of sprintf(3), it is highly recommended that you use snprintf(3) instead.")
^
/Library/Developer/CommandLineTools/SDKs/MacOSX.sdk/usr/include/sys/cdefs.h:215:48: note: expanded from macro '__deprecated_msg'
#define __deprecated_msg(_msg) __attribute__((__deprecated__(_msg)))
^
Objects/unicodeobject.c:2940:30: warning: 'sprintf' is deprecated: This function is provided for compatibility reasons only. Due to security concerns inherent in the design of sprintf(3), it is highly recommended that you use snprintf(3) instead. [-Wdeprecated-declarations]
case F_SIZE: DO_SPRINTS("z", Py_ssize_t, size_t); break;
^
Objects/unicodeobject.c:2930:33: note: expanded from macro 'DO_SPRINTS'
case 'u': len = SPRINT(SIZE_SPEC, "u", UNSIGNED_TYPE); break; \
^
Objects/unicodeobject.c:2924:13: note: expanded from macro 'SPRINT'
sprintf(buffer, "%" SIZE_SPEC FMT_CHAR, va_arg(*vargs, TYPE))
^
/Library/Developer/CommandLineTools/SDKs/MacOSX.sdk/usr/include/stdio.h:180:1: note: 'sprintf' has been explicitly marked deprecated here
__deprecated_msg("This function is provided for compatibility reasons only. Due to security concerns inherent in the design of sprintf(3), it is highly recommended that you use snprintf(3) instead.")
^
/Library/Developer/CommandLineTools/SDKs/MacOSX.sdk/usr/include/sys/cdefs.h:215:48: note: expanded from macro '__deprecated_msg'
#define __deprecated_msg(_msg) __attribute__((__deprecated__(_msg)))
^
Objects/unicodeobject.c:2940:30: warning: 'sprintf' is deprecated: This function is provided for compatibility reasons only. Due to security concerns inherent in the design of sprintf(3), it is highly recommended that you use snprintf(3) instead. [-Wdeprecated-declarations]
case F_SIZE: DO_SPRINTS("z", Py_ssize_t, size_t); break;
^
Objects/unicodeobject.c:2931:33: note: expanded from macro 'DO_SPRINTS'
case 'x': len = SPRINT(SIZE_SPEC, "x", UNSIGNED_TYPE); break; \
^
Objects/unicodeobject.c:2924:13: note: expanded from macro 'SPRINT'
sprintf(buffer, "%" SIZE_SPEC FMT_CHAR, va_arg(*vargs, TYPE))
^
/Library/Developer/CommandLineTools/SDKs/MacOSX.sdk/usr/include/stdio.h:180:1: note: 'sprintf' has been explicitly marked deprecated here
__deprecated_msg("This function is provided for compatibility reasons only. Due to security concerns inherent in the design of sprintf(3), it is highly recommended that you use snprintf(3) instead.")
^
/Library/Developer/CommandLineTools/SDKs/MacOSX.sdk/usr/include/sys/cdefs.h:215:48: note: expanded from macro '__deprecated_msg'
#define __deprecated_msg(_msg) __attribute__((__deprecated__(_msg)))
^
Objects/unicodeobject.c:2940:30: warning: 'sprintf' is deprecated: This function is provided for compatibility reasons only. Due to security concerns inherent in the design of sprintf(3), it is highly recommended that you use snprintf(3) instead. [-Wdeprecated-declarations]
case F_SIZE: DO_SPRINTS("z", Py_ssize_t, size_t); break;
^
Objects/unicodeobject.c:2932:33: note: expanded from macro 'DO_SPRINTS'
case 'X': len = SPRINT(SIZE_SPEC, "X", UNSIGNED_TYPE); break; \
^
Objects/unicodeobject.c:2924:13: note: expanded from macro 'SPRINT'
sprintf(buffer, "%" SIZE_SPEC FMT_CHAR, va_arg(*vargs, TYPE))
^
/Library/Developer/CommandLineTools/SDKs/MacOSX.sdk/usr/include/stdio.h:180:1: note: 'sprintf' has been explicitly marked deprecated here
__deprecated_msg("This function is provided for compatibility reasons only. Due to security concerns inherent in the design of sprintf(3), it is highly recommended that you use snprintf(3) instead.")
^
/Library/Developer/CommandLineTools/SDKs/MacOSX.sdk/usr/include/sys/cdefs.h:215:48: note: expanded from macro '__deprecated_msg'
#define __deprecated_msg(_msg) __attribute__((__deprecated__(_msg)))
^
Objects/unicodeobject.c:2940:30: warning: 'sprintf' is deprecated: This function is provided for compatibility reasons only. Due to security concerns inherent in the design of sprintf(3), it is highly recommended that you use snprintf(3) instead. [-Wdeprecated-declarations]
case F_SIZE: DO_SPRINTS("z", Py_ssize_t, size_t); break;
^
Objects/unicodeobject.c:2933:33: note: expanded from macro 'DO_SPRINTS'
default: len = SPRINT(SIZE_SPEC, "d", SIGNED_TYPE); break; \
^
Objects/unicodeobject.c:2924:13: note: expanded from macro 'SPRINT'
sprintf(buffer, "%" SIZE_SPEC FMT_CHAR, va_arg(*vargs, TYPE))
^
/Library/Developer/CommandLineTools/SDKs/MacOSX.sdk/usr/include/stdio.h:180:1: note: 'sprintf' has been explicitly marked deprecated here
__deprecated_msg("This function is provided for compatibility reasons only. Due to security concerns inherent in the design of sprintf(3), it is highly recommended that you use snprintf(3) instead.")
^
/Library/Developer/CommandLineTools/SDKs/MacOSX.sdk/usr/include/sys/cdefs.h:215:48: note: expanded from macro '__deprecated_msg'
#define __deprecated_msg(_msg) __attribute__((__deprecated__(_msg)))
^
Objects/unicodeobject.c:2941:30: warning: 'sprintf' is deprecated: This function is provided for compatibility reasons only. Due to security concerns inherent in the design of sprintf(3), it is highly recommended that you use snprintf(3) instead. [-Wdeprecated-declarations]
case F_PTRDIFF: DO_SPRINTS("t", ptrdiff_t, ptrdiff_t); break;
^
Objects/unicodeobject.c:2929:33: note: expanded from macro 'DO_SPRINTS'
case 'o': len = SPRINT(SIZE_SPEC, "o", UNSIGNED_TYPE); break; \
^
Objects/unicodeobject.c:2924:13: note: expanded from macro 'SPRINT'
sprintf(buffer, "%" SIZE_SPEC FMT_CHAR, va_arg(*vargs, TYPE))
^
/Library/Developer/CommandLineTools/SDKs/MacOSX.sdk/usr/include/stdio.h:180:1: note: 'sprintf' has been explicitly marked deprecated here
__deprecated_msg("This function is provided for compatibility reasons only. Due to security concerns inherent in the design of sprintf(3), it is highly recommended that you use snprintf(3) instead.")
^
/Library/Developer/CommandLineTools/SDKs/MacOSX.sdk/usr/include/sys/cdefs.h:215:48: note: expanded from macro '__deprecated_msg'
#define __deprecated_msg(_msg) __attribute__((__deprecated__(_msg)))
^
Objects/unicodeobject.c:2941:30: warning: 'sprintf' is deprecated: This function is provided for compatibility reasons only. Due to security concerns inherent in the design of sprintf(3), it is highly recommended that you use snprintf(3) instead. [-Wdeprecated-declarations]
case F_PTRDIFF: DO_SPRINTS("t", ptrdiff_t, ptrdiff_t); break;
^
Objects/unicodeobject.c:2930:33: note: expanded from macro 'DO_SPRINTS'
case 'u': len = SPRINT(SIZE_SPEC, "u", UNSIGNED_TYPE); break; \
^
Objects/unicodeobject.c:2924:13: note: expanded from macro 'SPRINT'
sprintf(buffer, "%" SIZE_SPEC FMT_CHAR, va_arg(*vargs, TYPE))
^
/Library/Developer/CommandLineTools/SDKs/MacOSX.sdk/usr/include/stdio.h:180:1: note: 'sprintf' has been explicitly marked deprecated here
__deprecated_msg("This function is provided for compatibility reasons only. Due to security concerns inherent in the design of sprintf(3), it is highly recommended that you use snprintf(3) instead.")
^
/Library/Developer/CommandLineTools/SDKs/MacOSX.sdk/usr/include/sys/cdefs.h:215:48: note: expanded from macro '__deprecated_msg'
#define __deprecated_msg(_msg) __attribute__((__deprecated__(_msg)))
^
Objects/unicodeobject.c:2941:30: warning: 'sprintf' is deprecated: This function is provided for compatibility reasons only. Due to security concerns inherent in the design of sprintf(3), it is highly recommended that you use snprintf(3) instead. [-Wdeprecated-declarations]
case F_PTRDIFF: DO_SPRINTS("t", ptrdiff_t, ptrdiff_t); break;
^
Objects/unicodeobject.c:2931:33: note: expanded from macro 'DO_SPRINTS'
case 'x': len = SPRINT(SIZE_SPEC, "x", UNSIGNED_TYPE); break; \
^
Objects/unicodeobject.c:2924:13: note: expanded from macro 'SPRINT'
sprintf(buffer, "%" SIZE_SPEC FMT_CHAR, va_arg(*vargs, TYPE))
^
/Library/Developer/CommandLineTools/SDKs/MacOSX.sdk/usr/include/stdio.h:180:1: note: 'sprintf' has been explicitly marked deprecated here
__deprecated_msg("This function is provided for compatibility reasons only. Due to security concerns inherent in the design of sprintf(3), it is highly recommended that you use snprintf(3) instead.")
^
/Library/Developer/CommandLineTools/SDKs/MacOSX.sdk/usr/include/sys/cdefs.h:215:48: note: expanded from macro '__deprecated_msg'
#define __deprecated_msg(_msg) __attribute__((__deprecated__(_msg)))
^
Objects/unicodeobject.c:2941:30: warning: 'sprintf' is deprecated: This function is provided for compatibility reasons only. Due to security concerns inherent in the design of sprintf(3), it is highly recommended that you use snprintf(3) instead. [-Wdeprecated-declarations]
case F_PTRDIFF: DO_SPRINTS("t", ptrdiff_t, ptrdiff_t); break;
^
Objects/unicodeobject.c:2932:33: note: expanded from macro 'DO_SPRINTS'
case 'X': len = SPRINT(SIZE_SPEC, "X", UNSIGNED_TYPE); break; \
^
Objects/unicodeobject.c:2924:13: note: expanded from macro 'SPRINT'
sprintf(buffer, "%" SIZE_SPEC FMT_CHAR, va_arg(*vargs, TYPE))
^
/Library/Developer/CommandLineTools/SDKs/MacOSX.sdk/usr/include/stdio.h:180:1: note: 'sprintf' has been explicitly marked deprecated here
__deprecated_msg("This function is provided for compatibility reasons only. Due to security concerns inherent in the design of sprintf(3), it is highly recommended that you use snprintf(3) instead.")
^
/Library/Developer/CommandLineTools/SDKs/MacOSX.sdk/usr/include/sys/cdefs.h:215:48: note: expanded from macro '__deprecated_msg'
#define __deprecated_msg(_msg) __attribute__((__deprecated__(_msg)))
^
Objects/unicodeobject.c:2941:30: warning: 'sprintf' is deprecated: This function is provided for compatibility reasons only. Due to security concerns inherent in the design of sprintf(3), it is highly recommended that you use snprintf(3) instead. [-Wdeprecated-declarations]
case F_PTRDIFF: DO_SPRINTS("t", ptrdiff_t, ptrdiff_t); break;
^
Objects/unicodeobject.c:2933:33: note: expanded from macro 'DO_SPRINTS'
default: len = SPRINT(SIZE_SPEC, "d", SIGNED_TYPE); break; \
^
Objects/unicodeobject.c:2924:13: note: expanded from macro 'SPRINT'
sprintf(buffer, "%" SIZE_SPEC FMT_CHAR, va_arg(*vargs, TYPE))
^
/Library/Developer/CommandLineTools/SDKs/MacOSX.sdk/usr/include/stdio.h:180:1: note: 'sprintf' has been explicitly marked deprecated here
__deprecated_msg("This function is provided for compatibility reasons only. Due to security concerns inherent in the design of sprintf(3), it is highly recommended that you use snprintf(3) instead.")
^
/Library/Developer/CommandLineTools/SDKs/MacOSX.sdk/usr/include/sys/cdefs.h:215:48: note: expanded from macro '__deprecated_msg'
#define __deprecated_msg(_msg) __attribute__((__deprecated__(_msg)))
^
Objects/unicodeobject.c:2942:30: warning: 'sprintf' is deprecated: This function is provided for compatibility reasons only. Due to security concerns inherent in the design of sprintf(3), it is highly recommended that you use snprintf(3) instead. [-Wdeprecated-declarations]
case F_INTMAX: DO_SPRINTS("j", intmax_t, uintmax_t); break;
^
Objects/unicodeobject.c:2929:33: note: expanded from macro 'DO_SPRINTS'
case 'o': len = SPRINT(SIZE_SPEC, "o", UNSIGNED_TYPE); break; \
^
Objects/unicodeobject.c:2924:13: note: expanded from macro 'SPRINT'
sprintf(buffer, "%" SIZE_SPEC FMT_CHAR, va_arg(*vargs, TYPE))
^
/Library/Developer/CommandLineTools/SDKs/MacOSX.sdk/usr/include/stdio.h:180:1: note: 'sprintf' has been explicitly marked deprecated here
__deprecated_msg("This function is provided for compatibility reasons only. Due to security concerns inherent in the design of sprintf(3), it is highly recommended that you use snprintf(3) instead.")
^
/Library/Developer/CommandLineTools/SDKs/MacOSX.sdk/usr/include/sys/cdefs.h:215:48: note: expanded from macro '__deprecated_msg'
#define __deprecated_msg(_msg) __attribute__((__deprecated__(_msg)))
^
Objects/unicodeobject.c:2942:30: warning: 'sprintf' is deprecated: This function is provided for compatibility reasons only. Due to security concerns inherent in the design of sprintf(3), it is highly recommended that you use snprintf(3) instead. [-Wdeprecated-declarations]
case F_INTMAX: DO_SPRINTS("j", intmax_t, uintmax_t); break;
^
Objects/unicodeobject.c:2930:33: note: expanded from macro 'DO_SPRINTS'
case 'u': len = SPRINT(SIZE_SPEC, "u", UNSIGNED_TYPE); break; \
^
Objects/unicodeobject.c:2924:13: note: expanded from macro 'SPRINT'
sprintf(buffer, "%" SIZE_SPEC FMT_CHAR, va_arg(*vargs, TYPE))
^
/Library/Developer/CommandLineTools/SDKs/MacOSX.sdk/usr/include/stdio.h:180:1: note: 'sprintf' has been explicitly marked deprecated here
__deprecated_msg("This function is provided for compatibility reasons only. Due to security concerns inherent in the design of sprintf(3), it is highly recommended that you use snprintf(3) instead.")
^
/Library/Developer/CommandLineTools/SDKs/MacOSX.sdk/usr/include/sys/cdefs.h:215:48: note: expanded from macro '__deprecated_msg'
#define __deprecated_msg(_msg) __attribute__((__deprecated__(_msg)))
^
Objects/unicodeobject.c:2942:30: warning: 'sprintf' is deprecated: This function is provided for compatibility reasons only. Due to security concerns inherent in the design of sprintf(3), it is highly recommended that you use snprintf(3) instead. [-Wdeprecated-declarations]
case F_INTMAX: DO_SPRINTS("j", intmax_t, uintmax_t); break;
^
Objects/unicodeobject.c:2931:33: note: expanded from macro 'DO_SPRINTS'
case 'x': len = SPRINT(SIZE_SPEC, "x", UNSIGNED_TYPE); break; \
^
Objects/unicodeobject.c:2924:13: note: expanded from macro 'SPRINT'
sprintf(buffer, "%" SIZE_SPEC FMT_CHAR, va_arg(*vargs, TYPE))
^
/Library/Developer/CommandLineTools/SDKs/MacOSX.sdk/usr/include/stdio.h:180:1: note: 'sprintf' has been explicitly marked deprecated here
__deprecated_msg("This function is provided for compatibility reasons only. Due to security concerns inherent in the design of sprintf(3), it is highly recommended that you use snprintf(3) instead.")
^
/Library/Developer/CommandLineTools/SDKs/MacOSX.sdk/usr/include/sys/cdefs.h:215:48: note: expanded from macro '__deprecated_msg'
#define __deprecated_msg(_msg) __attribute__((__deprecated__(_msg)))
^
Objects/unicodeobject.c:2942:30: warning: 'sprintf' is deprecated: This function is provided for compatibility reasons only. Due to security concerns inherent in the design of sprintf(3), it is highly recommended that you use snprintf(3) instead. [-Wdeprecated-declarations]
case F_INTMAX: DO_SPRINTS("j", intmax_t, uintmax_t); break;
^
Objects/unicodeobject.c:2932:33: note: expanded from macro 'DO_SPRINTS'
case 'X': len = SPRINT(SIZE_SPEC, "X", UNSIGNED_TYPE); break; \
^
Objects/unicodeobject.c:2924:13: note: expanded from macro 'SPRINT'
sprintf(buffer, "%" SIZE_SPEC FMT_CHAR, va_arg(*vargs, TYPE))
^
/Library/Developer/CommandLineTools/SDKs/MacOSX.sdk/usr/include/stdio.h:180:1: note: 'sprintf' has been explicitly marked deprecated here
__deprecated_msg("This function is provided for compatibility reasons only. Due to security concerns inherent in the design of sprintf(3), it is highly recommended that you use snprintf(3) instead.")
^
/Library/Developer/CommandLineTools/SDKs/MacOSX.sdk/usr/include/sys/cdefs.h:215:48: note: expanded from macro '__deprecated_msg'
#define __deprecated_msg(_msg) __attribute__((__deprecated__(_msg)))
^
Objects/unicodeobject.c:2942:30: warning: 'sprintf' is deprecated: This function is provided for compatibility reasons only. Due to security concerns inherent in the design of sprintf(3), it is highly recommended that you use snprintf(3) instead. [-Wdeprecated-declarations]
case F_INTMAX: DO_SPRINTS("j", intmax_t, uintmax_t); break;
^
Objects/unicodeobject.c:2933:33: note: expanded from macro 'DO_SPRINTS'
default: len = SPRINT(SIZE_SPEC, "d", SIGNED_TYPE); break; \
^
Objects/unicodeobject.c:2924:13: note: expanded from macro 'SPRINT'
sprintf(buffer, "%" SIZE_SPEC FMT_CHAR, va_arg(*vargs, TYPE))
^
/Library/Developer/CommandLineTools/SDKs/MacOSX.sdk/usr/include/stdio.h:180:1: note: 'sprintf' has been explicitly marked deprecated here
__deprecated_msg("This function is provided for compatibility reasons only. Due to security concerns inherent in the design of sprintf(3), it is highly recommended that you use snprintf(3) instead.")
^
/Library/Developer/CommandLineTools/SDKs/MacOSX.sdk/usr/include/sys/cdefs.h:215:48: note: expanded from macro '__deprecated_msg'
#define __deprecated_msg(_msg) __attribute__((__deprecated__(_msg)))
^
Objects/unicodeobject.c:2943:30: warning: 'sprintf' is deprecated: This function is provided for compatibility reasons only. Due to security concerns inherent in the design of sprintf(3), it is highly recommended that you use snprintf(3) instead. [-Wdeprecated-declarations]
default: DO_SPRINTS("", int, unsigned int); break;
^
Objects/unicodeobject.c:2929:33: note: expanded from macro 'DO_SPRINTS'
case 'o': len = SPRINT(SIZE_SPEC, "o", UNSIGNED_TYPE); break; \
^
Objects/unicodeobject.c:2924:13: note: expanded from macro 'SPRINT'
sprintf(buffer, "%" SIZE_SPEC FMT_CHAR, va_arg(*vargs, TYPE))
^
/Library/Developer/CommandLineTools/SDKs/MacOSX.sdk/usr/include/stdio.h:180:1: note: 'sprintf' has been explicitly marked deprecated here
__deprecated_msg("This function is provided for compatibility reasons only. Due to security concerns inherent in the design of sprintf(3), it is highly recommended that you use snprintf(3) instead.")
^
/Library/Developer/CommandLineTools/SDKs/MacOSX.sdk/usr/include/sys/cdefs.h:215:48: note: expanded from macro '__deprecated_msg'
#define __deprecated_msg(_msg) __attribute__((__deprecated__(_msg)))
^
Objects/unicodeobject.c:2943:30: warning: 'sprintf' is deprecated: This function is provided for compatibility reasons only. Due to security concerns inherent in the design of sprintf(3), it is highly recommended that you use snprintf(3) instead. [-Wdeprecated-declarations]
default: DO_SPRINTS("", int, unsigned int); break;
^
Objects/unicodeobject.c:2930:33: note: expanded from macro 'DO_SPRINTS'
case 'u': len = SPRINT(SIZE_SPEC, "u", UNSIGNED_TYPE); break; \
^
Objects/unicodeobject.c:2924:13: note: expanded from macro 'SPRINT'
sprintf(buffer, "%" SIZE_SPEC FMT_CHAR, va_arg(*vargs, TYPE))
^
/Library/Developer/CommandLineTools/SDKs/MacOSX.sdk/usr/include/stdio.h:180:1: note: 'sprintf' has been explicitly marked deprecated here
__deprecated_msg("This function is provided for compatibility reasons only. Due to security concerns inherent in the design of sprintf(3), it is highly recommended that you use snprintf(3) instead.")
^
/Library/Developer/CommandLineTools/SDKs/MacOSX.sdk/usr/include/sys/cdefs.h:215:48: note: expanded from macro '__deprecated_msg'
#define __deprecated_msg(_msg) __attribute__((__deprecated__(_msg)))
^
Objects/unicodeobject.c:2943:30: warning: 'sprintf' is deprecated: This function is provided for compatibility reasons only. Due to security concerns inherent in the design of sprintf(3), it is highly recommended that you use snprintf(3) instead. [-Wdeprecated-declarations]
default: DO_SPRINTS("", int, unsigned int); break;
^
Objects/unicodeobject.c:2931:33: note: expanded from macro 'DO_SPRINTS'
case 'x': len = SPRINT(SIZE_SPEC, "x", UNSIGNED_TYPE); break; \
^
Objects/unicodeobject.c:2924:13: note: expanded from macro 'SPRINT'
sprintf(buffer, "%" SIZE_SPEC FMT_CHAR, va_arg(*vargs, TYPE))
^
/Library/Developer/CommandLineTools/SDKs/MacOSX.sdk/usr/include/stdio.h:180:1: note: 'sprintf' has been explicitly marked deprecated here
__deprecated_msg("This function is provided for compatibility reasons only. Due to security concerns inherent in the design of sprintf(3), it is highly recommended that you use snprintf(3) instead.")
^
/Library/Developer/CommandLineTools/SDKs/MacOSX.sdk/usr/include/sys/cdefs.h:215:48: note: expanded from macro '__deprecated_msg'
#define __deprecated_msg(_msg) __attribute__((__deprecated__(_msg)))
^
Objects/unicodeobject.c:2943:30: warning: 'sprintf' is deprecated: This function is provided for compatibility reasons only. Due to security concerns inherent in the design of sprintf(3), it is highly recommended that you use snprintf(3) instead. [-Wdeprecated-declarations]
default: DO_SPRINTS("", int, unsigned int); break;
^
Objects/unicodeobject.c:2932:33: note: expanded from macro 'DO_SPRINTS'
case 'X': len = SPRINT(SIZE_SPEC, "X", UNSIGNED_TYPE); break; \
^
Objects/unicodeobject.c:2924:13: note: expanded from macro 'SPRINT'
sprintf(buffer, "%" SIZE_SPEC FMT_CHAR, va_arg(*vargs, TYPE))
^
/Library/Developer/CommandLineTools/SDKs/MacOSX.sdk/usr/include/stdio.h:180:1: note: 'sprintf' has been explicitly marked deprecated here
__deprecated_msg("This function is provided for compatibility reasons only. Due to security concerns inherent in the design of sprintf(3), it is highly recommended that you use snprintf(3) instead.")
^
/Library/Developer/CommandLineTools/SDKs/MacOSX.sdk/usr/include/sys/cdefs.h:215:48: note: expanded from macro '__deprecated_msg'
#define __deprecated_msg(_msg) __attribute__((__deprecated__(_msg)))
^
Objects/unicodeobject.c:2943:30: warning: 'sprintf' is deprecated: This function is provided for compatibility reasons only. Due to security concerns inherent in the design of sprintf(3), it is highly recommended that you use snprintf(3) instead. [-Wdeprecated-declarations]
default: DO_SPRINTS("", int, unsigned int); break;
^
Objects/unicodeobject.c:2933:33: note: expanded from macro 'DO_SPRINTS'
default: len = SPRINT(SIZE_SPEC, "d", SIGNED_TYPE); break; \
^
Objects/unicodeobject.c:2924:13: note: expanded from macro 'SPRINT'
sprintf(buffer, "%" SIZE_SPEC FMT_CHAR, va_arg(*vargs, TYPE))
^
/Library/Developer/CommandLineTools/SDKs/MacOSX.sdk/usr/include/stdio.h:180:1: note: 'sprintf' has been explicitly marked deprecated here
__deprecated_msg("This function is provided for compatibility reasons only. Due to security concerns inherent in the design of sprintf(3), it is highly recommended that you use snprintf(3) instead.")
^
/Library/Developer/CommandLineTools/SDKs/MacOSX.sdk/usr/include/sys/cdefs.h:215:48: note: expanded from macro '__deprecated_msg'
#define __deprecated_msg(_msg) __attribute__((__deprecated__(_msg)))
^
Objects/unicodeobject.c:2997:15: warning: 'sprintf' is deprecated: This function is provided for compatibility reasons only. Due to security concerns inherent in the design of sprintf(3), it is highly recommended that you use snprintf(3) instead. [-Wdeprecated-declarations]
len = sprintf(number, "%p", va_arg(*vargs, void*));
^
/Library/Developer/CommandLineTools/SDKs/MacOSX.sdk/usr/include/stdio.h:180:1: note: 'sprintf' has been explicitly marked deprecated here
__deprecated_msg("This function is provided for compatibility reasons only. Due to security concerns inherent in the design of sprintf(3), it is highly recommended that you use snprintf(3) instead.")
^
/Library/Developer/CommandLineTools/SDKs/MacOSX.sdk/usr/include/sys/cdefs.h:215:48: note: expanded from macro '__deprecated_msg'
#define __deprecated_msg(_msg) __attribute__((__deprecated__(_msg)))
^
Objects/unicodeobject.c:9018:13: warning: 'sprintf' is deprecated: This function is provided for compatibility reasons only. Due to security concerns inherent in the design of sprintf(3), it is highly recommended that you use snprintf(3) instead. [-Wdeprecated-declarations]
sprintf(buffer, "&#%d;", (int)PyUnicode_READ_CHAR(unicode, collpos));
^
/Library/Developer/CommandLineTools/SDKs/MacOSX.sdk/usr/include/stdio.h:180:1: note: 'sprintf' has been explicitly marked deprecated here
__deprecated_msg("This function is provided for compatibility reasons only. Due to security concerns inherent in the design of sprintf(3), it is highly recommended that you use snprintf(3) instead.")
^
/Library/Developer/CommandLineTools/SDKs/MacOSX.sdk/usr/include/sys/cdefs.h:215:48: note: expanded from macro '__deprecated_msg'
#define __deprecated_msg(_msg) __attribute__((__deprecated__(_msg)))
^
Python/ceval_gil.c:81:24: warning: code will never be executed [-Wunreachable-code]
int32_t npending = _Py_atomic_load_int32_relaxed(
^~~~~~~~~~~~~~~~~~~~~~~~~~~~~
1 warning generated.
1 warning generated.
Python/pystrtod.c:1204:19: warning: 'sprintf' is deprecated: This function is provided for compatibility reasons only. Due to security concerns inherent in the design of sprintf(3), it is highly recommended that you use snprintf(3) instead. [-Wdeprecated-declarations]
exp_len = sprintf(p, "%+.02d", exp);
^
/Library/Developer/CommandLineTools/SDKs/MacOSX.sdk/usr/include/stdio.h:180:1: note: 'sprintf' has been explicitly marked deprecated here
__deprecated_msg("This function is provided for compatibility reasons only. Due to security concerns inherent in the design of sprintf(3), it is highly recommended that you use snprintf(3) instead.")
^
/Library/Developer/CommandLineTools/SDKs/MacOSX.sdk/usr/include/sys/cdefs.h:215:48: note: expanded from macro '__deprecated_msg'
#define __deprecated_msg(_msg) __attribute__((__deprecated__(_msg)))
^
1 warning generated.
./Modules/_datetimemodule.c:1850:9: warning: 'sprintf' is deprecated: This function is provided for compatibility reasons only. Due to security concerns inherent in the design of sprintf(3), it is highly recommended that you use snprintf(3) instead. [-Wdeprecated-declarations]
sprintf(freplacement, "%06d", TIME_GET_MICROSECOND(object));
^
/Library/Developer/CommandLineTools/SDKs/MacOSX.sdk/usr/include/stdio.h:180:1: note: 'sprintf' has been explicitly marked deprecated here
__deprecated_msg("This function is provided for compatibility reasons only. Due to security concerns inherent in the design of sprintf(3), it is highly recommended that you use snprintf(3) instead.")
^
/Library/Developer/CommandLineTools/SDKs/MacOSX.sdk/usr/include/sys/cdefs.h:215:48: note: expanded from macro '__deprecated_msg'
#define __deprecated_msg(_msg) __attribute__((__deprecated__(_msg)))
^
./Modules/_datetimemodule.c:1852:9: warning: 'sprintf' is deprecated: This function is provided for compatibility reasons only. Due to security concerns inherent in the design of sprintf(3), it is highly recommended that you use snprintf(3) instead. [-Wdeprecated-declarations]
sprintf(freplacement, "%06d", DATE_GET_MICROSECOND(object));
^
/Library/Developer/CommandLineTools/SDKs/MacOSX.sdk/usr/include/stdio.h:180:1: note: 'sprintf' has been explicitly marked deprecated here
__deprecated_msg("This function is provided for compatibility reasons only. Due to security concerns inherent in the design of sprintf(3), it is highly recommended that you use snprintf(3) instead.")
^
/Library/Developer/CommandLineTools/SDKs/MacOSX.sdk/usr/include/sys/cdefs.h:215:48: note: expanded from macro '__deprecated_msg'
#define __deprecated_msg(_msg) __attribute__((__deprecated__(_msg)))
^
./Modules/_datetimemodule.c:1854:9: warning: 'sprintf' is deprecated: This function is provided for compatibility reasons only. Due to security concerns inherent in the design of sprintf(3), it is highly recommended that you use snprintf(3) instead. [-Wdeprecated-declarations]
sprintf(freplacement, "%06d", 0);
^
/Library/Developer/CommandLineTools/SDKs/MacOSX.sdk/usr/include/stdio.h:180:1: note: 'sprintf' has been explicitly marked deprecated here
__deprecated_msg("This function is provided for compatibility reasons only. Due to security concerns inherent in the design of sprintf(3), it is highly recommended that you use snprintf(3) instead.")
^
/Library/Developer/CommandLineTools/SDKs/MacOSX.sdk/usr/include/sys/cdefs.h:215:48: note: expanded from macro '__deprecated_msg'
#define __deprecated_msg(_msg) __attribute__((__deprecated__(_msg)))
^
3 warnings generated.
33 warnings generated.
Programs/_freeze_module.c:129:5: warning: 'sprintf' is deprecated: This function is provided for compatibility reasons only. Due to security concerns inherent in the design of sprintf(3), it is highly recommended that you use snprintf(3) instead. [-Wdeprecated-declarations]
sprintf(filename, "<frozen %s>", name);
^
/Library/Developer/CommandLineTools/SDKs/MacOSX.sdk/usr/include/stdio.h:180:1: note: 'sprintf' has been explicitly marked deprecated here
__deprecated_msg("This function is provided for compatibility reasons only. Due to security concerns inherent in the design of sprintf(3), it is highly recommended that you use snprintf(3) instead.")
^
/Library/Developer/CommandLineTools/SDKs/MacOSX.sdk/usr/include/sys/cdefs.h:215:48: note: expanded from macro '__deprecated_msg'
#define __deprecated_msg(_msg) __attribute__((__deprecated__(_msg)))
^
1 warning generated.
./Modules/_pickle.c:2156:13: warning: 'sprintf' is deprecated: This function is provided for compatibility reasons only. Due to security concerns inherent in the design of sprintf(3), it is highly recommended that you use snprintf(3) instead. [-Wdeprecated-declarations]
sprintf(pdata, "%c%ld\n", INT, val);
^
/Library/Developer/CommandLineTools/SDKs/MacOSX.sdk/usr/include/stdio.h:180:1: note: 'sprintf' has been explicitly marked deprecated here
__deprecated_msg("This function is provided for compatibility reasons only. Due to security concerns inherent in the design of sprintf(3), it is highly recommended that you use snprintf(3) instead.")
^
/Library/Developer/CommandLineTools/SDKs/MacOSX.sdk/usr/include/sys/cdefs.h:215:48: note: expanded from macro '__deprecated_msg'
#define __deprecated_msg(_msg) __attribute__((__deprecated__(_msg)))
^
1 warning generated.
./Modules/unicodedata.c:1334:9: warning: 'sprintf' is deprecated: This function is provided for compatibility reasons only. Due to security concerns inherent in the design of sprintf(3), it is highly recommended that you use snprintf(3) instead. [-Wdeprecated-declarations]
sprintf(buffer, "CJK UNIFIED IDEOGRAPH-%X", code);
^
/Library/Developer/CommandLineTools/SDKs/MacOSX.sdk/usr/include/stdio.h:180:1: note: 'sprintf' has been explicitly marked deprecated here
__deprecated_msg("This function is provided for compatibility reasons only. Due to security concerns inherent in the design of sprintf(3), it is highly recommended that you use snprintf(3) instead.")
^
/Library/Developer/CommandLineTools/SDKs/MacOSX.sdk/usr/include/sys/cdefs.h:215:48: note: expanded from macro '__deprecated_msg'
#define __deprecated_msg(_msg) __attribute__((__deprecated__(_msg)))
^
1 warning generated.
./Modules/_ctypes/_ctypes.c:389:17: warning: 'sprintf' is deprecated: This function is provided for compatibility reasons only. Due to security concerns inherent in the design of sprintf(3), it is highly recommended that you use snprintf(3) instead. [-Wdeprecated-declarations]
sprintf(buf, "%zd,", shape[k]);
^
/Library/Developer/CommandLineTools/SDKs/MacOSX.sdk/usr/include/stdio.h:180:1: note: 'sprintf' has been explicitly marked deprecated here
__deprecated_msg("This function is provided for compatibility reasons only. Due to security concerns inherent in the design of sprintf(3), it is highly recommended that you use snprintf(3) instead.")
^
/Library/Developer/CommandLineTools/SDKs/MacOSX.sdk/usr/include/sys/cdefs.h:215:48: note: expanded from macro '__deprecated_msg'
#define __deprecated_msg(_msg) __attribute__((__deprecated__(_msg)))
^
./Modules/_ctypes/_ctypes.c:391:17: warning: 'sprintf' is deprecated: This function is provided for compatibility reasons only. Due to security concerns inherent in the design of sprintf(3), it is highly recommended that you use snprintf(3) instead. [-Wdeprecated-declarations]
sprintf(buf, "%zd)", shape[k]);
^
/Library/Developer/CommandLineTools/SDKs/MacOSX.sdk/usr/include/stdio.h:180:1: note: 'sprintf' has been explicitly marked deprecated here
__deprecated_msg("This function is provided for compatibility reasons only. Due to security concerns inherent in the design of sprintf(3), it is highly recommended that you use snprintf(3) instead.")
^
/Library/Developer/CommandLineTools/SDKs/MacOSX.sdk/usr/include/sys/cdefs.h:215:48: note: expanded from macro '__deprecated_msg'
#define __deprecated_msg(_msg) __attribute__((__deprecated__(_msg)))
^
./Modules/_ctypes/_ctypes.c:2925:11: warning: 'sprintf' is deprecated: This function is provided for compatibility reasons only. Due to security concerns inherent in the design of sprintf(3), it is highly recommended that you use snprintf(3) instead. [-Wdeprecated-declarations]
cp += sprintf(cp, "%x", Py_SAFE_DOWNCAST(index, Py_ssize_t, int));
^
/Library/Developer/CommandLineTools/SDKs/MacOSX.sdk/usr/include/stdio.h:180:1: note: 'sprintf' has been explicitly marked deprecated here
__deprecated_msg("This function is provided for compatibility reasons only. Due to security concerns inherent in the design of sprintf(3), it is highly recommended that you use snprintf(3) instead.")
^
/Library/Developer/CommandLineTools/SDKs/MacOSX.sdk/usr/include/sys/cdefs.h:215:48: note: expanded from macro '__deprecated_msg'
#define __deprecated_msg(_msg) __attribute__((__deprecated__(_msg)))
^
./Modules/_ctypes/_ctypes.c:2934:15: warning: 'sprintf' is deprecated: This function is provided for compatibility reasons only. Due to security concerns inherent in the design of sprintf(3), it is highly recommended that you use snprintf(3) instead. [-Wdeprecated-declarations]
cp += sprintf(cp, ":%x", Py_SAFE_DOWNCAST(target->b_index, Py_ssize_t, int));
^
/Library/Developer/CommandLineTools/SDKs/MacOSX.sdk/usr/include/stdio.h:180:1: note: 'sprintf' has been explicitly marked deprecated here
__deprecated_msg("This function is provided for compatibility reasons only. Due to security concerns inherent in the design of sprintf(3), it is highly recommended that you use snprintf(3) instead.")
^
/Library/Developer/CommandLineTools/SDKs/MacOSX.sdk/usr/include/sys/cdefs.h:215:48: note: expanded from macro '__deprecated_msg'
#define __deprecated_msg(_msg) __attribute__((__deprecated__(_msg)))
^
./Modules/_ctypes/_ctypes.c:5355:5: warning: 'sprintf' is deprecated: This function is provided for compatibility reasons only. Due to security concerns inherent in the design of sprintf(3), it is highly recommended that you use snprintf(3) instead. [-Wdeprecated-declarations]
sprintf(name, "%.200s_Array_%ld",
^
/Library/Developer/CommandLineTools/SDKs/MacOSX.sdk/usr/include/stdio.h:180:1: note: 'sprintf' has been explicitly marked deprecated here
__deprecated_msg("This function is provided for compatibility reasons only. Due to security concerns inherent in the design of sprintf(3), it is highly recommended that you use snprintf(3) instead.")
^
/Library/Developer/CommandLineTools/SDKs/MacOSX.sdk/usr/include/sys/cdefs.h:215:48: note: expanded from macro '__deprecated_msg'
#define __deprecated_msg(_msg) __attribute__((__deprecated__(_msg)))
^
./Modules/_testcapimodule.c:786:17: warning: 'sprintf' is deprecated: This function is provided for compatibility reasons only. Due to security concerns inherent in the design of sprintf(3), it is highly recommended that you use snprintf(3) instead. [-Wdeprecated-declarations]
FAIL("PyCapsule_GetPointer returned NULL unexpectedly!");
^
./Modules/_testcapimodule.c:775:13: note: expanded from macro 'FAIL'
sprintf(buffer, "%s module: \"%s\" attribute: \"%s\"", \
^
/Library/Developer/CommandLineTools/SDKs/MacOSX.sdk/usr/include/stdio.h:180:1: note: 'sprintf' has been explicitly marked deprecated here
__deprecated_msg("This function is provided for compatibility reasons only. Due to security concerns inherent in the design of sprintf(3), it is highly recommended that you use snprintf(3) instead.")
^
/Library/Developer/CommandLineTools/SDKs/MacOSX.sdk/usr/include/sys/cdefs.h:215:48: note: expanded from macro '__deprecated_msg'
#define __deprecated_msg(_msg) __attribute__((__deprecated__(_msg)))
^
./Modules/_testcapimodule.c:798:17: warning: 'sprintf' is deprecated: This function is provided for compatibility reasons only. Due to security concerns inherent in the design of sprintf(3), it is highly recommended that you use snprintf(3) instead. [-Wdeprecated-declarations]
FAIL("PyCapsule_GetPointer should have failed but did not!");
^
./Modules/_testcapimodule.c:775:13: note: expanded from macro 'FAIL'
sprintf(buffer, "%s module: \"%s\" attribute: \"%s\"", \
^
/Library/Developer/CommandLineTools/SDKs/MacOSX.sdk/usr/include/stdio.h:180:1: note: 'sprintf' has been explicitly marked deprecated here
__deprecated_msg("This function is provided for compatibility reasons only. Due to security concerns inherent in the design of sprintf(3), it is highly recommended that you use snprintf(3) instead.")
^
/Library/Developer/CommandLineTools/SDKs/MacOSX.sdk/usr/include/sys/cdefs.h:215:48: note: expanded from macro '__deprecated_msg'
#define __deprecated_msg(_msg) __attribute__((__deprecated__(_msg)))
^
./Modules/_testcapimodule.c:805:21: warning: 'sprintf' is deprecated: This function is provided for compatibility reasons only. Due to security concerns inherent in the design of sprintf(3), it is highly recommended that you use snprintf(3) instead. [-Wdeprecated-declarations]
FAIL("PyCapsule_GetPointer should not have"
^
./Modules/_testcapimodule.c:775:13: note: expanded from macro 'FAIL'
sprintf(buffer, "%s module: \"%s\" attribute: \"%s\"", \
^
/Library/Developer/CommandLineTools/SDKs/MacOSX.sdk/usr/include/stdio.h:180:1: note: 'sprintf' has been explicitly marked deprecated here
__deprecated_msg("This function is provided for compatibility reasons only. Due to security concerns inherent in the design of sprintf(3), it is highly recommended that you use snprintf(3) instead.")
^
/Library/Developer/CommandLineTools/SDKs/MacOSX.sdk/usr/include/sys/cdefs.h:215:48: note: expanded from macro '__deprecated_msg'
#define __deprecated_msg(_msg) __attribute__((__deprecated__(_msg)))
^
./Modules/_testcapimodule.c:808:21: warning: 'sprintf' is deprecated: This function is provided for compatibility reasons only. Due to security concerns inherent in the design of sprintf(3), it is highly recommended that you use snprintf(3) instead. [-Wdeprecated-declarations]
FAIL("PyCapsule_GetPointer should have"
^
./Modules/_testcapimodule.c:775:13: note: expanded from macro 'FAIL'
sprintf(buffer, "%s module: \"%s\" attribute: \"%s\"", \
^
/Library/Developer/CommandLineTools/SDKs/MacOSX.sdk/usr/include/stdio.h:180:1: note: 'sprintf' has been explicitly marked deprecated here
__deprecated_msg("This function is provided for compatibility reasons only. Due to security concerns inherent in the design of sprintf(3), it is highly recommended that you use snprintf(3) instead.")
^
/Library/Developer/CommandLineTools/SDKs/MacOSX.sdk/usr/include/sys/cdefs.h:215:48: note: expanded from macro '__deprecated_msg'
#define __deprecated_msg(_msg) __attribute__((__deprecated__(_msg)))
^
5 warnings generated.
4 warnings generated.
ld: warning: search path '/opt/homebrew/lib' not found
ld: warning: search path '/opt/homebrew/lib' not found
ld: warning: search path '/opt/homebrew/lib' not found
ld: warning: search path '/opt/homebrew/lib' not found
ld: warning: search path '/opt/homebrew/lib' not found
ld: warning: search path '/opt/homebrew/lib' not found
ld: warning: search path '/opt/homebrew/lib' not found
ld: warning: search path '/opt/homebrew/lib' not found
ld: warning: search path '/opt/homebrew/lib' not found
ld: warning: search path '/opt/homebrew/lib' not found
ld: warning: search path '/opt/homebrew/lib' not found
ld: warning: search path '/opt/homebrew/lib' not found
ld: warning: search path '/opt/homebrew/lib' not found
ld: warning: search path '/opt/homebrew/lib' not found
ld: warning: search path '/opt/homebrew/lib' not found
ld: warning: search path '/opt/homebrew/lib' not found
ld: warning: search path '/opt/homebrew/lib' not found
ld: warning: search path '/opt/homebrew/lib' not found
ld: warning: search path '/opt/homebrew/lib' not found
ld: warning: search path '/opt/homebrew/lib' not found
ld: warning: search path '/opt/homebrew/lib' not found
ld: warning: search path '/opt/homebrew/lib' not found
ld: warning: search path '/opt/homebrew/lib' not found
ld: warning: search path '/opt/homebrew/lib' not found
ld: warning: search path '/opt/homebrew/lib' not found
ld: warning: search path '/opt/homebrew/lib' not found
ld: warning: search path '/opt/homebrew/lib' not found
ld: warning: search path '/opt/homebrew/lib' not found
ld: warning: search path '/opt/homebrew/lib' not found
ld: warning: search path '/opt/homebrew/lib' not found
ld: warning: search path '/opt/homebrew/lib' not found
ld: warning: search path '/opt/homebrew/lib' not found
ld: warning: search path '/opt/homebrew/lib' not found
ld: warning: search path '/opt/homebrew/lib' not found
ld: warning: search path '/opt/homebrew/lib' not found
ld: warning: search path '/opt/homebrew/lib' not found
ld: warning: search path '/opt/homebrew/lib' not found
ld: warning: search path '/opt/homebrew/lib' not found
ld: warning: search path '/opt/homebrew/lib' not found
ld: warning: search path '/opt/homebrew/lib' not found
ld: warning: search path '/opt/homebrew/lib' not found
ld: warning: search path '/opt/homebrew/lib' not found
ld: warning: search path '/opt/homebrew/lib' not found
ld: warning: search path '/opt/homebrew/lib' not found
ld: warning: search path '/opt/homebrew/lib' not found
ld: warning: search path '/opt/homebrew/lib' not found
ld: warning: search path '/opt/homebrew/lib' not found
ld: warning: search path '/opt/homebrew/lib' not found
ld: warning: search path '/opt/homebrew/lib' not found
ld: warning: search path '/opt/homebrew/lib' not found
ld: warning: search path '/opt/homebrew/lib' not found
ld: warning: search path '/opt/homebrew/lib' not found
ld: warning: search path '/opt/homebrew/lib' not found
ld: warning: search path '/opt/homebrew/lib' not found
ld: warning: search path '/opt/homebrew/lib' not found
ld: warning: search path '/opt/homebrew/lib' not found
ld: warning: search path '/opt/homebrew/lib' not found
ld: warning: search path '/opt/homebrew/lib' not found
ld: warning: search path '/opt/homebrew/lib' not found
ld: warning: search path '/opt/homebrew/lib' not found
ld: warning: search path '/opt/homebrew/lib' not found
ld: warning: search path '/opt/homebrew/lib' not found
ld: warning: search path '/opt/homebrew/lib' not found
ld: warning: search path '/opt/homebrew/lib' not found
ld: warning: search path '/opt/homebrew/lib' not found
ld: warning: search path '/opt/homebrew/lib' not found
ld: warning: search path '/opt/homebrew/lib' not found
ld: warning: search path '/opt/homebrew/lib' not found
ld: warning: search path '/opt/homebrew/lib' not found
ld: warning: search path '/opt/homebrew/lib' not found
ld: warning: search path '/opt/homebrew/lib' not found
ld: warning: search path '/opt/homebrew/lib' not found
ld: warning: search path '/opt/homebrew/lib' not found
ld: warning: search path '/opt/homebrew/lib' not found
ld: warning: search path '/opt/homebrew/lib' not found
ld: warning: search path '/opt/homebrew/lib' not found
make: *** [buildbottest] Error 2
Test report
===========
Failed tests:
- test_tracemalloc
Sincerely,
-The Buildbot
1
0
☠ Buildbot (Python): python/cpython - failed test (failure) (main)
by buildbot@python.org Sept. 15, 2025
by buildbot@python.org Sept. 15, 2025
Sept. 15, 2025
The Buildbot has detected a new failure on builder x86-64 MacOS Intel ASAN NoGIL 3.x while building python/cpython.
Full details are available at:
https://buildbot.python.org/#/builders/1366/builds/5040
Buildbot URL: https://buildbot.python.org/
Worker for this Build: itamaro-macos-intel-aws
Build Reason: <unknown>
Blamelist: Kumar Aditya <kumaraditya(a)python.org>, Savannah Bailey <savannahostrowski(a)gmail.com>, Serhiy Storchaka <storchaka(a)gmail.com>, Stan Ulbrych <89152624+StanFromIreland(a)users.noreply.github.com>, Victor Stinner <vstinner(a)python.org>
BUILD FAILED: failed test (failure)
Summary of the results of the build (if available):
===================================================
==
Captured traceback
==================
remote: Enumerating objects: 79, done.
remote: Counting objects: 1% (1/54)
remote: Counting objects: 3% (2/54)
remote: Counting objects: 5% (3/54)
remote: Counting objects: 7% (4/54)
remote: Counting objects: 9% (5/54)
remote: Counting objects: 11% (6/54)
remote: Counting objects: 12% (7/54)
remote: Counting objects: 14% (8/54)
remote: Counting objects: 16% (9/54)
remote: Counting objects: 18% (10/54)
remote: Counting objects: 20% (11/54)
remote: Counting objects: 22% (12/54)
remote: Counting objects: 24% (13/54)
remote: Counting objects: 25% (14/54)
remote: Counting objects: 27% (15/54)
remote: Counting objects: 29% (16/54)
remote: Counting objects: 31% (17/54)
remote: Counting objects: 33% (18/54)
remote: Counting objects: 35% (19/54)
remote: Counting objects: 37% (20/54)
remote: Counting objects: 38% (21/54)
remote: Counting objects: 40% (22/54)
remote: Counting objects: 42% (23/54)
remote: Counting objects: 44% (24/54)
remote: Counting objects: 46% (25/54)
remote: Counting objects: 48% (26/54)
remote: Counting objects: 50% (27/54)
remote: Counting objects: 51% (28/54)
remote: Counting objects: 53% (29/54)
remote: Counting objects: 55% (30/54)
remote: Counting objects: 57% (31/54)
remote: Counting objects: 59% (32/54)
remote: Counting objects: 61% (33/54)
remote: Counting objects: 62% (34/54)
remote: Counting objects: 64% (35/54)
remote: Counting objects: 66% (36/54)
remote: Counting objects: 68% (37/54)
remote: Counting objects: 70% (38/54)
remote: Counting objects: 72% (39/54)
remote: Counting objects: 74% (40/54)
remote: Counting objects: 75% (41/54)
remote: Counting objects: 77% (42/54)
remote: Counting objects: 79% (43/54)
remote: Counting objects: 81% (44/54)
remote: Counting objects: 83% (45/54)
remote: Counting objects: 85% (46/54)
remote: Counting objects: 87% (47/54)
remote: Counting objects: 88% (48/54)
remote: Counting objects: 90% (49/54)
remote: Counting objects: 92% (50/54)
remote: Counting objects: 94% (51/54)
remote: Counting objects: 96% (52/54)
remote: Counting objects: 98% (53/54)
remote: Counting objects: 100% (54/54)
remote: Counting objects: 100% (54/54), done.
remote: Compressing objects: 2% (1/34)
remote: Compressing objects: 5% (2/34)
remote: Compressing objects: 8% (3/34)
remote: Compressing objects: 11% (4/34)
remote: Compressing objects: 14% (5/34)
remote: Compressing objects: 17% (6/34)
remote: Compressing objects: 20% (7/34)
remote: Compressing objects: 23% (8/34)
remote: Compressing objects: 26% (9/34)
remote: Compressing objects: 29% (10/34)
remote: Compressing objects: 32% (11/34)
remote: Compressing objects: 35% (12/34)
remote: Compressing objects: 38% (13/34)
remote: Compressing objects: 41% (14/34)
remote: Compressing objects: 44% (15/34)
remote: Compressing objects: 47% (16/34)
remote: Compressing objects: 50% (17/34)
remote: Compressing objects: 52% (18/34)
remote: Compressing objects: 55% (19/34)
remote: Compressing objects: 58% (20/34)
remote: Compressing objects: 61% (21/34)
remote: Compressing objects: 64% (22/34)
remote: Compressing objects: 67% (23/34)
remote: Compressing objects: 70% (24/34)
remote: Compressing objects: 73% (25/34)
remote: Compressing objects: 76% (26/34)
remote: Compressing objects: 79% (27/34)
remote: Compressing objects: 82% (28/34)
remote: Compressing objects: 85% (29/34)
remote: Compressing objects: 88% (30/34)
remote: Compressing objects: 91% (31/34)
remote: Compressing objects: 94% (32/34)
remote: Compressing objects: 97% (33/34)
remote: Compressing objects: 100% (34/34)
remote: Compressing objects: 100% (34/34), done.
remote: Total 79 (delta 32), reused 20 (delta 20), pack-reused 25 (from 3)
From https://github.com/python/cpython
* branch main -> FETCH_HEAD
Note: switching to 'fa12c6bae47a41dd84e54b39d96bb73c4ba625c0'.
You are in 'detached HEAD' state. You can look around, make experimental
changes and commit them, and you can discard any commits you make in this
state without impacting any branches by switching back to a branch.
If you want to create a new branch to retain commits you create, you may
do so (now or later) by using -c with the switch command. Example:
git switch -c <new-branch-name>
Or undo this operation with:
git switch -
Turn off this advice by setting config variable advice.detachedHead to false
HEAD is now at fa12c6bae47 GH-132732: Remove textwrap import (#138933)
Switched to and reset branch 'main'
configure: WARNING: pkg-config is missing. Some dependencies may not be detected correctly.
Parser/string_parser.c:185:17: warning: 'sprintf' is deprecated: This function is provided for compatibility reasons only. Due to security concerns inherent in the design of sprintf(3), it is highly recommended that you use snprintf(3) instead. [-Wdeprecated-declarations]
sprintf(p, "\\U%08x", chr);
^
/Library/Developer/CommandLineTools/SDKs/MacOSX.sdk/usr/include/stdio.h:180:1: note: 'sprintf' has been explicitly marked deprecated here
__deprecated_msg("This function is provided for compatibility reasons only. Due to security concerns inherent in the design of sprintf(3), it is highly recommended that you use snprintf(3) instead.")
^
/Library/Developer/CommandLineTools/SDKs/MacOSX.sdk/usr/include/sys/cdefs.h:215:48: note: expanded from macro '__deprecated_msg'
#define __deprecated_msg(_msg) __attribute__((__deprecated__(_msg)))
^
1 warning generated.
Objects/bytesobject.c:290:17: warning: 'sprintf' is deprecated: This function is provided for compatibility reasons only. Due to security concerns inherent in the design of sprintf(3), it is highly recommended that you use snprintf(3) instead. [-Wdeprecated-declarations]
sprintf(buffer, "%ld", va_arg(vargs, long));
^
/Library/Developer/CommandLineTools/SDKs/MacOSX.sdk/usr/include/stdio.h:180:1: note: 'sprintf' has been explicitly marked deprecated here
__deprecated_msg("This function is provided for compatibility reasons only. Due to security concerns inherent in the design of sprintf(3), it is highly recommended that you use snprintf(3) instead.")
^
/Library/Developer/CommandLineTools/SDKs/MacOSX.sdk/usr/include/sys/cdefs.h:215:48: note: expanded from macro '__deprecated_msg'
#define __deprecated_msg(_msg) __attribute__((__deprecated__(_msg)))
^
Objects/bytesobject.c:293:17: warning: 'sprintf' is deprecated: This function is provided for compatibility reasons only. Due to security concerns inherent in the design of sprintf(3), it is highly recommended that you use snprintf(3) instead. [-Wdeprecated-declarations]
sprintf(buffer, "%zd", va_arg(vargs, Py_ssize_t));
^
/Library/Developer/CommandLineTools/SDKs/MacOSX.sdk/usr/include/stdio.h:180:1: note: 'sprintf' has been explicitly marked deprecated here
__deprecated_msg("This function is provided for compatibility reasons only. Due to security concerns inherent in the design of sprintf(3), it is highly recommended that you use snprintf(3) instead.")
^
/Library/Developer/CommandLineTools/SDKs/MacOSX.sdk/usr/include/sys/cdefs.h:215:48: note: expanded from macro '__deprecated_msg'
#define __deprecated_msg(_msg) __attribute__((__deprecated__(_msg)))
^
Objects/bytesobject.c:296:17: warning: 'sprintf' is deprecated: This function is provided for compatibility reasons only. Due to security concerns inherent in the design of sprintf(3), it is highly recommended that you use snprintf(3) instead. [-Wdeprecated-declarations]
sprintf(buffer, "%d", va_arg(vargs, int));
^
/Library/Developer/CommandLineTools/SDKs/MacOSX.sdk/usr/include/stdio.h:180:1: note: 'sprintf' has been explicitly marked deprecated here
__deprecated_msg("This function is provided for compatibility reasons only. Due to security concerns inherent in the design of sprintf(3), it is highly recommended that you use snprintf(3) instead.")
^
/Library/Developer/CommandLineTools/SDKs/MacOSX.sdk/usr/include/sys/cdefs.h:215:48: note: expanded from macro '__deprecated_msg'
#define __deprecated_msg(_msg) __attribute__((__deprecated__(_msg)))
^
Objects/bytesobject.c:304:17: warning: 'sprintf' is deprecated: This function is provided for compatibility reasons only. Due to security concerns inherent in the design of sprintf(3), it is highly recommended that you use snprintf(3) instead. [-Wdeprecated-declarations]
sprintf(buffer, "%lu", va_arg(vargs, unsigned long));
^
/Library/Developer/CommandLineTools/SDKs/MacOSX.sdk/usr/include/stdio.h:180:1: note: 'sprintf' has been explicitly marked deprecated here
__deprecated_msg("This function is provided for compatibility reasons only. Due to security concerns inherent in the design of sprintf(3), it is highly recommended that you use snprintf(3) instead.")
^
/Library/Developer/CommandLineTools/SDKs/MacOSX.sdk/usr/include/sys/cdefs.h:215:48: note: expanded from macro '__deprecated_msg'
#define __deprecated_msg(_msg) __attribute__((__deprecated__(_msg)))
^
Objects/bytesobject.c:307:17: warning: 'sprintf' is deprecated: This function is provided for compatibility reasons only. Due to security concerns inherent in the design of sprintf(3), it is highly recommended that you use snprintf(3) instead. [-Wdeprecated-declarations]
sprintf(buffer, "%zu", va_arg(vargs, size_t));
^
/Library/Developer/CommandLineTools/SDKs/MacOSX.sdk/usr/include/stdio.h:180:1: note: 'sprintf' has been explicitly marked deprecated here
__deprecated_msg("This function is provided for compatibility reasons only. Due to security concerns inherent in the design of sprintf(3), it is highly recommended that you use snprintf(3) instead.")
^
/Library/Developer/CommandLineTools/SDKs/MacOSX.sdk/usr/include/sys/cdefs.h:215:48: note: expanded from macro '__deprecated_msg'
#define __deprecated_msg(_msg) __attribute__((__deprecated__(_msg)))
^
Objects/bytesobject.c:310:17: warning: 'sprintf' is deprecated: This function is provided for compatibility reasons only. Due to security concerns inherent in the design of sprintf(3), it is highly recommended that you use snprintf(3) instead. [-Wdeprecated-declarations]
sprintf(buffer, "%u", va_arg(vargs, unsigned int));
^
/Library/Developer/CommandLineTools/SDKs/MacOSX.sdk/usr/include/stdio.h:180:1: note: 'sprintf' has been explicitly marked deprecated here
__deprecated_msg("This function is provided for compatibility reasons only. Due to security concerns inherent in the design of sprintf(3), it is highly recommended that you use snprintf(3) instead.")
^
/Library/Developer/CommandLineTools/SDKs/MacOSX.sdk/usr/include/sys/cdefs.h:215:48: note: expanded from macro '__deprecated_msg'
#define __deprecated_msg(_msg) __attribute__((__deprecated__(_msg)))
^
Objects/bytesobject.c:317:13: warning: 'sprintf' is deprecated: This function is provided for compatibility reasons only. Due to security concerns inherent in the design of sprintf(3), it is highly recommended that you use snprintf(3) instead. [-Wdeprecated-declarations]
sprintf(buffer, "%i", va_arg(vargs, int));
^
/Library/Developer/CommandLineTools/SDKs/MacOSX.sdk/usr/include/stdio.h:180:1: note: 'sprintf' has been explicitly marked deprecated here
__deprecated_msg("This function is provided for compatibility reasons only. Due to security concerns inherent in the design of sprintf(3), it is highly recommended that you use snprintf(3) instead.")
^
/Library/Developer/CommandLineTools/SDKs/MacOSX.sdk/usr/include/sys/cdefs.h:215:48: note: expanded from macro '__deprecated_msg'
#define __deprecated_msg(_msg) __attribute__((__deprecated__(_msg)))
^
Objects/bytesobject.c:323:13: warning: 'sprintf' is deprecated: This function is provided for compatibility reasons only. Due to security concerns inherent in the design of sprintf(3), it is highly recommended that you use snprintf(3) instead. [-Wdeprecated-declarations]
sprintf(buffer, "%x", va_arg(vargs, int));
^
/Library/Developer/CommandLineTools/SDKs/MacOSX.sdk/usr/include/stdio.h:180:1: note: 'sprintf' has been explicitly marked deprecated here
__deprecated_msg("This function is provided for compatibility reasons only. Due to security concerns inherent in the design of sprintf(3), it is highly recommended that you use snprintf(3) instead.")
^
/Library/Developer/CommandLineTools/SDKs/MacOSX.sdk/usr/include/sys/cdefs.h:215:48: note: expanded from macro '__deprecated_msg'
#define __deprecated_msg(_msg) __attribute__((__deprecated__(_msg)))
^
Objects/bytesobject.c:347:13: warning: 'sprintf' is deprecated: This function is provided for compatibility reasons only. Due to security concerns inherent in the design of sprintf(3), it is highly recommended that you use snprintf(3) instead. [-Wdeprecated-declarations]
sprintf(buffer, "%p", va_arg(vargs, void*));
^
/Library/Developer/CommandLineTools/SDKs/MacOSX.sdk/usr/include/stdio.h:180:1: note: 'sprintf' has been explicitly marked deprecated here
__deprecated_msg("This function is provided for compatibility reasons only. Due to security concerns inherent in the design of sprintf(3), it is highly recommended that you use snprintf(3) instead.")
^
/Library/Developer/CommandLineTools/SDKs/MacOSX.sdk/usr/include/sys/cdefs.h:215:48: note: expanded from macro '__deprecated_msg'
#define __deprecated_msg(_msg) __attribute__((__deprecated__(_msg)))
^
9 warnings generated.
Objects/typeobject.c:6883:9: warning: 'sprintf' is deprecated: This function is provided for compatibility reasons only. Due to security concerns inherent in the design of sprintf(3), it is highly recommended that you use snprintf(3) instead. [-Wdeprecated-declarations]
sprintf(msg, "type_traverse() called on non-heap type '%.100s'",
^
/Library/Developer/CommandLineTools/SDKs/MacOSX.sdk/usr/include/stdio.h:180:1: note: 'sprintf' has been explicitly marked deprecated here
__deprecated_msg("This function is provided for compatibility reasons only. Due to security concerns inherent in the design of sprintf(3), it is highly recommended that you use snprintf(3) instead.")
^
/Library/Developer/CommandLineTools/SDKs/MacOSX.sdk/usr/include/sys/cdefs.h:215:48: note: expanded from macro '__deprecated_msg'
#define __deprecated_msg(_msg) __attribute__((__deprecated__(_msg)))
^
Objects/unicodeobject.c:944:16: warning: 'sprintf' is deprecated: This function is provided for compatibility reasons only. Due to security concerns inherent in the design of sprintf(3), it is highly recommended that you use snprintf(3) instead. [-Wdeprecated-declarations]
size = sprintf(str, "&#%d;", PyUnicode_READ(kind, data, i));
^
/Library/Developer/CommandLineTools/SDKs/MacOSX.sdk/usr/include/stdio.h:180:1: note: 'sprintf' has been explicitly marked deprecated here
__deprecated_msg("This function is provided for compatibility reasons only. Due to security concerns inherent in the design of sprintf(3), it is highly recommended that you use snprintf(3) instead.")
^
/Library/Developer/CommandLineTools/SDKs/MacOSX.sdk/usr/include/sys/cdefs.h:215:48: note: expanded from macro '__deprecated_msg'
#define __deprecated_msg(_msg) __attribute__((__deprecated__(_msg)))
^
Objects/unicodeobject.c:2938:30: warning: 'sprintf' is deprecated: This function is provided for compatibility reasons only. Due to security concerns inherent in the design of sprintf(3), it is highly recommended that you use snprintf(3) instead. [-Wdeprecated-declarations]
case F_LONG: DO_SPRINTS("l", long, unsigned long); break;
^
Objects/unicodeobject.c:2929:33: note: expanded from macro 'DO_SPRINTS'
case 'o': len = SPRINT(SIZE_SPEC, "o", UNSIGNED_TYPE); break; \
^
Objects/unicodeobject.c:2924:13: note: expanded from macro 'SPRINT'
sprintf(buffer, "%" SIZE_SPEC FMT_CHAR, va_arg(*vargs, TYPE))
^
/Library/Developer/CommandLineTools/SDKs/MacOSX.sdk/usr/include/stdio.h:180:1: note: 'sprintf' has been explicitly marked deprecated here
__deprecated_msg("This function is provided for compatibility reasons only. Due to security concerns inherent in the design of sprintf(3), it is highly recommended that you use snprintf(3) instead.")
^
/Library/Developer/CommandLineTools/SDKs/MacOSX.sdk/usr/include/sys/cdefs.h:215:48: note: expanded from macro '__deprecated_msg'
#define __deprecated_msg(_msg) __attribute__((__deprecated__(_msg)))
^
Objects/unicodeobject.c:2938:30: warning: 'sprintf' is deprecated: This function is provided for compatibility reasons only. Due to security concerns inherent in the design of sprintf(3), it is highly recommended that you use snprintf(3) instead. [-Wdeprecated-declarations]
case F_LONG: DO_SPRINTS("l", long, unsigned long); break;
^
Objects/unicodeobject.c:2930:33: note: expanded from macro 'DO_SPRINTS'
case 'u': len = SPRINT(SIZE_SPEC, "u", UNSIGNED_TYPE); break; \
^
Objects/unicodeobject.c:2924:13: note: expanded from macro 'SPRINT'
sprintf(buffer, "%" SIZE_SPEC FMT_CHAR, va_arg(*vargs, TYPE))
^
/Library/Developer/CommandLineTools/SDKs/MacOSX.sdk/usr/include/stdio.h:180:1: note: 'sprintf' has been explicitly marked deprecated here
__deprecated_msg("This function is provided for compatibility reasons only. Due to security concerns inherent in the design of sprintf(3), it is highly recommended that you use snprintf(3) instead.")
^
/Library/Developer/CommandLineTools/SDKs/MacOSX.sdk/usr/include/sys/cdefs.h:215:48: note: expanded from macro '__deprecated_msg'
#define __deprecated_msg(_msg) __attribute__((__deprecated__(_msg)))
^
Objects/unicodeobject.c:2938:30: warning: 'sprintf' is deprecated: This function is provided for compatibility reasons only. Due to security concerns inherent in the design of sprintf(3), it is highly recommended that you use snprintf(3) instead. [-Wdeprecated-declarations]
case F_LONG: DO_SPRINTS("l", long, unsigned long); break;
^
Objects/unicodeobject.c:2931:33: note: expanded from macro 'DO_SPRINTS'
case 'x': len = SPRINT(SIZE_SPEC, "x", UNSIGNED_TYPE); break; \
^
Objects/unicodeobject.c:2924:13: note: expanded from macro 'SPRINT'
sprintf(buffer, "%" SIZE_SPEC FMT_CHAR, va_arg(*vargs, TYPE))
^
/Library/Developer/CommandLineTools/SDKs/MacOSX.sdk/usr/include/stdio.h:180:1: note: 'sprintf' has been explicitly marked deprecated here
__deprecated_msg("This function is provided for compatibility reasons only. Due to security concerns inherent in the design of sprintf(3), it is highly recommended that you use snprintf(3) instead.")
^
/Library/Developer/CommandLineTools/SDKs/MacOSX.sdk/usr/include/sys/cdefs.h:215:48: note: expanded from macro '__deprecated_msg'
#define __deprecated_msg(_msg) __attribute__((__deprecated__(_msg)))
^
Objects/unicodeobject.c:2938:30: warning: 'sprintf' is deprecated: This function is provided for compatibility reasons only. Due to security concerns inherent in the design of sprintf(3), it is highly recommended that you use snprintf(3) instead. [-Wdeprecated-declarations]
case F_LONG: DO_SPRINTS("l", long, unsigned long); break;
^
Objects/unicodeobject.c:2932:33: note: expanded from macro 'DO_SPRINTS'
case 'X': len = SPRINT(SIZE_SPEC, "X", UNSIGNED_TYPE); break; \
^
Objects/unicodeobject.c:2924:13: note: expanded from macro 'SPRINT'
sprintf(buffer, "%" SIZE_SPEC FMT_CHAR, va_arg(*vargs, TYPE))
^
/Library/Developer/CommandLineTools/SDKs/MacOSX.sdk/usr/include/stdio.h:180:1: note: 'sprintf' has been explicitly marked deprecated here
__deprecated_msg("This function is provided for compatibility reasons only. Due to security concerns inherent in the design of sprintf(3), it is highly recommended that you use snprintf(3) instead.")
^
/Library/Developer/CommandLineTools/SDKs/MacOSX.sdk/usr/include/sys/cdefs.h:215:48: note: expanded from macro '__deprecated_msg'
#define __deprecated_msg(_msg) __attribute__((__deprecated__(_msg)))
^
Objects/unicodeobject.c:2938:30: warning: 'sprintf' is deprecated: This function is provided for compatibility reasons only. Due to security concerns inherent in the design of sprintf(3), it is highly recommended that you use snprintf(3) instead. [-Wdeprecated-declarations]
case F_LONG: DO_SPRINTS("l", long, unsigned long); break;
^
Objects/unicodeobject.c:2933:33: note: expanded from macro 'DO_SPRINTS'
default: len = SPRINT(SIZE_SPEC, "d", SIGNED_TYPE); break; \
^
Objects/unicodeobject.c:2924:13: note: expanded from macro 'SPRINT'
sprintf(buffer, "%" SIZE_SPEC FMT_CHAR, va_arg(*vargs, TYPE))
^
/Library/Developer/CommandLineTools/SDKs/MacOSX.sdk/usr/include/stdio.h:180:1: note: 'sprintf' has been explicitly marked deprecated here
__deprecated_msg("This function is provided for compatibility reasons only. Due to security concerns inherent in the design of sprintf(3), it is highly recommended that you use snprintf(3) instead.")
^
/Library/Developer/CommandLineTools/SDKs/MacOSX.sdk/usr/include/sys/cdefs.h:215:48: note: expanded from macro '__deprecated_msg'
#define __deprecated_msg(_msg) __attribute__((__deprecated__(_msg)))
^
Objects/unicodeobject.c:2939:30: warning: 'sprintf' is deprecated: This function is provided for compatibility reasons only. Due to security concerns inherent in the design of sprintf(3), it is highly recommended that you use snprintf(3) instead. [-Wdeprecated-declarations]
case F_LONGLONG: DO_SPRINTS("ll", long long, unsigned long long); break;
^
Objects/unicodeobject.c:2929:33: note: expanded from macro 'DO_SPRINTS'
case 'o': len = SPRINT(SIZE_SPEC, "o", UNSIGNED_TYPE); break; \
^
Objects/unicodeobject.c:2924:13: note: expanded from macro 'SPRINT'
sprintf(buffer, "%" SIZE_SPEC FMT_CHAR, va_arg(*vargs, TYPE))
^
/Library/Developer/CommandLineTools/SDKs/MacOSX.sdk/usr/include/stdio.h:180:1: note: 'sprintf' has been explicitly marked deprecated here
__deprecated_msg("This function is provided for compatibility reasons only. Due to security concerns inherent in the design of sprintf(3), it is highly recommended that you use snprintf(3) instead.")
^
/Library/Developer/CommandLineTools/SDKs/MacOSX.sdk/usr/include/sys/cdefs.h:215:48: note: expanded from macro '__deprecated_msg'
#define __deprecated_msg(_msg) __attribute__((__deprecated__(_msg)))
^
Objects/unicodeobject.c:2939:30: warning: 'sprintf' is deprecated: This function is provided for compatibility reasons only. Due to security concerns inherent in the design of sprintf(3), it is highly recommended that you use snprintf(3) instead. [-Wdeprecated-declarations]
case F_LONGLONG: DO_SPRINTS("ll", long long, unsigned long long); break;
^
Objects/unicodeobject.c:2930:33: note: expanded from macro 'DO_SPRINTS'
case 'u': len = SPRINT(SIZE_SPEC, "u", UNSIGNED_TYPE); break; \
^
Objects/unicodeobject.c:2924:13: note: expanded from macro 'SPRINT'
sprintf(buffer, "%" SIZE_SPEC FMT_CHAR, va_arg(*vargs, TYPE))
^
/Library/Developer/CommandLineTools/SDKs/MacOSX.sdk/usr/include/stdio.h:180:1: note: 'sprintf' has been explicitly marked deprecated here
__deprecated_msg("This function is provided for compatibility reasons only. Due to security concerns inherent in the design of sprintf(3), it is highly recommended that you use snprintf(3) instead.")
^
/Library/Developer/CommandLineTools/SDKs/MacOSX.sdk/usr/include/sys/cdefs.h:215:48: note: expanded from macro '__deprecated_msg'
#define __deprecated_msg(_msg) __attribute__((__deprecated__(_msg)))
^
Objects/unicodeobject.c:2939:30: warning: 'sprintf' is deprecated: This function is provided for compatibility reasons only. Due to security concerns inherent in the design of sprintf(3), it is highly recommended that you use snprintf(3) instead. [-Wdeprecated-declarations]
case F_LONGLONG: DO_SPRINTS("ll", long long, unsigned long long); break;
^
Objects/unicodeobject.c:2931:33: note: expanded from macro 'DO_SPRINTS'
case 'x': len = SPRINT(SIZE_SPEC, "x", UNSIGNED_TYPE); break; \
^
Objects/unicodeobject.c:2924:13: note: expanded from macro 'SPRINT'
sprintf(buffer, "%" SIZE_SPEC FMT_CHAR, va_arg(*vargs, TYPE))
^
/Library/Developer/CommandLineTools/SDKs/MacOSX.sdk/usr/include/stdio.h:180:1: note: 'sprintf' has been explicitly marked deprecated here
__deprecated_msg("This function is provided for compatibility reasons only. Due to security concerns inherent in the design of sprintf(3), it is highly recommended that you use snprintf(3) instead.")
^
/Library/Developer/CommandLineTools/SDKs/MacOSX.sdk/usr/include/sys/cdefs.h:215:48: note: expanded from macro '__deprecated_msg'
#define __deprecated_msg(_msg) __attribute__((__deprecated__(_msg)))
^
Objects/unicodeobject.c:2939:30: warning: 'sprintf' is deprecated: This function is provided for compatibility reasons only. Due to security concerns inherent in the design of sprintf(3), it is highly recommended that you use snprintf(3) instead. [-Wdeprecated-declarations]
case F_LONGLONG: DO_SPRINTS("ll", long long, unsigned long long); break;
^
Objects/unicodeobject.c:2932:33: note: expanded from macro 'DO_SPRINTS'
case 'X': len = SPRINT(SIZE_SPEC, "X", UNSIGNED_TYPE); break; \
^
Objects/unicodeobject.c:2924:13: note: expanded from macro 'SPRINT'
sprintf(buffer, "%" SIZE_SPEC FMT_CHAR, va_arg(*vargs, TYPE))
^
/Library/Developer/CommandLineTools/SDKs/MacOSX.sdk/usr/include/stdio.h:180:1: note: 'sprintf' has been explicitly marked deprecated here
__deprecated_msg("This function is provided for compatibility reasons only. Due to security concerns inherent in the design of sprintf(3), it is highly recommended that you use snprintf(3) instead.")
^
/Library/Developer/CommandLineTools/SDKs/MacOSX.sdk/usr/include/sys/cdefs.h:215:48: note: expanded from macro '__deprecated_msg'
#define __deprecated_msg(_msg) __attribute__((__deprecated__(_msg)))
^
Objects/unicodeobject.c:2939:30: warning: 'sprintf' is deprecated: This function is provided for compatibility reasons only. Due to security concerns inherent in the design of sprintf(3), it is highly recommended that you use snprintf(3) instead. [-Wdeprecated-declarations]
case F_LONGLONG: DO_SPRINTS("ll", long long, unsigned long long); break;
^
Objects/unicodeobject.c:2933:33: note: expanded from macro 'DO_SPRINTS'
default: len = SPRINT(SIZE_SPEC, "d", SIGNED_TYPE); break; \
^
Objects/unicodeobject.c:2924:13: note: expanded from macro 'SPRINT'
sprintf(buffer, "%" SIZE_SPEC FMT_CHAR, va_arg(*vargs, TYPE))
^
/Library/Developer/CommandLineTools/SDKs/MacOSX.sdk/usr/include/stdio.h:180:1: note: 'sprintf' has been explicitly marked deprecated here
__deprecated_msg("This function is provided for compatibility reasons only. Due to security concerns inherent in the design of sprintf(3), it is highly recommended that you use snprintf(3) instead.")
^
/Library/Developer/CommandLineTools/SDKs/MacOSX.sdk/usr/include/sys/cdefs.h:215:48: note: expanded from macro '__deprecated_msg'
#define __deprecated_msg(_msg) __attribute__((__deprecated__(_msg)))
^
Objects/unicodeobject.c:2940:30: warning: 'sprintf' is deprecated: This function is provided for compatibility reasons only. Due to security concerns inherent in the design of sprintf(3), it is highly recommended that you use snprintf(3) instead. [-Wdeprecated-declarations]
case F_SIZE: DO_SPRINTS("z", Py_ssize_t, size_t); break;
^
Objects/unicodeobject.c:2929:33: note: expanded from macro 'DO_SPRINTS'
case 'o': len = SPRINT(SIZE_SPEC, "o", UNSIGNED_TYPE); break; \
^
Objects/unicodeobject.c:2924:13: note: expanded from macro 'SPRINT'
sprintf(buffer, "%" SIZE_SPEC FMT_CHAR, va_arg(*vargs, TYPE))
^
/Library/Developer/CommandLineTools/SDKs/MacOSX.sdk/usr/include/stdio.h:180:1: note: 'sprintf' has been explicitly marked deprecated here
__deprecated_msg("This function is provided for compatibility reasons only. Due to security concerns inherent in the design of sprintf(3), it is highly recommended that you use snprintf(3) instead.")
^
/Library/Developer/CommandLineTools/SDKs/MacOSX.sdk/usr/include/sys/cdefs.h:215:48: note: expanded from macro '__deprecated_msg'
#define __deprecated_msg(_msg) __attribute__((__deprecated__(_msg)))
^
Objects/unicodeobject.c:2940:30: warning: 'sprintf' is deprecated: This function is provided for compatibility reasons only. Due to security concerns inherent in the design of sprintf(3), it is highly recommended that you use snprintf(3) instead. [-Wdeprecated-declarations]
case F_SIZE: DO_SPRINTS("z", Py_ssize_t, size_t); break;
^
Objects/unicodeobject.c:2930:33: note: expanded from macro 'DO_SPRINTS'
case 'u': len = SPRINT(SIZE_SPEC, "u", UNSIGNED_TYPE); break; \
^
Objects/unicodeobject.c:2924:13: note: expanded from macro 'SPRINT'
sprintf(buffer, "%" SIZE_SPEC FMT_CHAR, va_arg(*vargs, TYPE))
^
/Library/Developer/CommandLineTools/SDKs/MacOSX.sdk/usr/include/stdio.h:180:1: note: 'sprintf' has been explicitly marked deprecated here
__deprecated_msg("This function is provided for compatibility reasons only. Due to security concerns inherent in the design of sprintf(3), it is highly recommended that you use snprintf(3) instead.")
^
/Library/Developer/CommandLineTools/SDKs/MacOSX.sdk/usr/include/sys/cdefs.h:215:48: note: expanded from macro '__deprecated_msg'
#define __deprecated_msg(_msg) __attribute__((__deprecated__(_msg)))
^
Objects/unicodeobject.c:2940:30: warning: 'sprintf' is deprecated: This function is provided for compatibility reasons only. Due to security concerns inherent in the design of sprintf(3), it is highly recommended that you use snprintf(3) instead. [-Wdeprecated-declarations]
case F_SIZE: DO_SPRINTS("z", Py_ssize_t, size_t); break;
^
Objects/unicodeobject.c:2931:33: note: expanded from macro 'DO_SPRINTS'
case 'x': len = SPRINT(SIZE_SPEC, "x", UNSIGNED_TYPE); break; \
^
Objects/unicodeobject.c:2924:13: note: expanded from macro 'SPRINT'
sprintf(buffer, "%" SIZE_SPEC FMT_CHAR, va_arg(*vargs, TYPE))
^
/Library/Developer/CommandLineTools/SDKs/MacOSX.sdk/usr/include/stdio.h:180:1: note: 'sprintf' has been explicitly marked deprecated here
__deprecated_msg("This function is provided for compatibility reasons only. Due to security concerns inherent in the design of sprintf(3), it is highly recommended that you use snprintf(3) instead.")
^
/Library/Developer/CommandLineTools/SDKs/MacOSX.sdk/usr/include/sys/cdefs.h:215:48: note: expanded from macro '__deprecated_msg'
#define __deprecated_msg(_msg) __attribute__((__deprecated__(_msg)))
^
Objects/unicodeobject.c:2940:30: warning: 'sprintf' is deprecated: This function is provided for compatibility reasons only. Due to security concerns inherent in the design of sprintf(3), it is highly recommended that you use snprintf(3) instead. [-Wdeprecated-declarations]
case F_SIZE: DO_SPRINTS("z", Py_ssize_t, size_t); break;
^
Objects/unicodeobject.c:2932:33: note: expanded from macro 'DO_SPRINTS'
case 'X': len = SPRINT(SIZE_SPEC, "X", UNSIGNED_TYPE); break; \
^
Objects/unicodeobject.c:2924:13: note: expanded from macro 'SPRINT'
sprintf(buffer, "%" SIZE_SPEC FMT_CHAR, va_arg(*vargs, TYPE))
^
/Library/Developer/CommandLineTools/SDKs/MacOSX.sdk/usr/include/stdio.h:180:1: note: 'sprintf' has been explicitly marked deprecated here
__deprecated_msg("This function is provided for compatibility reasons only. Due to security concerns inherent in the design of sprintf(3), it is highly recommended that you use snprintf(3) instead.")
^
/Library/Developer/CommandLineTools/SDKs/MacOSX.sdk/usr/include/sys/cdefs.h:215:48: note: expanded from macro '__deprecated_msg'
#define __deprecated_msg(_msg) __attribute__((__deprecated__(_msg)))
^
Objects/unicodeobject.c:2940:30: warning: 'sprintf' is deprecated: This function is provided for compatibility reasons only. Due to security concerns inherent in the design of sprintf(3), it is highly recommended that you use snprintf(3) instead. [-Wdeprecated-declarations]
case F_SIZE: DO_SPRINTS("z", Py_ssize_t, size_t); break;
^
Objects/unicodeobject.c:2933:33: note: expanded from macro 'DO_SPRINTS'
default: len = SPRINT(SIZE_SPEC, "d", SIGNED_TYPE); break; \
^
Objects/unicodeobject.c:2924:13: note: expanded from macro 'SPRINT'
sprintf(buffer, "%" SIZE_SPEC FMT_CHAR, va_arg(*vargs, TYPE))
^
/Library/Developer/CommandLineTools/SDKs/MacOSX.sdk/usr/include/stdio.h:180:1: note: 'sprintf' has been explicitly marked deprecated here
__deprecated_msg("This function is provided for compatibility reasons only. Due to security concerns inherent in the design of sprintf(3), it is highly recommended that you use snprintf(3) instead.")
^
/Library/Developer/CommandLineTools/SDKs/MacOSX.sdk/usr/include/sys/cdefs.h:215:48: note: expanded from macro '__deprecated_msg'
#define __deprecated_msg(_msg) __attribute__((__deprecated__(_msg)))
^
Objects/unicodeobject.c:2941:30: warning: 'sprintf' is deprecated: This function is provided for compatibility reasons only. Due to security concerns inherent in the design of sprintf(3), it is highly recommended that you use snprintf(3) instead. [-Wdeprecated-declarations]
case F_PTRDIFF: DO_SPRINTS("t", ptrdiff_t, ptrdiff_t); break;
^
Objects/unicodeobject.c:2929:33: note: expanded from macro 'DO_SPRINTS'
case 'o': len = SPRINT(SIZE_SPEC, "o", UNSIGNED_TYPE); break; \
^
Objects/unicodeobject.c:2924:13: note: expanded from macro 'SPRINT'
sprintf(buffer, "%" SIZE_SPEC FMT_CHAR, va_arg(*vargs, TYPE))
^
/Library/Developer/CommandLineTools/SDKs/MacOSX.sdk/usr/include/stdio.h:180:1: note: 'sprintf' has been explicitly marked deprecated here
__deprecated_msg("This function is provided for compatibility reasons only. Due to security concerns inherent in the design of sprintf(3), it is highly recommended that you use snprintf(3) instead.")
^
/Library/Developer/CommandLineTools/SDKs/MacOSX.sdk/usr/include/sys/cdefs.h:215:48: note: expanded from macro '__deprecated_msg'
#define __deprecated_msg(_msg) __attribute__((__deprecated__(_msg)))
^
Objects/unicodeobject.c:2941:30: warning: 'sprintf' is deprecated: This function is provided for compatibility reasons only. Due to security concerns inherent in the design of sprintf(3), it is highly recommended that you use snprintf(3) instead. [-Wdeprecated-declarations]
case F_PTRDIFF: DO_SPRINTS("t", ptrdiff_t, ptrdiff_t); break;
^
Objects/unicodeobject.c:2930:33: note: expanded from macro 'DO_SPRINTS'
case 'u': len = SPRINT(SIZE_SPEC, "u", UNSIGNED_TYPE); break; \
^
Objects/unicodeobject.c:2924:13: note: expanded from macro 'SPRINT'
sprintf(buffer, "%" SIZE_SPEC FMT_CHAR, va_arg(*vargs, TYPE))
^
/Library/Developer/CommandLineTools/SDKs/MacOSX.sdk/usr/include/stdio.h:180:1: note: 'sprintf' has been explicitly marked deprecated here
__deprecated_msg("This function is provided for compatibility reasons only. Due to security concerns inherent in the design of sprintf(3), it is highly recommended that you use snprintf(3) instead.")
^
/Library/Developer/CommandLineTools/SDKs/MacOSX.sdk/usr/include/sys/cdefs.h:215:48: note: expanded from macro '__deprecated_msg'
#define __deprecated_msg(_msg) __attribute__((__deprecated__(_msg)))
^
Objects/unicodeobject.c:2941:30: warning: 'sprintf' is deprecated: This function is provided for compatibility reasons only. Due to security concerns inherent in the design of sprintf(3), it is highly recommended that you use snprintf(3) instead. [-Wdeprecated-declarations]
case F_PTRDIFF: DO_SPRINTS("t", ptrdiff_t, ptrdiff_t); break;
^
Objects/unicodeobject.c:2931:33: note: expanded from macro 'DO_SPRINTS'
case 'x': len = SPRINT(SIZE_SPEC, "x", UNSIGNED_TYPE); break; \
^
Objects/unicodeobject.c:2924:13: note: expanded from macro 'SPRINT'
sprintf(buffer, "%" SIZE_SPEC FMT_CHAR, va_arg(*vargs, TYPE))
^
/Library/Developer/CommandLineTools/SDKs/MacOSX.sdk/usr/include/stdio.h:180:1: note: 'sprintf' has been explicitly marked deprecated here
__deprecated_msg("This function is provided for compatibility reasons only. Due to security concerns inherent in the design of sprintf(3), it is highly recommended that you use snprintf(3) instead.")
^
/Library/Developer/CommandLineTools/SDKs/MacOSX.sdk/usr/include/sys/cdefs.h:215:48: note: expanded from macro '__deprecated_msg'
#define __deprecated_msg(_msg) __attribute__((__deprecated__(_msg)))
^
Objects/unicodeobject.c:2941:30: warning: 'sprintf' is deprecated: This function is provided for compatibility reasons only. Due to security concerns inherent in the design of sprintf(3), it is highly recommended that you use snprintf(3) instead. [-Wdeprecated-declarations]
case F_PTRDIFF: DO_SPRINTS("t", ptrdiff_t, ptrdiff_t); break;
^
Objects/unicodeobject.c:2932:33: note: expanded from macro 'DO_SPRINTS'
case 'X': len = SPRINT(SIZE_SPEC, "X", UNSIGNED_TYPE); break; \
^
Objects/unicodeobject.c:2924:13: note: expanded from macro 'SPRINT'
sprintf(buffer, "%" SIZE_SPEC FMT_CHAR, va_arg(*vargs, TYPE))
^
/Library/Developer/CommandLineTools/SDKs/MacOSX.sdk/usr/include/stdio.h:180:1: note: 'sprintf' has been explicitly marked deprecated here
__deprecated_msg("This function is provided for compatibility reasons only. Due to security concerns inherent in the design of sprintf(3), it is highly recommended that you use snprintf(3) instead.")
^
/Library/Developer/CommandLineTools/SDKs/MacOSX.sdk/usr/include/sys/cdefs.h:215:48: note: expanded from macro '__deprecated_msg'
#define __deprecated_msg(_msg) __attribute__((__deprecated__(_msg)))
^
Objects/unicodeobject.c:2941:30: warning: 'sprintf' is deprecated: This function is provided for compatibility reasons only. Due to security concerns inherent in the design of sprintf(3), it is highly recommended that you use snprintf(3) instead. [-Wdeprecated-declarations]
case F_PTRDIFF: DO_SPRINTS("t", ptrdiff_t, ptrdiff_t); break;
^
Objects/unicodeobject.c:2933:33: note: expanded from macro 'DO_SPRINTS'
default: len = SPRINT(SIZE_SPEC, "d", SIGNED_TYPE); break; \
^
Objects/unicodeobject.c:2924:13: note: expanded from macro 'SPRINT'
sprintf(buffer, "%" SIZE_SPEC FMT_CHAR, va_arg(*vargs, TYPE))
^
/Library/Developer/CommandLineTools/SDKs/MacOSX.sdk/usr/include/stdio.h:180:1: note: 'sprintf' has been explicitly marked deprecated here
__deprecated_msg("This function is provided for compatibility reasons only. Due to security concerns inherent in the design of sprintf(3), it is highly recommended that you use snprintf(3) instead.")
^
/Library/Developer/CommandLineTools/SDKs/MacOSX.sdk/usr/include/sys/cdefs.h:215:48: note: expanded from macro '__deprecated_msg'
#define __deprecated_msg(_msg) __attribute__((__deprecated__(_msg)))
^
Objects/unicodeobject.c:2942:30: warning: 'sprintf' is deprecated: This function is provided for compatibility reasons only. Due to security concerns inherent in the design of sprintf(3), it is highly recommended that you use snprintf(3) instead. [-Wdeprecated-declarations]
case F_INTMAX: DO_SPRINTS("j", intmax_t, uintmax_t); break;
^
Objects/unicodeobject.c:2929:33: note: expanded from macro 'DO_SPRINTS'
case 'o': len = SPRINT(SIZE_SPEC, "o", UNSIGNED_TYPE); break; \
^
Objects/unicodeobject.c:2924:13: note: expanded from macro 'SPRINT'
sprintf(buffer, "%" SIZE_SPEC FMT_CHAR, va_arg(*vargs, TYPE))
^
/Library/Developer/CommandLineTools/SDKs/MacOSX.sdk/usr/include/stdio.h:180:1: note: 'sprintf' has been explicitly marked deprecated here
__deprecated_msg("This function is provided for compatibility reasons only. Due to security concerns inherent in the design of sprintf(3), it is highly recommended that you use snprintf(3) instead.")
^
/Library/Developer/CommandLineTools/SDKs/MacOSX.sdk/usr/include/sys/cdefs.h:215:48: note: expanded from macro '__deprecated_msg'
#define __deprecated_msg(_msg) __attribute__((__deprecated__(_msg)))
^
Objects/unicodeobject.c:2942:30: warning: 'sprintf' is deprecated: This function is provided for compatibility reasons only. Due to security concerns inherent in the design of sprintf(3), it is highly recommended that you use snprintf(3) instead. [-Wdeprecated-declarations]
case F_INTMAX: DO_SPRINTS("j", intmax_t, uintmax_t); break;
^
Objects/unicodeobject.c:2930:33: note: expanded from macro 'DO_SPRINTS'
case 'u': len = SPRINT(SIZE_SPEC, "u", UNSIGNED_TYPE); break; \
^
Objects/unicodeobject.c:2924:13: note: expanded from macro 'SPRINT'
sprintf(buffer, "%" SIZE_SPEC FMT_CHAR, va_arg(*vargs, TYPE))
^
/Library/Developer/CommandLineTools/SDKs/MacOSX.sdk/usr/include/stdio.h:180:1: note: 'sprintf' has been explicitly marked deprecated here
__deprecated_msg("This function is provided for compatibility reasons only. Due to security concerns inherent in the design of sprintf(3), it is highly recommended that you use snprintf(3) instead.")
^
/Library/Developer/CommandLineTools/SDKs/MacOSX.sdk/usr/include/sys/cdefs.h:215:48: note: expanded from macro '__deprecated_msg'
#define __deprecated_msg(_msg) __attribute__((__deprecated__(_msg)))
^
Objects/unicodeobject.c:2942:30: warning: 'sprintf' is deprecated: This function is provided for compatibility reasons only. Due to security concerns inherent in the design of sprintf(3), it is highly recommended that you use snprintf(3) instead. [-Wdeprecated-declarations]
case F_INTMAX: DO_SPRINTS("j", intmax_t, uintmax_t); break;
^
Objects/unicodeobject.c:2931:33: note: expanded from macro 'DO_SPRINTS'
case 'x': len = SPRINT(SIZE_SPEC, "x", UNSIGNED_TYPE); break; \
^
Objects/unicodeobject.c:2924:13: note: expanded from macro 'SPRINT'
sprintf(buffer, "%" SIZE_SPEC FMT_CHAR, va_arg(*vargs, TYPE))
^
/Library/Developer/CommandLineTools/SDKs/MacOSX.sdk/usr/include/stdio.h:180:1: note: 'sprintf' has been explicitly marked deprecated here
__deprecated_msg("This function is provided for compatibility reasons only. Due to security concerns inherent in the design of sprintf(3), it is highly recommended that you use snprintf(3) instead.")
^
/Library/Developer/CommandLineTools/SDKs/MacOSX.sdk/usr/include/sys/cdefs.h:215:48: note: expanded from macro '__deprecated_msg'
#define __deprecated_msg(_msg) __attribute__((__deprecated__(_msg)))
^
Objects/unicodeobject.c:2942:30: warning: 'sprintf' is deprecated: This function is provided for compatibility reasons only. Due to security concerns inherent in the design of sprintf(3), it is highly recommended that you use snprintf(3) instead. [-Wdeprecated-declarations]
case F_INTMAX: DO_SPRINTS("j", intmax_t, uintmax_t); break;
^
Objects/unicodeobject.c:2932:33: note: expanded from macro 'DO_SPRINTS'
case 'X': len = SPRINT(SIZE_SPEC, "X", UNSIGNED_TYPE); break; \
^
Objects/unicodeobject.c:2924:13: note: expanded from macro 'SPRINT'
sprintf(buffer, "%" SIZE_SPEC FMT_CHAR, va_arg(*vargs, TYPE))
^
/Library/Developer/CommandLineTools/SDKs/MacOSX.sdk/usr/include/stdio.h:180:1: note: 'sprintf' has been explicitly marked deprecated here
__deprecated_msg("This function is provided for compatibility reasons only. Due to security concerns inherent in the design of sprintf(3), it is highly recommended that you use snprintf(3) instead.")
^
/Library/Developer/CommandLineTools/SDKs/MacOSX.sdk/usr/include/sys/cdefs.h:215:48: note: expanded from macro '__deprecated_msg'
#define __deprecated_msg(_msg) __attribute__((__deprecated__(_msg)))
^
Objects/unicodeobject.c:2942:30: warning: 'sprintf' is deprecated: This function is provided for compatibility reasons only. Due to security concerns inherent in the design of sprintf(3), it is highly recommended that you use snprintf(3) instead. [-Wdeprecated-declarations]
case F_INTMAX: DO_SPRINTS("j", intmax_t, uintmax_t); break;
^
Objects/unicodeobject.c:2933:33: note: expanded from macro 'DO_SPRINTS'
default: len = SPRINT(SIZE_SPEC, "d", SIGNED_TYPE); break; \
^
Objects/unicodeobject.c:2924:13: note: expanded from macro 'SPRINT'
sprintf(buffer, "%" SIZE_SPEC FMT_CHAR, va_arg(*vargs, TYPE))
^
/Library/Developer/CommandLineTools/SDKs/MacOSX.sdk/usr/include/stdio.h:180:1: note: 'sprintf' has been explicitly marked deprecated here
__deprecated_msg("This function is provided for compatibility reasons only. Due to security concerns inherent in the design of sprintf(3), it is highly recommended that you use snprintf(3) instead.")
^
/Library/Developer/CommandLineTools/SDKs/MacOSX.sdk/usr/include/sys/cdefs.h:215:48: note: expanded from macro '__deprecated_msg'
#define __deprecated_msg(_msg) __attribute__((__deprecated__(_msg)))
^
Objects/unicodeobject.c:2943:30: warning: 'sprintf' is deprecated: This function is provided for compatibility reasons only. Due to security concerns inherent in the design of sprintf(3), it is highly recommended that you use snprintf(3) instead. [-Wdeprecated-declarations]
default: DO_SPRINTS("", int, unsigned int); break;
^
Objects/unicodeobject.c:2929:33: note: expanded from macro 'DO_SPRINTS'
case 'o': len = SPRINT(SIZE_SPEC, "o", UNSIGNED_TYPE); break; \
^
Objects/unicodeobject.c:2924:13: note: expanded from macro 'SPRINT'
sprintf(buffer, "%" SIZE_SPEC FMT_CHAR, va_arg(*vargs, TYPE))
^
/Library/Developer/CommandLineTools/SDKs/MacOSX.sdk/usr/include/stdio.h:180:1: note: 'sprintf' has been explicitly marked deprecated here
__deprecated_msg("This function is provided for compatibility reasons only. Due to security concerns inherent in the design of sprintf(3), it is highly recommended that you use snprintf(3) instead.")
^
/Library/Developer/CommandLineTools/SDKs/MacOSX.sdk/usr/include/sys/cdefs.h:215:48: note: expanded from macro '__deprecated_msg'
#define __deprecated_msg(_msg) __attribute__((__deprecated__(_msg)))
^
Objects/unicodeobject.c:2943:30: warning: 'sprintf' is deprecated: This function is provided for compatibility reasons only. Due to security concerns inherent in the design of sprintf(3), it is highly recommended that you use snprintf(3) instead. [-Wdeprecated-declarations]
default: DO_SPRINTS("", int, unsigned int); break;
^
Objects/unicodeobject.c:2930:33: note: expanded from macro 'DO_SPRINTS'
case 'u': len = SPRINT(SIZE_SPEC, "u", UNSIGNED_TYPE); break; \
^
Objects/unicodeobject.c:2924:13: note: expanded from macro 'SPRINT'
sprintf(buffer, "%" SIZE_SPEC FMT_CHAR, va_arg(*vargs, TYPE))
^
/Library/Developer/CommandLineTools/SDKs/MacOSX.sdk/usr/include/stdio.h:180:1: note: 'sprintf' has been explicitly marked deprecated here
__deprecated_msg("This function is provided for compatibility reasons only. Due to security concerns inherent in the design of sprintf(3), it is highly recommended that you use snprintf(3) instead.")
^
/Library/Developer/CommandLineTools/SDKs/MacOSX.sdk/usr/include/sys/cdefs.h:215:48: note: expanded from macro '__deprecated_msg'
#define __deprecated_msg(_msg) __attribute__((__deprecated__(_msg)))
^
Objects/unicodeobject.c:2943:30: warning: 'sprintf' is deprecated: This function is provided for compatibility reasons only. Due to security concerns inherent in the design of sprintf(3), it is highly recommended that you use snprintf(3) instead. [-Wdeprecated-declarations]
default: DO_SPRINTS("", int, unsigned int); break;
^
Objects/unicodeobject.c:2931:33: note: expanded from macro 'DO_SPRINTS'
case 'x': len = SPRINT(SIZE_SPEC, "x", UNSIGNED_TYPE); break; \
^
Objects/unicodeobject.c:2924:13: note: expanded from macro 'SPRINT'
sprintf(buffer, "%" SIZE_SPEC FMT_CHAR, va_arg(*vargs, TYPE))
^
/Library/Developer/CommandLineTools/SDKs/MacOSX.sdk/usr/include/stdio.h:180:1: note: 'sprintf' has been explicitly marked deprecated here
__deprecated_msg("This function is provided for compatibility reasons only. Due to security concerns inherent in the design of sprintf(3), it is highly recommended that you use snprintf(3) instead.")
^
/Library/Developer/CommandLineTools/SDKs/MacOSX.sdk/usr/include/sys/cdefs.h:215:48: note: expanded from macro '__deprecated_msg'
#define __deprecated_msg(_msg) __attribute__((__deprecated__(_msg)))
^
Objects/unicodeobject.c:2943:30: warning: 'sprintf' is deprecated: This function is provided for compatibility reasons only. Due to security concerns inherent in the design of sprintf(3), it is highly recommended that you use snprintf(3) instead. [-Wdeprecated-declarations]
default: DO_SPRINTS("", int, unsigned int); break;
^
Objects/unicodeobject.c:2932:33: note: expanded from macro 'DO_SPRINTS'
case 'X': len = SPRINT(SIZE_SPEC, "X", UNSIGNED_TYPE); break; \
^
Objects/unicodeobject.c:2924:13: note: expanded from macro 'SPRINT'
sprintf(buffer, "%" SIZE_SPEC FMT_CHAR, va_arg(*vargs, TYPE))
^
/Library/Developer/CommandLineTools/SDKs/MacOSX.sdk/usr/include/stdio.h:180:1: note: 'sprintf' has been explicitly marked deprecated here
__deprecated_msg("This function is provided for compatibility reasons only. Due to security concerns inherent in the design of sprintf(3), it is highly recommended that you use snprintf(3) instead.")
^
/Library/Developer/CommandLineTools/SDKs/MacOSX.sdk/usr/include/sys/cdefs.h:215:48: note: expanded from macro '__deprecated_msg'
#define __deprecated_msg(_msg) __attribute__((__deprecated__(_msg)))
^
Objects/unicodeobject.c:2943:30: warning: 'sprintf' is deprecated: This function is provided for compatibility reasons only. Due to security concerns inherent in the design of sprintf(3), it is highly recommended that you use snprintf(3) instead. [-Wdeprecated-declarations]
default: DO_SPRINTS("", int, unsigned int); break;
^
Objects/unicodeobject.c:2933:33: note: expanded from macro 'DO_SPRINTS'
default: len = SPRINT(SIZE_SPEC, "d", SIGNED_TYPE); break; \
^
Objects/unicodeobject.c:2924:13: note: expanded from macro 'SPRINT'
sprintf(buffer, "%" SIZE_SPEC FMT_CHAR, va_arg(*vargs, TYPE))
^
/Library/Developer/CommandLineTools/SDKs/MacOSX.sdk/usr/include/stdio.h:180:1: note: 'sprintf' has been explicitly marked deprecated here
__deprecated_msg("This function is provided for compatibility reasons only. Due to security concerns inherent in the design of sprintf(3), it is highly recommended that you use snprintf(3) instead.")
^
/Library/Developer/CommandLineTools/SDKs/MacOSX.sdk/usr/include/sys/cdefs.h:215:48: note: expanded from macro '__deprecated_msg'
#define __deprecated_msg(_msg) __attribute__((__deprecated__(_msg)))
^
Objects/unicodeobject.c:2997:15: warning: 'sprintf' is deprecated: This function is provided for compatibility reasons only. Due to security concerns inherent in the design of sprintf(3), it is highly recommended that you use snprintf(3) instead. [-Wdeprecated-declarations]
len = sprintf(number, "%p", va_arg(*vargs, void*));
^
/Library/Developer/CommandLineTools/SDKs/MacOSX.sdk/usr/include/stdio.h:180:1: note: 'sprintf' has been explicitly marked deprecated here
__deprecated_msg("This function is provided for compatibility reasons only. Due to security concerns inherent in the design of sprintf(3), it is highly recommended that you use snprintf(3) instead.")
^
/Library/Developer/CommandLineTools/SDKs/MacOSX.sdk/usr/include/sys/cdefs.h:215:48: note: expanded from macro '__deprecated_msg'
#define __deprecated_msg(_msg) __attribute__((__deprecated__(_msg)))
^
Objects/unicodeobject.c:9018:13: warning: 'sprintf' is deprecated: This function is provided for compatibility reasons only. Due to security concerns inherent in the design of sprintf(3), it is highly recommended that you use snprintf(3) instead. [-Wdeprecated-declarations]
sprintf(buffer, "&#%d;", (int)PyUnicode_READ_CHAR(unicode, collpos));
^
/Library/Developer/CommandLineTools/SDKs/MacOSX.sdk/usr/include/stdio.h:180:1: note: 'sprintf' has been explicitly marked deprecated here
__deprecated_msg("This function is provided for compatibility reasons only. Due to security concerns inherent in the design of sprintf(3), it is highly recommended that you use snprintf(3) instead.")
^
/Library/Developer/CommandLineTools/SDKs/MacOSX.sdk/usr/include/sys/cdefs.h:215:48: note: expanded from macro '__deprecated_msg'
#define __deprecated_msg(_msg) __attribute__((__deprecated__(_msg)))
^
Python/ceval_gil.c:81:24: warning: code will never be executed [-Wunreachable-code]
int32_t npending = _Py_atomic_load_int32_relaxed(
^~~~~~~~~~~~~~~~~~~~~~~~~~~~~
1 warning generated.
1 warning generated.
Python/pystrtod.c:1204:19: warning: 'sprintf' is deprecated: This function is provided for compatibility reasons only. Due to security concerns inherent in the design of sprintf(3), it is highly recommended that you use snprintf(3) instead. [-Wdeprecated-declarations]
exp_len = sprintf(p, "%+.02d", exp);
^
/Library/Developer/CommandLineTools/SDKs/MacOSX.sdk/usr/include/stdio.h:180:1: note: 'sprintf' has been explicitly marked deprecated here
__deprecated_msg("This function is provided for compatibility reasons only. Due to security concerns inherent in the design of sprintf(3), it is highly recommended that you use snprintf(3) instead.")
^
/Library/Developer/CommandLineTools/SDKs/MacOSX.sdk/usr/include/sys/cdefs.h:215:48: note: expanded from macro '__deprecated_msg'
#define __deprecated_msg(_msg) __attribute__((__deprecated__(_msg)))
^
1 warning generated.
./Modules/_datetimemodule.c:1850:9: warning: 'sprintf' is deprecated: This function is provided for compatibility reasons only. Due to security concerns inherent in the design of sprintf(3), it is highly recommended that you use snprintf(3) instead. [-Wdeprecated-declarations]
sprintf(freplacement, "%06d", TIME_GET_MICROSECOND(object));
^
/Library/Developer/CommandLineTools/SDKs/MacOSX.sdk/usr/include/stdio.h:180:1: note: 'sprintf' has been explicitly marked deprecated here
__deprecated_msg("This function is provided for compatibility reasons only. Due to security concerns inherent in the design of sprintf(3), it is highly recommended that you use snprintf(3) instead.")
^
/Library/Developer/CommandLineTools/SDKs/MacOSX.sdk/usr/include/sys/cdefs.h:215:48: note: expanded from macro '__deprecated_msg'
#define __deprecated_msg(_msg) __attribute__((__deprecated__(_msg)))
^
./Modules/_datetimemodule.c:1852:9: warning: 'sprintf' is deprecated: This function is provided for compatibility reasons only. Due to security concerns inherent in the design of sprintf(3), it is highly recommended that you use snprintf(3) instead. [-Wdeprecated-declarations]
sprintf(freplacement, "%06d", DATE_GET_MICROSECOND(object));
^
/Library/Developer/CommandLineTools/SDKs/MacOSX.sdk/usr/include/stdio.h:180:1: note: 'sprintf' has been explicitly marked deprecated here
__deprecated_msg("This function is provided for compatibility reasons only. Due to security concerns inherent in the design of sprintf(3), it is highly recommended that you use snprintf(3) instead.")
^
/Library/Developer/CommandLineTools/SDKs/MacOSX.sdk/usr/include/sys/cdefs.h:215:48: note: expanded from macro '__deprecated_msg'
#define __deprecated_msg(_msg) __attribute__((__deprecated__(_msg)))
^
./Modules/_datetimemodule.c:1854:9: warning: 'sprintf' is deprecated: This function is provided for compatibility reasons only. Due to security concerns inherent in the design of sprintf(3), it is highly recommended that you use snprintf(3) instead. [-Wdeprecated-declarations]
sprintf(freplacement, "%06d", 0);
^
/Library/Developer/CommandLineTools/SDKs/MacOSX.sdk/usr/include/stdio.h:180:1: note: 'sprintf' has been explicitly marked deprecated here
__deprecated_msg("This function is provided for compatibility reasons only. Due to security concerns inherent in the design of sprintf(3), it is highly recommended that you use snprintf(3) instead.")
^
/Library/Developer/CommandLineTools/SDKs/MacOSX.sdk/usr/include/sys/cdefs.h:215:48: note: expanded from macro '__deprecated_msg'
#define __deprecated_msg(_msg) __attribute__((__deprecated__(_msg)))
^
33 warnings generated.
3 warnings generated.
Programs/_freeze_module.c:129:5: warning: 'sprintf' is deprecated: This function is provided for compatibility reasons only. Due to security concerns inherent in the design of sprintf(3), it is highly recommended that you use snprintf(3) instead. [-Wdeprecated-declarations]
sprintf(filename, "<frozen %s>", name);
^
/Library/Developer/CommandLineTools/SDKs/MacOSX.sdk/usr/include/stdio.h:180:1: note: 'sprintf' has been explicitly marked deprecated here
__deprecated_msg("This function is provided for compatibility reasons only. Due to security concerns inherent in the design of sprintf(3), it is highly recommended that you use snprintf(3) instead.")
^
/Library/Developer/CommandLineTools/SDKs/MacOSX.sdk/usr/include/sys/cdefs.h:215:48: note: expanded from macro '__deprecated_msg'
#define __deprecated_msg(_msg) __attribute__((__deprecated__(_msg)))
^
1 warning generated.
./Modules/_pickle.c:2156:13: warning: 'sprintf' is deprecated: This function is provided for compatibility reasons only. Due to security concerns inherent in the design of sprintf(3), it is highly recommended that you use snprintf(3) instead. [-Wdeprecated-declarations]
sprintf(pdata, "%c%ld\n", INT, val);
^
/Library/Developer/CommandLineTools/SDKs/MacOSX.sdk/usr/include/stdio.h:180:1: note: 'sprintf' has been explicitly marked deprecated here
__deprecated_msg("This function is provided for compatibility reasons only. Due to security concerns inherent in the design of sprintf(3), it is highly recommended that you use snprintf(3) instead.")
^
/Library/Developer/CommandLineTools/SDKs/MacOSX.sdk/usr/include/sys/cdefs.h:215:48: note: expanded from macro '__deprecated_msg'
#define __deprecated_msg(_msg) __attribute__((__deprecated__(_msg)))
^
1 warning generated.
./Modules/unicodedata.c:1334:9: warning: 'sprintf' is deprecated: This function is provided for compatibility reasons only. Due to security concerns inherent in the design of sprintf(3), it is highly recommended that you use snprintf(3) instead. [-Wdeprecated-declarations]
sprintf(buffer, "CJK UNIFIED IDEOGRAPH-%X", code);
^
/Library/Developer/CommandLineTools/SDKs/MacOSX.sdk/usr/include/stdio.h:180:1: note: 'sprintf' has been explicitly marked deprecated here
__deprecated_msg("This function is provided for compatibility reasons only. Due to security concerns inherent in the design of sprintf(3), it is highly recommended that you use snprintf(3) instead.")
^
/Library/Developer/CommandLineTools/SDKs/MacOSX.sdk/usr/include/sys/cdefs.h:215:48: note: expanded from macro '__deprecated_msg'
#define __deprecated_msg(_msg) __attribute__((__deprecated__(_msg)))
^
1 warning generated.
./Modules/_ctypes/_ctypes.c:389:17: warning: 'sprintf' is deprecated: This function is provided for compatibility reasons only. Due to security concerns inherent in the design of sprintf(3), it is highly recommended that you use snprintf(3) instead. [-Wdeprecated-declarations]
sprintf(buf, "%zd,", shape[k]);
^
/Library/Developer/CommandLineTools/SDKs/MacOSX.sdk/usr/include/stdio.h:180:1: note: 'sprintf' has been explicitly marked deprecated here
__deprecated_msg("This function is provided for compatibility reasons only. Due to security concerns inherent in the design of sprintf(3), it is highly recommended that you use snprintf(3) instead.")
^
/Library/Developer/CommandLineTools/SDKs/MacOSX.sdk/usr/include/sys/cdefs.h:215:48: note: expanded from macro '__deprecated_msg'
#define __deprecated_msg(_msg) __attribute__((__deprecated__(_msg)))
^
./Modules/_ctypes/_ctypes.c:391:17: warning: 'sprintf' is deprecated: This function is provided for compatibility reasons only. Due to security concerns inherent in the design of sprintf(3), it is highly recommended that you use snprintf(3) instead. [-Wdeprecated-declarations]
sprintf(buf, "%zd)", shape[k]);
^
/Library/Developer/CommandLineTools/SDKs/MacOSX.sdk/usr/include/stdio.h:180:1: note: 'sprintf' has been explicitly marked deprecated here
__deprecated_msg("This function is provided for compatibility reasons only. Due to security concerns inherent in the design of sprintf(3), it is highly recommended that you use snprintf(3) instead.")
^
/Library/Developer/CommandLineTools/SDKs/MacOSX.sdk/usr/include/sys/cdefs.h:215:48: note: expanded from macro '__deprecated_msg'
#define __deprecated_msg(_msg) __attribute__((__deprecated__(_msg)))
^
./Modules/_ctypes/_ctypes.c:2925:11: warning: 'sprintf' is deprecated: This function is provided for compatibility reasons only. Due to security concerns inherent in the design of sprintf(3), it is highly recommended that you use snprintf(3) instead. [-Wdeprecated-declarations]
cp += sprintf(cp, "%x", Py_SAFE_DOWNCAST(index, Py_ssize_t, int));
^
/Library/Developer/CommandLineTools/SDKs/MacOSX.sdk/usr/include/stdio.h:180:1: note: 'sprintf' has been explicitly marked deprecated here
__deprecated_msg("This function is provided for compatibility reasons only. Due to security concerns inherent in the design of sprintf(3), it is highly recommended that you use snprintf(3) instead.")
^
/Library/Developer/CommandLineTools/SDKs/MacOSX.sdk/usr/include/sys/cdefs.h:215:48: note: expanded from macro '__deprecated_msg'
#define __deprecated_msg(_msg) __attribute__((__deprecated__(_msg)))
^
./Modules/_ctypes/_ctypes.c:2934:15: warning: 'sprintf' is deprecated: This function is provided for compatibility reasons only. Due to security concerns inherent in the design of sprintf(3), it is highly recommended that you use snprintf(3) instead. [-Wdeprecated-declarations]
cp += sprintf(cp, ":%x", Py_SAFE_DOWNCAST(target->b_index, Py_ssize_t, int));
^
/Library/Developer/CommandLineTools/SDKs/MacOSX.sdk/usr/include/stdio.h:180:1: note: 'sprintf' has been explicitly marked deprecated here
__deprecated_msg("This function is provided for compatibility reasons only. Due to security concerns inherent in the design of sprintf(3), it is highly recommended that you use snprintf(3) instead.")
^
/Library/Developer/CommandLineTools/SDKs/MacOSX.sdk/usr/include/sys/cdefs.h:215:48: note: expanded from macro '__deprecated_msg'
#define __deprecated_msg(_msg) __attribute__((__deprecated__(_msg)))
^
./Modules/_ctypes/_ctypes.c:5355:5: warning: 'sprintf' is deprecated: This function is provided for compatibility reasons only. Due to security concerns inherent in the design of sprintf(3), it is highly recommended that you use snprintf(3) instead. [-Wdeprecated-declarations]
sprintf(name, "%.200s_Array_%ld",
^
/Library/Developer/CommandLineTools/SDKs/MacOSX.sdk/usr/include/stdio.h:180:1: note: 'sprintf' has been explicitly marked deprecated here
__deprecated_msg("This function is provided for compatibility reasons only. Due to security concerns inherent in the design of sprintf(3), it is highly recommended that you use snprintf(3) instead.")
^
/Library/Developer/CommandLineTools/SDKs/MacOSX.sdk/usr/include/sys/cdefs.h:215:48: note: expanded from macro '__deprecated_msg'
#define __deprecated_msg(_msg) __attribute__((__deprecated__(_msg)))
^
./Modules/_testcapimodule.c:786:17: warning: 'sprintf' is deprecated: This function is provided for compatibility reasons only. Due to security concerns inherent in the design of sprintf(3), it is highly recommended that you use snprintf(3) instead. [-Wdeprecated-declarations]
FAIL("PyCapsule_GetPointer returned NULL unexpectedly!");
^
./Modules/_testcapimodule.c:775:13: note: expanded from macro 'FAIL'
sprintf(buffer, "%s module: \"%s\" attribute: \"%s\"", \
^
/Library/Developer/CommandLineTools/SDKs/MacOSX.sdk/usr/include/stdio.h:180:1: note: 'sprintf' has been explicitly marked deprecated here
__deprecated_msg("This function is provided for compatibility reasons only. Due to security concerns inherent in the design of sprintf(3), it is highly recommended that you use snprintf(3) instead.")
^
/Library/Developer/CommandLineTools/SDKs/MacOSX.sdk/usr/include/sys/cdefs.h:215:48: note: expanded from macro '__deprecated_msg'
#define __deprecated_msg(_msg) __attribute__((__deprecated__(_msg)))
^
./Modules/_testcapimodule.c:798:17: warning: 'sprintf' is deprecated: This function is provided for compatibility reasons only. Due to security concerns inherent in the design of sprintf(3), it is highly recommended that you use snprintf(3) instead. [-Wdeprecated-declarations]
FAIL("PyCapsule_GetPointer should have failed but did not!");
^
./Modules/_testcapimodule.c:775:13: note: expanded from macro 'FAIL'
sprintf(buffer, "%s module: \"%s\" attribute: \"%s\"", \
^
/Library/Developer/CommandLineTools/SDKs/MacOSX.sdk/usr/include/stdio.h:180:1: note: 'sprintf' has been explicitly marked deprecated here
__deprecated_msg("This function is provided for compatibility reasons only. Due to security concerns inherent in the design of sprintf(3), it is highly recommended that you use snprintf(3) instead.")
^
/Library/Developer/CommandLineTools/SDKs/MacOSX.sdk/usr/include/sys/cdefs.h:215:48: note: expanded from macro '__deprecated_msg'
#define __deprecated_msg(_msg) __attribute__((__deprecated__(_msg)))
^
./Modules/_testcapimodule.c:805:21: warning: 'sprintf' is deprecated: This function is provided for compatibility reasons only. Due to security concerns inherent in the design of sprintf(3), it is highly recommended that you use snprintf(3) instead. [-Wdeprecated-declarations]
FAIL("PyCapsule_GetPointer should not have"
^
./Modules/_testcapimodule.c:775:13: note: expanded from macro 'FAIL'
sprintf(buffer, "%s module: \"%s\" attribute: \"%s\"", \
^
/Library/Developer/CommandLineTools/SDKs/MacOSX.sdk/usr/include/stdio.h:180:1: note: 'sprintf' has been explicitly marked deprecated here
__deprecated_msg("This function is provided for compatibility reasons only. Due to security concerns inherent in the design of sprintf(3), it is highly recommended that you use snprintf(3) instead.")
^
/Library/Developer/CommandLineTools/SDKs/MacOSX.sdk/usr/include/sys/cdefs.h:215:48: note: expanded from macro '__deprecated_msg'
#define __deprecated_msg(_msg) __attribute__((__deprecated__(_msg)))
^
./Modules/_testcapimodule.c:808:21: warning: 'sprintf' is deprecated: This function is provided for compatibility reasons only. Due to security concerns inherent in the design of sprintf(3), it is highly recommended that you use snprintf(3) instead. [-Wdeprecated-declarations]
FAIL("PyCapsule_GetPointer should have"
^
./Modules/_testcapimodule.c:775:13: note: expanded from macro 'FAIL'
sprintf(buffer, "%s module: \"%s\" attribute: \"%s\"", \
^
/Library/Developer/CommandLineTools/SDKs/MacOSX.sdk/usr/include/stdio.h:180:1: note: 'sprintf' has been explicitly marked deprecated here
__deprecated_msg("This function is provided for compatibility reasons only. Due to security concerns inherent in the design of sprintf(3), it is highly recommended that you use snprintf(3) instead.")
^
/Library/Developer/CommandLineTools/SDKs/MacOSX.sdk/usr/include/sys/cdefs.h:215:48: note: expanded from macro '__deprecated_msg'
#define __deprecated_msg(_msg) __attribute__((__deprecated__(_msg)))
^
5 warnings generated.
4 warnings generated.
ld: warning: search path '/opt/homebrew/lib' not found
ld: warning: search path '/opt/homebrew/lib' not found
ld: warning: search path '/opt/homebrew/lib' not found
ld: warning: search path '/opt/homebrew/lib' not found
ld: warning: search path '/opt/homebrew/lib' not found
ld: warning: search path '/opt/homebrew/lib' not found
ld: warning: search path '/opt/homebrew/lib' not found
ld: warning: search path '/opt/homebrew/lib' not found
ld: warning: search path '/opt/homebrew/lib' not found
ld: warning: search path '/opt/homebrew/lib' not found
ld: warning: search path '/opt/homebrew/lib' not found
ld: warning: search path '/opt/homebrew/lib' not found
ld: warning: search path '/opt/homebrew/lib' not found
ld: warning: search path '/opt/homebrew/lib' not found
ld: warning: search path '/opt/homebrew/lib' not found
ld: warning: search path '/opt/homebrew/lib' not found
ld: warning: search path '/opt/homebrew/lib' not found
ld: warning: search path '/opt/homebrew/lib' not found
ld: warning: search path '/opt/homebrew/lib' not found
ld: warning: search path '/opt/homebrew/lib' not found
ld: warning: search path '/opt/homebrew/lib' not found
ld: warning: search path '/opt/homebrew/lib' not found
ld: warning: search path '/opt/homebrew/lib' not found
ld: warning: search path '/opt/homebrew/lib' not found
ld: warning: search path '/opt/homebrew/lib' not found
ld: warning: search path '/opt/homebrew/lib' not found
ld: warning: search path '/opt/homebrew/lib' not found
ld: warning: search path '/opt/homebrew/lib' not found
ld: warning: search path '/opt/homebrew/lib' not found
ld: warning: search path '/opt/homebrew/lib' not found
ld: warning: search path '/opt/homebrew/lib' not found
ld: warning: search path '/opt/homebrew/lib' not found
ld: warning: search path '/opt/homebrew/lib' not found
ld: warning: search path '/opt/homebrew/lib' not found
ld: warning: search path '/opt/homebrew/lib' not found
ld: warning: search path '/opt/homebrew/lib' not found
ld: warning: search path '/opt/homebrew/lib' not found
ld: warning: search path '/opt/homebrew/lib' not found
ld: warning: search path '/opt/homebrew/lib' not found
ld: warning: search path '/opt/homebrew/lib' not found
ld: warning: search path '/opt/homebrew/lib' not found
ld: warning: search path '/opt/homebrew/lib' not found
ld: warning: search path '/opt/homebrew/lib' not found
ld: warning: search path '/opt/homebrew/lib' not found
ld: warning: search path '/opt/homebrew/lib' not found
ld: warning: search path '/opt/homebrew/lib' not found
ld: warning: search path '/opt/homebrew/lib' not found
ld: warning: search path '/opt/homebrew/lib' not found
ld: warning: search path '/opt/homebrew/lib' not found
ld: warning: search path '/opt/homebrew/lib' not found
ld: warning: search path '/opt/homebrew/lib' not found
ld: warning: search path '/opt/homebrew/lib' not found
ld: warning: search path '/opt/homebrew/lib' not found
ld: warning: search path '/opt/homebrew/lib' not found
ld: warning: search path '/opt/homebrew/lib' not found
ld: warning: search path '/opt/homebrew/lib' not found
ld: warning: search path '/opt/homebrew/lib' not found
ld: warning: search path '/opt/homebrew/lib' not found
ld: warning: search path '/opt/homebrew/lib' not found
ld: warning: search path '/opt/homebrew/lib' not found
ld: warning: search path '/opt/homebrew/lib' not found
ld: warning: search path '/opt/homebrew/lib' not found
ld: warning: search path '/opt/homebrew/lib' not found
ld: warning: search path '/opt/homebrew/lib' not found
ld: warning: search path '/opt/homebrew/lib' not found
ld: warning: search path '/opt/homebrew/lib' not found
ld: warning: search path '/opt/homebrew/lib' not found
ld: warning: search path '/opt/homebrew/lib' not found
ld: warning: search path '/opt/homebrew/lib' not found
ld: warning: search path '/opt/homebrew/lib' not found
ld: warning: search path '/opt/homebrew/lib' not found
ld: warning: search path '/opt/homebrew/lib' not found
ld: warning: search path '/opt/homebrew/lib' not found
ld: warning: search path '/opt/homebrew/lib' not found
ld: warning: search path '/opt/homebrew/lib' not found
ld: warning: search path '/opt/homebrew/lib' not found
make: *** [buildbottest] Error 2
Test report
===========
Failed tests:
- test_tracemalloc
Sincerely,
-The Buildbot
1
0
☠ Buildbot (Python): python/cpython - failed test (failure) (3.13)
by buildbot@python.org Sept. 15, 2025
by buildbot@python.org Sept. 15, 2025
Sept. 15, 2025
The Buildbot has detected a new failure on builder ARM64 MacOS M1 Refleaks NoGIL 3.13 while building python/cpython.
Full details are available at:
https://buildbot.python.org/#/builders/1396/builds/1595
Buildbot URL: https://buildbot.python.org/
Worker for this Build: itamaro-macos-arm64-aws
Build Reason: <unknown>
Blamelist: Miss Islington (bot) <31488909+miss-islington(a)users.noreply.github.com>
BUILD FAILED: failed test (failure)
Summary of the results of the build (if available):
===================================================
==
Captured traceback
==================
Traceback (most recent call last):
File "/Users/buildbot/buildarea/3.13.itamaro-macos-arm64-aws.macos-with-brew.refleak.nogil/build/Lib/test/_test_multiprocessing.py", line 1492, in test_repr_rlock
self.assertEqual('<RLock(SomeOtherThread, nonzero)>', repr(lock))
~~~~~~~~~~~~~~~~^^^^^^^^^^^^^^^^^^^^^^^^^^^^^^^^^^^^^^^^^^^^^^^^^
AssertionError: '<RLock(SomeOtherThread, nonzero)>' != '<RLock(None, 0)>'
- <RLock(SomeOtherThread, nonzero)>
+ <RLock(None, 0)>
Test report
===========
Failed tests:
- test.test_multiprocessing_spawn.test_processes
Failed subtests:
- test_repr_rlock - test.test_multiprocessing_spawn.test_processes.WithProcessesTestLock.test_repr_rlock
Sincerely,
-The Buildbot
1
0
☠ Buildbot (Python): python/cpython - failed test (failure) (main)
by buildbot@python.org Sept. 15, 2025
by buildbot@python.org Sept. 15, 2025
Sept. 15, 2025
The Buildbot has detected a new failure on builder AMD64 CentOS9 NoGIL Refleaks 3.x while building python/cpython.
Full details are available at:
https://buildbot.python.org/#/builders/1610/builds/2071
Buildbot URL: https://buildbot.python.org/
Worker for this Build: itamaro-centos-aws
Build Reason: <unknown>
Blamelist: László Kiss Kollár <kiss.kollar.laszlo(a)gmail.com>
BUILD FAILED: failed test (failure)
Summary of the results of the build (if available):
===================================================
==
Captured traceback
==================
remote: Enumerating objects: 22, done.
remote: Counting objects: 4% (1/22)
remote: Counting objects: 9% (2/22)
remote: Counting objects: 13% (3/22)
remote: Counting objects: 18% (4/22)
remote: Counting objects: 22% (5/22)
remote: Counting objects: 27% (6/22)
remote: Counting objects: 31% (7/22)
remote: Counting objects: 36% (8/22)
remote: Counting objects: 40% (9/22)
remote: Counting objects: 45% (10/22)
remote: Counting objects: 50% (11/22)
remote: Counting objects: 54% (12/22)
remote: Counting objects: 59% (13/22)
remote: Counting objects: 63% (14/22)
remote: Counting objects: 68% (15/22)
remote: Counting objects: 72% (16/22)
remote: Counting objects: 77% (17/22)
remote: Counting objects: 81% (18/22)
remote: Counting objects: 86% (19/22)
remote: Counting objects: 90% (20/22)
remote: Counting objects: 95% (21/22)
remote: Counting objects: 100% (22/22)
remote: Counting objects: 100% (22/22), done.
remote: Compressing objects: 12% (1/8)
remote: Compressing objects: 25% (2/8)
remote: Compressing objects: 37% (3/8)
remote: Compressing objects: 50% (4/8)
remote: Compressing objects: 62% (5/8)
remote: Compressing objects: 75% (6/8)
remote: Compressing objects: 87% (7/8)
remote: Compressing objects: 100% (8/8)
remote: Compressing objects: 100% (8/8), done.
remote: Total 12 (delta 9), reused 5 (delta 4), pack-reused 0 (from 0)
From https://github.com/python/cpython
* branch main -> FETCH_HEAD
Note: switching to '3e06cfcaeee31c2a6e9befe5ea54d9beaa2c0434'.
You are in 'detached HEAD' state. You can look around, make experimental
changes and commit them, and you can discard any commits you make in this
state without impacting any branches by switching back to a branch.
If you want to create a new branch to retain commits you create, you may
do so (now or later) by using -c with the switch command. Example:
git switch -c <new-branch-name>
Or undo this operation with:
git switch -
Turn off this advice by setting config variable advice.detachedHead to false
HEAD is now at 3e06cfcaeee gh-135953: Reduce memory usage of stack collectors (#138875)
Switched to and reset branch 'main'
configure: WARNING: no system libmpdec found; falling back to pure-Python version for the decimal module
make: *** [Makefile:2486: buildbottest] Error 2
Test report
===========
Failed tests:
- test_free_threading
Test leaking resources:
- test_free_threading: file descriptors
Sincerely,
-The Buildbot
1
0
☠ Buildbot (Python): python/cpython - failed test (failure) (main)
by buildbot@python.org Sept. 15, 2025
by buildbot@python.org Sept. 15, 2025
Sept. 15, 2025
The Buildbot has detected a new failure on builder AMD64 Windows PGO NoGIL 3.x while building python/cpython.
Full details are available at:
https://buildbot.python.org/#/builders/1622/builds/2638
Buildbot URL: https://buildbot.python.org/
Worker for this Build: itamaro-win64-srv-22-aws
Build Reason: <unknown>
Blamelist: Pablo Galindo Salgado <Pablogsal(a)gmail.com>, Victor Stinner <vstinner(a)python.org>
BUILD FAILED: failed test (failure)
Summary of the results of the build (if available):
===================================================
==
Captured traceback
==================
remote: Enumerating objects: 29, done.
remote: Counting objects: 3% (1/29)
remote: Counting objects: 6% (2/29)
remote: Counting objects: 10% (3/29)
remote: Counting objects: 13% (4/29)
remote: Counting objects: 17% (5/29)
remote: Counting objects: 20% (6/29)
remote: Counting objects: 24% (7/29)
remote: Counting objects: 27% (8/29)
remote: Counting objects: 31% (9/29)
remote: Counting objects: 34% (10/29)
remote: Counting objects: 37% (11/29)
remote: Counting objects: 41% (12/29)
remote: Counting objects: 44% (13/29)
remote: Counting objects: 48% (14/29)
remote: Counting objects: 51% (15/29)
remote: Counting objects: 55% (16/29)
remote: Counting objects: 58% (17/29)
remote: Counting objects: 62% (18/29)
remote: Counting objects: 65% (19/29)
remote: Counting objects: 68% (20/29)
remote: Counting objects: 72% (21/29)
remote: Counting objects: 75% (22/29)
remote: Counting objects: 79% (23/29)
remote: Counting objects: 82% (24/29)
remote: Counting objects: 86% (25/29)
remote: Counting objects: 89% (26/29)
remote: Counting objects: 93% (27/29)
remote: Counting objects: 96% (28/29)
remote: Counting objects: 100% (29/29)
remote: Counting objects: 100% (29/29), done.
remote: Compressing objects: 6% (1/16)
remote: Compressing objects: 12% (2/16)
remote: Compressing objects: 18% (3/16)
remote: Compressing objects: 25% (4/16)
remote: Compressing objects: 31% (5/16)
remote: Compressing objects: 37% (6/16)
remote: Compressing objects: 43% (7/16)
remote: Compressing objects: 50% (8/16)
remote: Compressing objects: 56% (9/16)
remote: Compressing objects: 62% (10/16)
remote: Compressing objects: 68% (11/16)
remote: Compressing objects: 75% (12/16)
remote: Compressing objects: 81% (13/16)
remote: Compressing objects: 87% (14/16)
remote: Compressing objects: 93% (15/16)
remote: Compressing objects: 100% (16/16)
remote: Compressing objects: 100% (16/16), done.
remote: Total 17 (delta 14), reused 4 (delta 1), pack-reused 0 (from 0)
From https://github.com/python/cpython
* branch main -> FETCH_HEAD
Note: switching to 'c5180d74e199e5bdb8f1c149dc3e956071ebf365'.
You are in 'detached HEAD' state. You can look around, make experimental
changes and commit them, and you can discard any commits you make in this
state without impacting any branches by switching back to a branch.
If you want to create a new branch to retain commits you create, you may
do so (now or later) by using -c with the switch command. Example:
git switch -c <new-branch-name>
Or undo this operation with:
git switch -
Turn off this advice by setting config variable advice.detachedHead to false
HEAD is now at c5180d74e19 gh-137992: Stop the world when calling PyRefTracer_SetTracer (#137994)
Switched to and reset branch 'main'
Could Not Find C:\Users\Administrator\buildarea\3.x.itamaro-win64-srv-22-aws.nogil.pgo\build\PCbuild\*.pgc
Could Not Find C:\Users\Administrator\buildarea\3.x.itamaro-win64-srv-22-aws.nogil.pgo\build\Lib\*.pyc
'"C:\Users\Administrator\buildarea\3.x.itamaro-win64-srv-22-aws.nogil.pgo\build\PCbuild\\..\python.bat"' is not recognized as an internal or external command,
operable program or batch file.
Could Not Find C:\Users\Administrator\buildarea\3.x.itamaro-win64-srv-22-aws.nogil.pgo\build\PCbuild\*.pgc
Could Not Find C:\Users\Administrator\buildarea\3.x.itamaro-win64-srv-22-aws.nogil.pgo\build\Lib\*.pyc
'"C:\Users\Administrator\buildarea\3.x.itamaro-win64-srv-22-aws.nogil.pgo\build\PCbuild\\..\python.bat"' is not recognized as an internal or external command,
operable program or batch file.
Could Not Find C:\Users\Administrator\buildarea\3.x.itamaro-win64-srv-22-aws.nogil.pgo\build\Lib\*.pyc
The system cannot find the file specified.
Could Not Find C:\Users\Administrator\buildarea\3.x.itamaro-win64-srv-22-aws.nogil.pgo\build\PCbuild\python*.zip
Could Not Find C:\Users\Administrator\buildarea\3.x.itamaro-win64-srv-22-aws.nogil.pgo\build\PCbuild\*.pgc
Could Not Find C:\Users\Administrator\buildarea\3.x.itamaro-win64-srv-22-aws.nogil.pgo\build\Lib\*.pyc
Could Not Find C:\Users\Administrator\buildarea\3.x.itamaro-win64-srv-22-aws.nogil.pgo\build\PCbuild\python*.zip
Test report
===========
Failed tests:
- test_tracemalloc
Sincerely,
-The Buildbot
1
0
☠ Buildbot (Python): python/cpython - failed test (failure) (3.13)
by buildbot@python.org Sept. 14, 2025
by buildbot@python.org Sept. 14, 2025
Sept. 14, 2025
The Buildbot has detected a new failure on builder ARM64 MacOS M1 Refleaks NoGIL 3.13 while building python/cpython.
Full details are available at:
https://buildbot.python.org/#/builders/1396/builds/1590
Buildbot URL: https://buildbot.python.org/
Worker for this Build: itamaro-macos-arm64-aws
Build Reason: <unknown>
Blamelist: Miss Islington (bot) <31488909+miss-islington(a)users.noreply.github.com>
BUILD FAILED: failed test (failure)
Summary of the results of the build (if available):
===================================================
==
Captured traceback
==================
Traceback (most recent call last):
File "/Users/buildbot/buildarea/3.13.itamaro-macos-arm64-aws.macos-with-brew.refleak.nogil/build/Lib/test/_test_multiprocessing.py", line 1492, in test_repr_rlock
self.assertEqual('<RLock(SomeOtherThread, nonzero)>', repr(lock))
~~~~~~~~~~~~~~~~^^^^^^^^^^^^^^^^^^^^^^^^^^^^^^^^^^^^^^^^^^^^^^^^^
AssertionError: '<RLock(SomeOtherThread, nonzero)>' != '<RLock(None, 0)>'
- <RLock(SomeOtherThread, nonzero)>
+ <RLock(None, 0)>
Test report
===========
Failed tests:
- test.test_multiprocessing_forkserver.test_processes
Failed subtests:
- test_repr_rlock - test.test_multiprocessing_forkserver.test_processes.WithProcessesTestLock.test_repr_rlock
- test_repr_rlock - test.test_multiprocessing_spawn.test_processes.WithProcessesTestLock.test_repr_rlock
Test leaking resources:
- test_processes: memory blocks
Sincerely,
-The Buildbot
1
0
☠ Buildbot (Python): python/cpython - failed test (failure) (3.11)
by buildbot@python.org Sept. 13, 2025
by buildbot@python.org Sept. 13, 2025
Sept. 13, 2025
The Buildbot has detected a new failure on builder s390x RHEL9 Refleaks 3.11 while building python/cpython.
Full details are available at:
https://buildbot.python.org/#/builders/1586/builds/63
Buildbot URL: https://buildbot.python.org/
Worker for this Build: cstratak-rhel9-s390x
Build Reason: <unknown>
Blamelist: Miss Islington (bot) <31488909+miss-islington(a)users.noreply.github.com>
BUILD FAILED: failed test (failure)
Summary of the results of the build (if available):
===================================================
==
Captured traceback
==================
remote: Enumerating objects: 11, done.
remote: Counting objects: 14% (1/7)
remote: Counting objects: 28% (2/7)
remote: Counting objects: 42% (3/7)
remote: Counting objects: 57% (4/7)
remote: Counting objects: 71% (5/7)
remote: Counting objects: 85% (6/7)
remote: Counting objects: 100% (7/7)
remote: Counting objects: 100% (7/7), done.
remote: Compressing objects: 25% (1/4)
remote: Compressing objects: 50% (2/4)
remote: Compressing objects: 75% (3/4)
remote: Compressing objects: 100% (4/4)
remote: Compressing objects: 100% (4/4), done.
remote: Total 11 (delta 3), reused 3 (delta 3), pack-reused 4 (from 2)
From https://github.com/python/cpython
* branch 3.11 -> FETCH_HEAD
Note: switching to 'b4ec17488eedec36d3c05fec127df71c0071f6cb'.
You are in 'detached HEAD' state. You can look around, make experimental
changes and commit them, and you can discard any commits you make in this
state without impacting any branches by switching back to a branch.
If you want to create a new branch to retain commits you create, you may
do so (now or later) by using -c with the switch command. Example:
git switch -c <new-branch-name>
Or undo this operation with:
git switch -
Turn off this advice by setting config variable advice.detachedHead to false
HEAD is now at b4ec17488ee [3.11] gh-130577: tarfile now validates archives to ensure member offsets are non-negative (GH-137027) (#137172)
Switched to and reset branch '3.11'
renaming build/scripts-3.11/pydoc3 to build/scripts-3.11/pydoc3.11
renaming build/scripts-3.11/idle3 to build/scripts-3.11/idle3.11
renaming build/scripts-3.11/2to3 to build/scripts-3.11/2to3-3.11
renaming build/scripts-3.11/pydoc3 to build/scripts-3.11/pydoc3.11
renaming build/scripts-3.11/idle3 to build/scripts-3.11/idle3.11
renaming build/scripts-3.11/2to3 to build/scripts-3.11/2to3-3.11
renaming build/scripts-3.11/pydoc3 to build/scripts-3.11/pydoc3.11
renaming build/scripts-3.11/idle3 to build/scripts-3.11/idle3.11
renaming build/scripts-3.11/2to3 to build/scripts-3.11/2to3-3.11
make: *** [Makefile:1852: buildbottest] Error 2
Test report
===========
Failed tests:
- test_typing
Test leaking resources:
- test_typing: memory blocks
Sincerely,
-The Buildbot
1
0
☠ Buildbot (Python): python/cpython - failed test (failure) (main)
by buildbot@python.org Sept. 12, 2025
by buildbot@python.org Sept. 12, 2025
Sept. 12, 2025
The Buildbot has detected a new failure on builder s390x Fedora Stable Refleaks 3.x while building python/cpython.
Full details are available at:
https://buildbot.python.org/#/builders/1641/builds/909
Buildbot URL: https://buildbot.python.org/
Worker for this Build: cstratak-fedora-stable-s390x
Build Reason: <unknown>
Blamelist: Stan Ulbrych <89152624+StanFromIreland(a)users.noreply.github.com>
BUILD FAILED: failed test (failure)
Summary of the results of the build (if available):
===================================================
==
Captured traceback
==================
Traceback (most recent call last):
File "/home/buildbot/buildarea/3.x.cstratak-fedora-stable-s390x.refleak/build/Lib/test/test_os.py", line 4536, in test_timerfd_ns_poll
self.check_timerfd_poll(True)
~~~~~~~~~~~~~~~~~~~~~~~^^^^^^
File "/home/buildbot/buildarea/3.x.cstratak-fedora-stable-s390x.refleak/build/Lib/test/test_os.py", line 4521, in check_timerfd_poll
self.assertEqual(self.read_count_signaled(fd), 1)
~~~~~~~~~~~~~~~~^^^^^^^^^^^^^^^^^^^^^^^^^^^^^^^^^
AssertionError: 2 != 1
Traceback (most recent call last):
File "/home/buildbot/buildarea/3.x.cstratak-fedora-stable-s390x.refleak/build/Lib/test/test_asyncio/test_ssl.py", line 1592, in test_remote_shutdown_receives_trailing_data_on_slow_socket
self.loop.run_until_complete(client(srv.addr))
~~~~~~~~~~~~~~~~~~~~~~~~~~~~^^^^^^^^^^^^^^^^^^
File "/home/buildbot/buildarea/3.x.cstratak-fedora-stable-s390x.refleak/build/Lib/asyncio/base_events.py", line 719, in run_until_complete
return future.result()
~~~~~~~~~~~~~^^
File "/home/buildbot/buildarea/3.x.cstratak-fedora-stable-s390x.refleak/build/Lib/test/test_asyncio/test_ssl.py", line 1576, in client
await future
File "/home/buildbot/buildarea/3.x.cstratak-fedora-stable-s390x.refleak/build/Lib/test/test_asyncio/test_ssl.py", line 1584, in wrapper
meth(sock)
~~~~^^^^^^
File "/home/buildbot/buildarea/3.x.cstratak-fedora-stable-s390x.refleak/build/Lib/test/test_asyncio/test_ssl.py", line 1502, in server
self.assertEqual(data_len, CHUNK * SIZE*2)
~~~~~~~~~~~~~~~~^^^^^^^^^^^^^^^^^^^^^^^^^^
AssertionError: 0 != 8388608
Test report
===========
Failed tests:
- test_os
Failed subtests:
- test_remote_shutdown_receives_trailing_data_on_slow_socket - test.test_asyncio.test_ssl.TestSSL.test_remote_shutdown_receives_trailing_data_on_slow_socket
- test_timerfd_ns_poll - test.test_os.TimerfdTests.test_timerfd_ns_poll
Sincerely,
-The Buildbot
1
0
☠ Buildbot (Python): python/cpython - failed test (failure) (main)
by buildbot@python.org Sept. 12, 2025
by buildbot@python.org Sept. 12, 2025
Sept. 12, 2025
The Buildbot has detected a new failure on builder s390x Fedora Stable Refleaks 3.x while building python/cpython.
Full details are available at:
https://buildbot.python.org/#/builders/1641/builds/906
Buildbot URL: https://buildbot.python.org/
Worker for this Build: cstratak-fedora-stable-s390x
Build Reason: <unknown>
Blamelist: Chris Eibl <138194463+chris-eibl(a)users.noreply.github.com>, Christoph Walcher <christoph-wa(a)gmx.de>, Jan-Eric Nitschke <47750513+JanEricNitschke(a)users.noreply.github.com>, Kumar Aditya <kumaraditya(a)python.org>, Victor Stinner <vstinner(a)python.org>, ivonastojanovic <80911834+ivonastojanovic(a)users.noreply.github.com>, jxes993409 <68891412+jxes993409(a)users.noreply.github.com>
BUILD FAILED: failed test (failure)
Summary of the results of the build (if available):
===================================================
==
Captured traceback
==================
Traceback (most recent call last):
File "/home/buildbot/buildarea/3.x.cstratak-fedora-stable-s390x.refleak/build/Lib/test/test_os.py", line 4476, in test_timerfd_select
self.assertEqual(self.read_count_signaled(fd), 1)
~~~~~~~~~~~~~~~~^^^^^^^^^^^^^^^^^^^^^^^^^^^^^^^^^
AssertionError: 2 != 1
Test report
===========
Failed tests:
- test_os
Failed subtests:
- test_timerfd_select - test.test_os.TimerfdTests.test_timerfd_select
Sincerely,
-The Buildbot
1
0
☠ Buildbot (Python): python/cpython - failed test (failure) (main)
by buildbot@python.org Sept. 12, 2025
by buildbot@python.org Sept. 12, 2025
Sept. 12, 2025
The Buildbot has detected a new failure on builder AMD64 CentOS9 NoGIL Refleaks 3.x while building python/cpython.
Full details are available at:
https://buildbot.python.org/#/builders/1610/builds/2057
Buildbot URL: https://buildbot.python.org/
Worker for this Build: itamaro-centos-aws
Build Reason: <unknown>
Blamelist: Peter Bierma <zintensitydev(a)gmail.com>
BUILD FAILED: failed test (failure)
Summary of the results of the build (if available):
===================================================
==
Captured traceback
==================
remote: Enumerating objects: 3, done.
remote: Counting objects: 50% (1/2)
remote: Counting objects: 100% (2/2)
remote: Counting objects: 100% (2/2), done.
remote: Total 3 (delta 1), reused 1 (delta 1), pack-reused 1 (from 1)
From https://github.com/python/cpython
* branch main -> FETCH_HEAD
Note: switching to 'f96f7c9f5b5db35e8a22f29b4e20f386cdde64f5'.
You are in 'detached HEAD' state. You can look around, make experimental
changes and commit them, and you can discard any commits you make in this
state without impacting any branches by switching back to a branch.
If you want to create a new branch to retain commits you create, you may
do so (now or later) by using -c with the switch command. Example:
git switch -c <new-branch-name>
Or undo this operation with:
git switch -
Turn off this advice by setting config variable advice.detachedHead to false
HEAD is now at f96f7c9f5b5 Revert "gh-116946: fully implement GC protocol for `_tkinter.Tk{app,tt}Object` (#138331)" (#138807)
Switched to and reset branch 'main'
configure: WARNING: no system libmpdec found; falling back to pure-Python version for the decimal module
make: *** [Makefile:2486: buildbottest] Error 2
Test report
===========
Failed tests:
- test_free_threading
Test leaking resources:
- test_free_threading: file descriptors
Sincerely,
-The Buildbot
1
0