Buildbot-status
Threads by month
- ----- 2026 -----
- October
- September
- August
- July
- June
- May
- April
- March
- February
- January
- ----- 2025 -----
- December
- November
- October
- September
- August
- July
- June
- May
- April
- March
- February
- January
- ----- 2024 -----
- December
- November
- October
- September
- August
- July
- June
- May
- April
- March
- February
- January
- ----- 2023 -----
- December
- November
- October
- September
- August
- July
- June
- May
- April
- March
- February
- January
- ----- 2022 -----
- December
- November
- October
- September
- August
- July
- June
- May
- April
- March
- February
- January
- ----- 2021 -----
- December
- November
- October
- September
- August
- July
- June
- May
- April
- March
- February
- January
- ----- 2020 -----
- December
- November
- October
- September
- August
- July
- June
- May
- April
- March
- February
- January
- ----- 2019 -----
- December
- November
- October
- September
- August
- July
- June
- May
- April
- March
- February
- January
- ----- 2018 -----
- December
- November
- October
- September
- August
- July
- June
- May
- April
- March
- February
- January
- ----- 2017 -----
- December
- November
- October
- September
- August
- July
- June
- May
September 2025
- 1 participants
- 90 discussions
☠ Buildbot (Python): python/cpython - failed test (failure) (3.14)
by buildbot@python.org Sept. 7, 2025
by buildbot@python.org Sept. 7, 2025
Sept. 7, 2025
The Buildbot has detected a new failure on builder AMD64 Windows Server 2022 NoGIL 3.14 while building python/cpython.
Full details are available at:
https://buildbot.python.org/#/builders/1717/builds/492
Buildbot URL: https://buildbot.python.org/
Worker for this Build: itamaro-win64-srv-22-aws
Build Reason: <unknown>
Blamelist: Bénédikt Tran <10796600+picnixz(a)users.noreply.github.com>, Miss Islington (bot) <31488909+miss-islington(a)users.noreply.github.com>
BUILD FAILED: failed test (failure)
Summary of the results of the build (if available):
===================================================
==
Captured traceback
==================
Traceback (most recent call last):
File "C:\Users\Administrator\buildarea\3.14.itamaro-win64-srv-22-aws.x64.nogil\build\Lib\test\test_launcher.py", line 445, in test_search_major_3
self.assertEqual("PythonCore", data["env.company"])
~~~~~~~~~~~~~~~~^^^^^^^^^^^^^^^^^^^^^^^^^^^^^^^^^^^
AssertionError: 'PythonCore' != 'PythonTestSuite'
- PythonCore
+ PythonTestSuite
Traceback (most recent call last):
File "C:\Users\Administrator\buildarea\3.14.itamaro-win64-srv-22-aws.x64.nogil\build\Lib\test\test_launcher.py", line 465, in test_search_major_2
self.assertEqual("PythonCore", data["env.company"])
~~~~~~~~~~~~~~~~^^^^^^^^^^^^^^^^^^^^^^^^^^^^^^^^^^^
AssertionError: 'PythonCore' != 'PythonTestSuite'
- PythonCore
+ PythonTestSuite
Test report
===========
Failed tests:
- test_launcher
Failed subtests:
- test_search_major_3 - test.test_launcher.TestLauncher.test_search_major_3
- test_search_major_2 - test.test_launcher.TestLauncher.test_search_major_2
Sincerely,
-The Buildbot
1
0
☠ Buildbot (Python): python/cpython - failed test (failure) uploading test-results.xml (failure) (3.13)
by buildbot@python.org Sept. 7, 2025
by buildbot@python.org Sept. 7, 2025
Sept. 7, 2025
The Buildbot has detected a new failure on builder ARM Raspbian Linux Asan 3.13 while building python/cpython.
Full details are available at:
https://buildbot.python.org/#/builders/1817/builds/75
Buildbot URL: https://buildbot.python.org/
Worker for this Build: pablogsal-rasp
Build Reason: <unknown>
Blamelist: Miss Islington (bot) <31488909+miss-islington(a)users.noreply.github.com>
BUILD FAILED: failed test (failure) uploading test-results.xml (failure)
Summary of the results of the build (if available):
===================================================
Captured traceback
==================
remote: Enumerating objects: 15, done.
remote: Counting objects: 11% (1/9)
remote: Counting objects: 22% (2/9)
remote: Counting objects: 33% (3/9)
remote: Counting objects: 44% (4/9)
remote: Counting objects: 55% (5/9)
remote: Counting objects: 66% (6/9)
remote: Counting objects: 77% (7/9)
remote: Counting objects: 88% (8/9)
remote: Counting objects: 100% (9/9)
remote: Counting objects: 100% (9/9), done.
remote: Compressing objects: 50% (1/2)
remote: Compressing objects: 100% (2/2)
remote: Compressing objects: 100% (2/2), done.
remote: Total 15 (delta 7), reused 7 (delta 7), pack-reused 6 (from 3)
From https://github.com/python/cpython
* branch 3.13 -> FETCH_HEAD
Note: switching to '612b535e6d7b7cf26d86d895aeb793ab2c28c9d4'.
You are in 'detached HEAD' state. You can look around, make experimental
changes and commit them, and you can discard any commits you make in this
state without impacting any branches by switching back to a branch.
If you want to create a new branch to retain commits you create, you may
do so (now or later) by using -c with the switch command. Example:
git switch -c <new-branch-name>
Or undo this operation with:
git switch -
Turn off this advice by setting config variable advice.detachedHead to false
HEAD is now at 612b535e6d7 [3.13] gh-118981: multiprocessing.popen_spawn_posix, fix potential hang (gh-118982) (#138606)
Switched to and reset branch '3.13'
configure: WARNING: no system libmpdec found; falling back to bundled libmpdec (deprecated and scheduled for removal in Python 3.16)
In function ‘hashtable_key_from_2_strings’,
inlined from ‘_extensions_cache_find_unlocked’ at Python/import.c:1264:17:
Python/import.c:1177:5: warning: ‘strncpy’ output truncated before terminating nul copying as many bytes from a string as its length [-Wstringop-truncation]
1177 | strncpy(key, str1_data, str1_len);
| ^~~~~~~~~~~~~~~~~~~~~~~~~~~~~~~~~
Python/import.c:1163:27: note: length computed here
1163 | Py_ssize_t str1_len = strlen(str1_data);
| ^~~~~~~~~~~~~~~~~
In function ‘word_to_string’,
inlined from ‘coeff_to_string’ at ./Modules/_decimal/libmpdec/io.c:411:13,
inlined from ‘_mpd_to_string’ at ./Modules/_decimal/libmpdec/io.c:612:18:
./Modules/_decimal/libmpdec/io.c:349:40: warning: writing 1 byte into a region of size 0 [-Wstringop-overflow=]
349 | if (s == dot) *s++ = '.'; *s++ = '0' + (char)(x / d); x %= d
| ~~~~~^~~~~~~~~~~~~~~~~~~~~
./Modules/_decimal/libmpdec/io.c:360:14: note: in expansion of macro ‘EXTRACT_DIGIT’
360 | case 15: EXTRACT_DIGIT(s, x, 100000000000000ULL, dot);
| ^~~~~~~~~~~~~
./Modules/_decimal/libmpdec/io.c:349:40: warning: writing 1 byte into a region of size 0 [-Wstringop-overflow=]
349 | if (s == dot) *s++ = '.'; *s++ = '0' + (char)(x / d); x %= d
| ~~~~~^~~~~~~~~~~~~~~~~~~~~
./Modules/_decimal/libmpdec/io.c:361:14: note: in expansion of macro ‘EXTRACT_DIGIT’
361 | case 14: EXTRACT_DIGIT(s, x, 10000000000000ULL, dot);
| ^~~~~~~~~~~~~
./Modules/_decimal/libmpdec/io.c:349:40: warning: writing 1 byte into a region of size 0 [-Wstringop-overflow=]
349 | if (s == dot) *s++ = '.'; *s++ = '0' + (char)(x / d); x %= d
| ~~~~~^~~~~~~~~~~~~~~~~~~~~
./Modules/_decimal/libmpdec/io.c:362:14: note: in expansion of macro ‘EXTRACT_DIGIT’
362 | case 13: EXTRACT_DIGIT(s, x, 1000000000000ULL, dot);
| ^~~~~~~~~~~~~
./Modules/_decimal/libmpdec/io.c:349:40: warning: writing 1 byte into a region of size 0 [-Wstringop-overflow=]
349 | if (s == dot) *s++ = '.'; *s++ = '0' + (char)(x / d); x %= d
| ~~~~~^~~~~~~~~~~~~~~~~~~~~
./Modules/_decimal/libmpdec/io.c:359:14: note: in expansion of macro ‘EXTRACT_DIGIT’
359 | case 16: EXTRACT_DIGIT(s, x, 1000000000000000ULL, dot);
| ^~~~~~~~~~~~~
./Modules/_decimal/libmpdec/io.c:349:40: warning: writing 1 byte into a region of size 0 [-Wstringop-overflow=]
349 | if (s == dot) *s++ = '.'; *s++ = '0' + (char)(x / d); x %= d
| ~~~~~^~~~~~~~~~~~~~~~~~~~~
./Modules/_decimal/libmpdec/io.c:360:14: note: in expansion of macro ‘EXTRACT_DIGIT’
360 | case 15: EXTRACT_DIGIT(s, x, 100000000000000ULL, dot);
| ^~~~~~~~~~~~~
./Modules/_decimal/libmpdec/io.c:349:40: warning: writing 1 byte into a region of size 0 [-Wstringop-overflow=]
349 | if (s == dot) *s++ = '.'; *s++ = '0' + (char)(x / d); x %= d
| ~~~~~^~~~~~~~~~~~~~~~~~~~~
./Modules/_decimal/libmpdec/io.c:361:14: note: in expansion of macro ‘EXTRACT_DIGIT’
361 | case 14: EXTRACT_DIGIT(s, x, 10000000000000ULL, dot);
| ^~~~~~~~~~~~~
./Modules/_decimal/libmpdec/io.c:349:40: warning: writing 1 byte into a region of size 0 [-Wstringop-overflow=]
349 | if (s == dot) *s++ = '.'; *s++ = '0' + (char)(x / d); x %= d
| ~~~~~^~~~~~~~~~~~~~~~~~~~~
./Modules/_decimal/libmpdec/io.c:358:14: note: in expansion of macro ‘EXTRACT_DIGIT’
358 | case 17: EXTRACT_DIGIT(s, x, 10000000000000000ULL, dot);
| ^~~~~~~~~~~~~
./Modules/_decimal/libmpdec/io.c:349:40: warning: writing 1 byte into a region of size 0 [-Wstringop-overflow=]
349 | if (s == dot) *s++ = '.'; *s++ = '0' + (char)(x / d); x %= d
| ~~~~~^~~~~~~~~~~~~~~~~~~~~
./Modules/_decimal/libmpdec/io.c:359:14: note: in expansion of macro ‘EXTRACT_DIGIT’
359 | case 16: EXTRACT_DIGIT(s, x, 1000000000000000ULL, dot);
| ^~~~~~~~~~~~~
./Modules/_decimal/libmpdec/io.c:349:40: warning: writing 1 byte into a region of size 0 [-Wstringop-overflow=]
349 | if (s == dot) *s++ = '.'; *s++ = '0' + (char)(x / d); x %= d
| ~~~~~^~~~~~~~~~~~~~~~~~~~~
./Modules/_decimal/libmpdec/io.c:360:14: note: in expansion of macro ‘EXTRACT_DIGIT’
360 | case 15: EXTRACT_DIGIT(s, x, 100000000000000ULL, dot);
| ^~~~~~~~~~~~~
./Modules/_decimal/libmpdec/io.c:349:40: warning: writing 1 byte into a region of size 0 [-Wstringop-overflow=]
349 | if (s == dot) *s++ = '.'; *s++ = '0' + (char)(x / d); x %= d
| ~~~~~^~~~~~~~~~~~~~~~~~~~~
./Modules/_decimal/libmpdec/io.c:357:14: note: in expansion of macro ‘EXTRACT_DIGIT’
357 | case 18: EXTRACT_DIGIT(s, x, 100000000000000000ULL, dot);
| ^~~~~~~~~~~~~
./Modules/_decimal/libmpdec/io.c:349:40: warning: writing 1 byte into a region of size 0 [-Wstringop-overflow=]
349 | if (s == dot) *s++ = '.'; *s++ = '0' + (char)(x / d); x %= d
| ~~~~~^~~~~~~~~~~~~~~~~~~~~
./Modules/_decimal/libmpdec/io.c:358:14: note: in expansion of macro ‘EXTRACT_DIGIT’
358 | case 17: EXTRACT_DIGIT(s, x, 10000000000000000ULL, dot);
| ^~~~~~~~~~~~~
./Modules/_decimal/libmpdec/io.c:349:40: warning: writing 1 byte into a region of size 0 [-Wstringop-overflow=]
349 | if (s == dot) *s++ = '.'; *s++ = '0' + (char)(x / d); x %= d
| ~~~~~^~~~~~~~~~~~~~~~~~~~~
./Modules/_decimal/libmpdec/io.c:359:14: note: in expansion of macro ‘EXTRACT_DIGIT’
359 | case 16: EXTRACT_DIGIT(s, x, 1000000000000000ULL, dot);
| ^~~~~~~~~~~~~
./Modules/_decimal/libmpdec/io.c:349:40: warning: writing 1 byte into a region of size 0 [-Wstringop-overflow=]
349 | if (s == dot) *s++ = '.'; *s++ = '0' + (char)(x / d); x %= d
| ~~~~~^~~~~~~~~~~~~~~~~~~~~
./Modules/_decimal/libmpdec/io.c:361:14: note: in expansion of macro ‘EXTRACT_DIGIT’
361 | case 14: EXTRACT_DIGIT(s, x, 10000000000000ULL, dot);
| ^~~~~~~~~~~~~
./Modules/_decimal/libmpdec/io.c:349:40: warning: writing 1 byte into a region of size 0 [-Wstringop-overflow=]
349 | if (s == dot) *s++ = '.'; *s++ = '0' + (char)(x / d); x %= d
| ~~~~~^~~~~~~~~~~~~~~~~~~~~
./Modules/_decimal/libmpdec/io.c:362:14: note: in expansion of macro ‘EXTRACT_DIGIT’
362 | case 13: EXTRACT_DIGIT(s, x, 1000000000000ULL, dot);
| ^~~~~~~~~~~~~
./Modules/_decimal/libmpdec/io.c:349:40: warning: writing 1 byte into a region of size 0 [-Wstringop-overflow=]
349 | if (s == dot) *s++ = '.'; *s++ = '0' + (char)(x / d); x %= d
| ~~~~~^~~~~~~~~~~~~~~~~~~~~
./Modules/_decimal/libmpdec/io.c:363:14: note: in expansion of macro ‘EXTRACT_DIGIT’
363 | case 12: EXTRACT_DIGIT(s, x, 100000000000ULL, dot);
| ^~~~~~~~~~~~~
./Modules/_decimal/libmpdec/io.c:349:40: warning: writing 1 byte into a region of size 0 [-Wstringop-overflow=]
349 | if (s == dot) *s++ = '.'; *s++ = '0' + (char)(x / d); x %= d
| ~~~~~^~~~~~~~~~~~~~~~~~~~~
./Modules/_decimal/libmpdec/io.c:362:14: note: in expansion of macro ‘EXTRACT_DIGIT’
362 | case 13: EXTRACT_DIGIT(s, x, 1000000000000ULL, dot);
| ^~~~~~~~~~~~~
./Modules/_decimal/libmpdec/io.c:349:40: warning: writing 1 byte into a region of size 0 [-Wstringop-overflow=]
349 | if (s == dot) *s++ = '.'; *s++ = '0' + (char)(x / d); x %= d
| ~~~~~^~~~~~~~~~~~~~~~~~~~~
./Modules/_decimal/libmpdec/io.c:363:14: note: in expansion of macro ‘EXTRACT_DIGIT’
363 | case 12: EXTRACT_DIGIT(s, x, 100000000000ULL, dot);
| ^~~~~~~~~~~~~
./Modules/_decimal/libmpdec/io.c:349:40: warning: writing 1 byte into a region of size 0 [-Wstringop-overflow=]
349 | if (s == dot) *s++ = '.'; *s++ = '0' + (char)(x / d); x %= d
| ~~~~~^~~~~~~~~~~~~~~~~~~~~
./Modules/_decimal/libmpdec/io.c:364:14: note: in expansion of macro ‘EXTRACT_DIGIT’
364 | case 11: EXTRACT_DIGIT(s, x, 10000000000ULL, dot);
| ^~~~~~~~~~~~~
./Modules/_decimal/libmpdec/io.c:349:40: warning: writing 1 byte into a region of size 0 [-Wstringop-overflow=]
349 | if (s == dot) *s++ = '.'; *s++ = '0' + (char)(x / d); x %= d
| ~~~~~^~~~~~~~~~~~~~~~~~~~~
./Modules/_decimal/libmpdec/io.c:363:14: note: in expansion of macro ‘EXTRACT_DIGIT’
363 | case 12: EXTRACT_DIGIT(s, x, 100000000000ULL, dot);
| ^~~~~~~~~~~~~
./Modules/_decimal/libmpdec/io.c:349:40: warning: writing 1 byte into a region of size 0 [-Wstringop-overflow=]
349 | if (s == dot) *s++ = '.'; *s++ = '0' + (char)(x / d); x %= d
| ~~~~~^~~~~~~~~~~~~~~~~~~~~
./Modules/_decimal/libmpdec/io.c:364:14: note: in expansion of macro ‘EXTRACT_DIGIT’
364 | case 11: EXTRACT_DIGIT(s, x, 10000000000ULL, dot);
| ^~~~~~~~~~~~~
./Modules/_decimal/libmpdec/io.c:349:40: warning: writing 1 byte into a region of size 0 [-Wstringop-overflow=]
349 | if (s == dot) *s++ = '.'; *s++ = '0' + (char)(x / d); x %= d
| ~~~~~^~~~~~~~~~~~~~~~~~~~~
./Modules/_decimal/libmpdec/io.c:366:14: note: in expansion of macro ‘EXTRACT_DIGIT’
366 | case 10: EXTRACT_DIGIT(s, x, 1000000000UL, dot);
| ^~~~~~~~~~~~~
./Modules/_decimal/libmpdec/io.c:349:40: warning: writing 1 byte into a region of size 0 [-Wstringop-overflow=]
349 | if (s == dot) *s++ = '.'; *s++ = '0' + (char)(x / d); x %= d
| ~~~~~^~~~~~~~~~~~~~~~~~~~~
./Modules/_decimal/libmpdec/io.c:364:14: note: in expansion of macro ‘EXTRACT_DIGIT’
364 | case 11: EXTRACT_DIGIT(s, x, 10000000000ULL, dot);
| ^~~~~~~~~~~~~
./Modules/_decimal/libmpdec/io.c:349:40: warning: writing 1 byte into a region of size 0 [-Wstringop-overflow=]
349 | if (s == dot) *s++ = '.'; *s++ = '0' + (char)(x / d); x %= d
| ~~~~~^~~~~~~~~~~~~~~~~~~~~
./Modules/_decimal/libmpdec/io.c:366:14: note: in expansion of macro ‘EXTRACT_DIGIT’
366 | case 10: EXTRACT_DIGIT(s, x, 1000000000UL, dot);
| ^~~~~~~~~~~~~
./Modules/_decimal/libmpdec/io.c:349:40: warning: writing 1 byte into a region of size 0 [-Wstringop-overflow=]
349 | if (s == dot) *s++ = '.'; *s++ = '0' + (char)(x / d); x %= d
| ~~~~~^~~~~~~~~~~~~~~~~~~~~
./Modules/_decimal/libmpdec/io.c:367:14: note: in expansion of macro ‘EXTRACT_DIGIT’
367 | case 9: EXTRACT_DIGIT(s, x, 100000000UL, dot);
| ^~~~~~~~~~~~~
./Modules/_decimal/libmpdec/io.c:349:40: warning: writing 1 byte into a region of size 0 [-Wstringop-overflow=]
349 | if (s == dot) *s++ = '.'; *s++ = '0' + (char)(x / d); x %= d
| ~~~~~^~~~~~~~~~~~~~~~~~~~~
./Modules/_decimal/libmpdec/io.c:366:14: note: in expansion of macro ‘EXTRACT_DIGIT’
366 | case 10: EXTRACT_DIGIT(s, x, 1000000000UL, dot);
| ^~~~~~~~~~~~~
./Modules/_decimal/libmpdec/io.c:349:40: warning: writing 1 byte into a region of size 0 [-Wstringop-overflow=]
349 | if (s == dot) *s++ = '.'; *s++ = '0' + (char)(x / d); x %= d
| ~~~~~^~~~~~~~~~~~~~~~~~~~~
./Modules/_decimal/libmpdec/io.c:367:14: note: in expansion of macro ‘EXTRACT_DIGIT’
367 | case 9: EXTRACT_DIGIT(s, x, 100000000UL, dot);
| ^~~~~~~~~~~~~
./Modules/_decimal/libmpdec/io.c:349:40: warning: writing 1 byte into a region of size 0 [-Wstringop-overflow=]
349 | if (s == dot) *s++ = '.'; *s++ = '0' + (char)(x / d); x %= d
| ~~~~~^~~~~~~~~~~~~~~~~~~~~
./Modules/_decimal/libmpdec/io.c:368:14: note: in expansion of macro ‘EXTRACT_DIGIT’
368 | case 8: EXTRACT_DIGIT(s, x, 10000000UL, dot);
| ^~~~~~~~~~~~~
./Modules/_decimal/libmpdec/io.c:349:40: warning: writing 1 byte into a region of size 0 [-Wstringop-overflow=]
349 | if (s == dot) *s++ = '.'; *s++ = '0' + (char)(x / d); x %= d
| ~~~~~^~~~~~~~~~~~~~~~~~~~~
./Modules/_decimal/libmpdec/io.c:367:14: note: in expansion of macro ‘EXTRACT_DIGIT’
367 | case 9: EXTRACT_DIGIT(s, x, 100000000UL, dot);
| ^~~~~~~~~~~~~
./Modules/_decimal/libmpdec/io.c:349:40: warning: writing 1 byte into a region of size 0 [-Wstringop-overflow=]
349 | if (s == dot) *s++ = '.'; *s++ = '0' + (char)(x / d); x %= d
| ~~~~~^~~~~~~~~~~~~~~~~~~~~
./Modules/_decimal/libmpdec/io.c:368:14: note: in expansion of macro ‘EXTRACT_DIGIT’
368 | case 8: EXTRACT_DIGIT(s, x, 10000000UL, dot);
| ^~~~~~~~~~~~~
./Modules/_decimal/libmpdec/io.c:349:40: warning: writing 1 byte into a region of size 0 [-Wstringop-overflow=]
349 | if (s == dot) *s++ = '.'; *s++ = '0' + (char)(x / d); x %= d
| ~~~~~^~~~~~~~~~~~~~~~~~~~~
./Modules/_decimal/libmpdec/io.c:369:14: note: in expansion of macro ‘EXTRACT_DIGIT’
369 | case 7: EXTRACT_DIGIT(s, x, 1000000UL, dot);
| ^~~~~~~~~~~~~
./Modules/_decimal/libmpdec/io.c:349:40: warning: writing 1 byte into a region of size 0 [-Wstringop-overflow=]
349 | if (s == dot) *s++ = '.'; *s++ = '0' + (char)(x / d); x %= d
| ~~~~~^~~~~~~~~~~~~~~~~~~~~
./Modules/_decimal/libmpdec/io.c:368:14: note: in expansion of macro ‘EXTRACT_DIGIT’
368 | case 8: EXTRACT_DIGIT(s, x, 10000000UL, dot);
| ^~~~~~~~~~~~~
./Modules/_decimal/libmpdec/io.c:349:40: warning: writing 1 byte into a region of size 0 [-Wstringop-overflow=]
349 | if (s == dot) *s++ = '.'; *s++ = '0' + (char)(x / d); x %= d
| ~~~~~^~~~~~~~~~~~~~~~~~~~~
./Modules/_decimal/libmpdec/io.c:369:14: note: in expansion of macro ‘EXTRACT_DIGIT’
369 | case 7: EXTRACT_DIGIT(s, x, 1000000UL, dot);
| ^~~~~~~~~~~~~
./Modules/_decimal/libmpdec/io.c:349:40: warning: writing 1 byte into a region of size 0 [-Wstringop-overflow=]
349 | if (s == dot) *s++ = '.'; *s++ = '0' + (char)(x / d); x %= d
| ~~~~~^~~~~~~~~~~~~~~~~~~~~
./Modules/_decimal/libmpdec/io.c:370:14: note: in expansion of macro ‘EXTRACT_DIGIT’
370 | case 6: EXTRACT_DIGIT(s, x, 100000UL, dot);
| ^~~~~~~~~~~~~
./Modules/_decimal/libmpdec/io.c:349:40: warning: writing 1 byte into a region of size 0 [-Wstringop-overflow=]
349 | if (s == dot) *s++ = '.'; *s++ = '0' + (char)(x / d); x %= d
| ~~~~~^~~~~~~~~~~~~~~~~~~~~
./Modules/_decimal/libmpdec/io.c:369:14: note: in expansion of macro ‘EXTRACT_DIGIT’
369 | case 7: EXTRACT_DIGIT(s, x, 1000000UL, dot);
| ^~~~~~~~~~~~~
./Modules/_decimal/libmpdec/io.c:349:40: warning: writing 1 byte into a region of size 0 [-Wstringop-overflow=]
349 | if (s == dot) *s++ = '.'; *s++ = '0' + (char)(x / d); x %= d
| ~~~~~^~~~~~~~~~~~~~~~~~~~~
./Modules/_decimal/libmpdec/io.c:370:14: note: in expansion of macro ‘EXTRACT_DIGIT’
370 | case 6: EXTRACT_DIGIT(s, x, 100000UL, dot);
| ^~~~~~~~~~~~~
./Modules/_decimal/libmpdec/io.c:349:40: warning: writing 1 byte into a region of size 0 [-Wstringop-overflow=]
349 | if (s == dot) *s++ = '.'; *s++ = '0' + (char)(x / d); x %= d
| ~~~~~^~~~~~~~~~~~~~~~~~~~~
./Modules/_decimal/libmpdec/io.c:371:14: note: in expansion of macro ‘EXTRACT_DIGIT’
371 | case 5: EXTRACT_DIGIT(s, x, 10000UL, dot);
| ^~~~~~~~~~~~~
./Modules/_decimal/libmpdec/io.c:349:40: warning: writing 1 byte into a region of size 0 [-Wstringop-overflow=]
349 | if (s == dot) *s++ = '.'; *s++ = '0' + (char)(x / d); x %= d
| ~~~~~^~~~~~~~~~~~~~~~~~~~~
./Modules/_decimal/libmpdec/io.c:370:14: note: in expansion of macro ‘EXTRACT_DIGIT’
370 | case 6: EXTRACT_DIGIT(s, x, 100000UL, dot);
| ^~~~~~~~~~~~~
./Modules/_decimal/libmpdec/io.c:349:40: warning: writing 1 byte into a region of size 0 [-Wstringop-overflow=]
349 | if (s == dot) *s++ = '.'; *s++ = '0' + (char)(x / d); x %= d
| ~~~~~^~~~~~~~~~~~~~~~~~~~~
./Modules/_decimal/libmpdec/io.c:371:14: note: in expansion of macro ‘EXTRACT_DIGIT’
371 | case 5: EXTRACT_DIGIT(s, x, 10000UL, dot);
| ^~~~~~~~~~~~~
./Modules/_decimal/libmpdec/io.c:349:40: warning: writing 1 byte into a region of size 0 [-Wstringop-overflow=]
349 | if (s == dot) *s++ = '.'; *s++ = '0' + (char)(x / d); x %= d
| ~~~~~^~~~~~~~~~~~~~~~~~~~~
./Modules/_decimal/libmpdec/io.c:372:14: note: in expansion of macro ‘EXTRACT_DIGIT’
372 | case 4: EXTRACT_DIGIT(s, x, 1000UL, dot);
| ^~~~~~~~~~~~~
./Modules/_decimal/libmpdec/io.c:349:40: warning: writing 1 byte into a region of size 0 [-Wstringop-overflow=]
349 | if (s == dot) *s++ = '.'; *s++ = '0' + (char)(x / d); x %= d
| ~~~~~^~~~~~~~~~~~~~~~~~~~~
./Modules/_decimal/libmpdec/io.c:371:14: note: in expansion of macro ‘EXTRACT_DIGIT’
371 | case 5: EXTRACT_DIGIT(s, x, 10000UL, dot);
| ^~~~~~~~~~~~~
./Modules/_decimal/libmpdec/io.c:349:40: warning: writing 1 byte into a region of size 0 [-Wstringop-overflow=]
349 | if (s == dot) *s++ = '.'; *s++ = '0' + (char)(x / d); x %= d
| ~~~~~^~~~~~~~~~~~~~~~~~~~~
./Modules/_decimal/libmpdec/io.c:372:14: note: in expansion of macro ‘EXTRACT_DIGIT’
372 | case 4: EXTRACT_DIGIT(s, x, 1000UL, dot);
| ^~~~~~~~~~~~~
./Modules/_decimal/libmpdec/io.c:349:40: warning: writing 1 byte into a region of size 0 [-Wstringop-overflow=]
349 | if (s == dot) *s++ = '.'; *s++ = '0' + (char)(x / d); x %= d
| ~~~~~^~~~~~~~~~~~~~~~~~~~~
./Modules/_decimal/libmpdec/io.c:373:14: note: in expansion of macro ‘EXTRACT_DIGIT’
373 | case 3: EXTRACT_DIGIT(s, x, 100UL, dot);
| ^~~~~~~~~~~~~
./Modules/_decimal/libmpdec/io.c:349:40: warning: writing 1 byte into a region of size 0 [-Wstringop-overflow=]
349 | if (s == dot) *s++ = '.'; *s++ = '0' + (char)(x / d); x %= d
| ~~~~~^~~~~~~~~~~~~~~~~~~~~
./Modules/_decimal/libmpdec/io.c:372:14: note: in expansion of macro ‘EXTRACT_DIGIT’
372 | case 4: EXTRACT_DIGIT(s, x, 1000UL, dot);
| ^~~~~~~~~~~~~
./Modules/_decimal/libmpdec/io.c:349:40: warning: writing 1 byte into a region of size 0 [-Wstringop-overflow=]
349 | if (s == dot) *s++ = '.'; *s++ = '0' + (char)(x / d); x %= d
| ~~~~~^~~~~~~~~~~~~~~~~~~~~
./Modules/_decimal/libmpdec/io.c:373:14: note: in expansion of macro ‘EXTRACT_DIGIT’
373 | case 3: EXTRACT_DIGIT(s, x, 100UL, dot);
| ^~~~~~~~~~~~~
./Modules/_decimal/libmpdec/io.c:349:40: warning: writing 1 byte into a region of size 0 [-Wstringop-overflow=]
349 | if (s == dot) *s++ = '.'; *s++ = '0' + (char)(x / d); x %= d
| ~~~~~^~~~~~~~~~~~~~~~~~~~~
./Modules/_decimal/libmpdec/io.c:374:14: note: in expansion of macro ‘EXTRACT_DIGIT’
374 | case 2: EXTRACT_DIGIT(s, x, 10UL, dot);
| ^~~~~~~~~~~~~
./Modules/_decimal/libmpdec/io.c:349:40: warning: writing 1 byte into a region of size 0 [-Wstringop-overflow=]
349 | if (s == dot) *s++ = '.'; *s++ = '0' + (char)(x / d); x %= d
| ~~~~~^~~~~~~~~~~~~~~~~~~~~
./Modules/_decimal/libmpdec/io.c:373:14: note: in expansion of macro ‘EXTRACT_DIGIT’
373 | case 3: EXTRACT_DIGIT(s, x, 100UL, dot);
| ^~~~~~~~~~~~~
./Modules/_decimal/libmpdec/io.c:349:40: warning: writing 1 byte into a region of size 0 [-Wstringop-overflow=]
349 | if (s == dot) *s++ = '.'; *s++ = '0' + (char)(x / d); x %= d
| ~~~~~^~~~~~~~~~~~~~~~~~~~~
./Modules/_decimal/libmpdec/io.c:374:14: note: in expansion of macro ‘EXTRACT_DIGIT’
374 | case 2: EXTRACT_DIGIT(s, x, 10UL, dot);
| ^~~~~~~~~~~~~
./Modules/_decimal/libmpdec/io.c:349:40: warning: writing 1 byte into a region of size 0 [-Wstringop-overflow=]
349 | if (s == dot) *s++ = '.'; *s++ = '0' + (char)(x / d); x %= d
| ~~~~~^~~~~~~~~~~~~~~~~~~~~
./Modules/_decimal/libmpdec/io.c:374:14: note: in expansion of macro ‘EXTRACT_DIGIT’
374 | case 2: EXTRACT_DIGIT(s, x, 10UL, dot);
| ^~~~~~~~~~~~~
In function ‘word_to_string’,
inlined from ‘coeff_to_string’ at ./Modules/_decimal/libmpdec/io.c:411:13,
inlined from ‘_mpd_to_string’ at ./Modules/_decimal/libmpdec/io.c:608:18:
./Modules/_decimal/libmpdec/io.c:349:40: warning: writing 1 byte into a region of size 0 [-Wstringop-overflow=]
349 | if (s == dot) *s++ = '.'; *s++ = '0' + (char)(x / d); x %= d
| ~~~~~^~~~~~~~~~~~~~~~~~~~~
./Modules/_decimal/libmpdec/io.c:360:14: note: in expansion of macro ‘EXTRACT_DIGIT’
360 | case 15: EXTRACT_DIGIT(s, x, 100000000000000ULL, dot);
| ^~~~~~~~~~~~~
./Modules/_decimal/libmpdec/io.c:349:40: warning: writing 1 byte into a region of size 0 [-Wstringop-overflow=]
349 | if (s == dot) *s++ = '.'; *s++ = '0' + (char)(x / d); x %= d
| ~~~~~^~~~~~~~~~~~~~~~~~~~~
./Modules/_decimal/libmpdec/io.c:361:14: note: in expansion of macro ‘EXTRACT_DIGIT’
361 | case 14: EXTRACT_DIGIT(s, x, 10000000000000ULL, dot);
| ^~~~~~~~~~~~~
./Modules/_decimal/libmpdec/io.c:349:40: warning: writing 1 byte into a region of size 0 [-Wstringop-overflow=]
349 | if (s == dot) *s++ = '.'; *s++ = '0' + (char)(x / d); x %= d
| ~~~~~^~~~~~~~~~~~~~~~~~~~~
./Modules/_decimal/libmpdec/io.c:362:14: note: in expansion of macro ‘EXTRACT_DIGIT’
362 | case 13: EXTRACT_DIGIT(s, x, 1000000000000ULL, dot);
| ^~~~~~~~~~~~~
./Modules/_decimal/libmpdec/io.c:349:40: warning: writing 1 byte into a region of size 0 [-Wstringop-overflow=]
349 | if (s == dot) *s++ = '.'; *s++ = '0' + (char)(x / d); x %= d
| ~~~~~^~~~~~~~~~~~~~~~~~~~~
./Modules/_decimal/libmpdec/io.c:359:14: note: in expansion of macro ‘EXTRACT_DIGIT’
359 | case 16: EXTRACT_DIGIT(s, x, 1000000000000000ULL, dot);
| ^~~~~~~~~~~~~
./Modules/_decimal/libmpdec/io.c:349:40: warning: writing 1 byte into a region of size 0 [-Wstringop-overflow=]
349 | if (s == dot) *s++ = '.'; *s++ = '0' + (char)(x / d); x %= d
| ~~~~~^~~~~~~~~~~~~~~~~~~~~
./Modules/_decimal/libmpdec/io.c:360:14: note: in expansion of macro ‘EXTRACT_DIGIT’
360 | case 15: EXTRACT_DIGIT(s, x, 100000000000000ULL, dot);
| ^~~~~~~~~~~~~
./Modules/_decimal/libmpdec/io.c:349:40: warning: writing 1 byte into a region of size 0 [-Wstringop-overflow=]
349 | if (s == dot) *s++ = '.'; *s++ = '0' + (char)(x / d); x %= d
| ~~~~~^~~~~~~~~~~~~~~~~~~~~
./Modules/_decimal/libmpdec/io.c:361:14: note: in expansion of macro ‘EXTRACT_DIGIT’
361 | case 14: EXTRACT_DIGIT(s, x, 10000000000000ULL, dot);
| ^~~~~~~~~~~~~
./Modules/_decimal/libmpdec/io.c:349:40: warning: writing 1 byte into a region of size 0 [-Wstringop-overflow=]
349 | if (s == dot) *s++ = '.'; *s++ = '0' + (char)(x / d); x %= d
| ~~~~~^~~~~~~~~~~~~~~~~~~~~
./Modules/_decimal/libmpdec/io.c:358:14: note: in expansion of macro ‘EXTRACT_DIGIT’
358 | case 17: EXTRACT_DIGIT(s, x, 10000000000000000ULL, dot);
| ^~~~~~~~~~~~~
./Modules/_decimal/libmpdec/io.c:349:40: warning: writing 1 byte into a region of size 0 [-Wstringop-overflow=]
349 | if (s == dot) *s++ = '.'; *s++ = '0' + (char)(x / d); x %= d
| ~~~~~^~~~~~~~~~~~~~~~~~~~~
./Modules/_decimal/libmpdec/io.c:359:14: note: in expansion of macro ‘EXTRACT_DIGIT’
359 | case 16: EXTRACT_DIGIT(s, x, 1000000000000000ULL, dot);
| ^~~~~~~~~~~~~
./Modules/_decimal/libmpdec/io.c:349:40: warning: writing 1 byte into a region of size 0 [-Wstringop-overflow=]
349 | if (s == dot) *s++ = '.'; *s++ = '0' + (char)(x / d); x %= d
| ~~~~~^~~~~~~~~~~~~~~~~~~~~
./Modules/_decimal/libmpdec/io.c:360:14: note: in expansion of macro ‘EXTRACT_DIGIT’
360 | case 15: EXTRACT_DIGIT(s, x, 100000000000000ULL, dot);
| ^~~~~~~~~~~~~
./Modules/_decimal/libmpdec/io.c:349:40: warning: writing 1 byte into a region of size 0 [-Wstringop-overflow=]
349 | if (s == dot) *s++ = '.'; *s++ = '0' + (char)(x / d); x %= d
| ~~~~~^~~~~~~~~~~~~~~~~~~~~
./Modules/_decimal/libmpdec/io.c:357:14: note: in expansion of macro ‘EXTRACT_DIGIT’
357 | case 18: EXTRACT_DIGIT(s, x, 100000000000000000ULL, dot);
| ^~~~~~~~~~~~~
./Modules/_decimal/libmpdec/io.c:349:40: warning: writing 1 byte into a region of size 0 [-Wstringop-overflow=]
349 | if (s == dot) *s++ = '.'; *s++ = '0' + (char)(x / d); x %= d
| ~~~~~^~~~~~~~~~~~~~~~~~~~~
./Modules/_decimal/libmpdec/io.c:358:14: note: in expansion of macro ‘EXTRACT_DIGIT’
358 | case 17: EXTRACT_DIGIT(s, x, 10000000000000000ULL, dot);
| ^~~~~~~~~~~~~
./Modules/_decimal/libmpdec/io.c:349:40: warning: writing 1 byte into a region of size 0 [-Wstringop-overflow=]
349 | if (s == dot) *s++ = '.'; *s++ = '0' + (char)(x / d); x %= d
| ~~~~~^~~~~~~~~~~~~~~~~~~~~
./Modules/_decimal/libmpdec/io.c:359:14: note: in expansion of macro ‘EXTRACT_DIGIT’
359 | case 16: EXTRACT_DIGIT(s, x, 1000000000000000ULL, dot);
| ^~~~~~~~~~~~~
./Modules/_decimal/libmpdec/io.c:349:40: warning: writing 1 byte into a region of size 0 [-Wstringop-overflow=]
349 | if (s == dot) *s++ = '.'; *s++ = '0' + (char)(x / d); x %= d
| ~~~~~^~~~~~~~~~~~~~~~~~~~~
./Modules/_decimal/libmpdec/io.c:361:14: note: in expansion of macro ‘EXTRACT_DIGIT’
361 | case 14: EXTRACT_DIGIT(s, x, 10000000000000ULL, dot);
| ^~~~~~~~~~~~~
./Modules/_decimal/libmpdec/io.c:349:40: warning: writing 1 byte into a region of size 0 [-Wstringop-overflow=]
349 | if (s == dot) *s++ = '.'; *s++ = '0' + (char)(x / d); x %= d
| ~~~~~^~~~~~~~~~~~~~~~~~~~~
./Modules/_decimal/libmpdec/io.c:362:14: note: in expansion of macro ‘EXTRACT_DIGIT’
362 | case 13: EXTRACT_DIGIT(s, x, 1000000000000ULL, dot);
| ^~~~~~~~~~~~~
./Modules/_decimal/libmpdec/io.c:349:40: warning: writing 1 byte into a region of size 0 [-Wstringop-overflow=]
349 | if (s == dot) *s++ = '.'; *s++ = '0' + (char)(x / d); x %= d
| ~~~~~^~~~~~~~~~~~~~~~~~~~~
./Modules/_decimal/libmpdec/io.c:363:14: note: in expansion of macro ‘EXTRACT_DIGIT’
363 | case 12: EXTRACT_DIGIT(s, x, 100000000000ULL, dot);
| ^~~~~~~~~~~~~
./Modules/_decimal/libmpdec/io.c:349:40: warning: writing 1 byte into a region of size 0 [-Wstringop-overflow=]
349 | if (s == dot) *s++ = '.'; *s++ = '0' + (char)(x / d); x %= d
| ~~~~~^~~~~~~~~~~~~~~~~~~~~
./Modules/_decimal/libmpdec/io.c:362:14: note: in expansion of macro ‘EXTRACT_DIGIT’
362 | case 13: EXTRACT_DIGIT(s, x, 1000000000000ULL, dot);
| ^~~~~~~~~~~~~
./Modules/_decimal/libmpdec/io.c:349:40: warning: writing 1 byte into a region of size 0 [-Wstringop-overflow=]
349 | if (s == dot) *s++ = '.'; *s++ = '0' + (char)(x / d); x %= d
| ~~~~~^~~~~~~~~~~~~~~~~~~~~
./Modules/_decimal/libmpdec/io.c:363:14: note: in expansion of macro ‘EXTRACT_DIGIT’
363 | case 12: EXTRACT_DIGIT(s, x, 100000000000ULL, dot);
| ^~~~~~~~~~~~~
./Modules/_decimal/libmpdec/io.c:349:40: warning: writing 1 byte into a region of size 0 [-Wstringop-overflow=]
349 | if (s == dot) *s++ = '.'; *s++ = '0' + (char)(x / d); x %= d
| ~~~~~^~~~~~~~~~~~~~~~~~~~~
./Modules/_decimal/libmpdec/io.c:364:14: note: in expansion of macro ‘EXTRACT_DIGIT’
364 | case 11: EXTRACT_DIGIT(s, x, 10000000000ULL, dot);
| ^~~~~~~~~~~~~
./Modules/_decimal/libmpdec/io.c:349:40: warning: writing 1 byte into a region of size 0 [-Wstringop-overflow=]
349 | if (s == dot) *s++ = '.'; *s++ = '0' + (char)(x / d); x %= d
| ~~~~~^~~~~~~~~~~~~~~~~~~~~
./Modules/_decimal/libmpdec/io.c:363:14: note: in expansion of macro ‘EXTRACT_DIGIT’
363 | case 12: EXTRACT_DIGIT(s, x, 100000000000ULL, dot);
| ^~~~~~~~~~~~~
./Modules/_decimal/libmpdec/io.c:349:40: warning: writing 1 byte into a region of size 0 [-Wstringop-overflow=]
349 | if (s == dot) *s++ = '.'; *s++ = '0' + (char)(x / d); x %= d
| ~~~~~^~~~~~~~~~~~~~~~~~~~~
./Modules/_decimal/libmpdec/io.c:364:14: note: in expansion of macro ‘EXTRACT_DIGIT’
364 | case 11: EXTRACT_DIGIT(s, x, 10000000000ULL, dot);
| ^~~~~~~~~~~~~
./Modules/_decimal/libmpdec/io.c:349:40: warning: writing 1 byte into a region of size 0 [-Wstringop-overflow=]
349 | if (s == dot) *s++ = '.'; *s++ = '0' + (char)(x / d); x %= d
| ~~~~~^~~~~~~~~~~~~~~~~~~~~
./Modules/_decimal/libmpdec/io.c:366:14: note: in expansion of macro ‘EXTRACT_DIGIT’
366 | case 10: EXTRACT_DIGIT(s, x, 1000000000UL, dot);
| ^~~~~~~~~~~~~
./Modules/_decimal/libmpdec/io.c:349:40: warning: writing 1 byte into a region of size 0 [-Wstringop-overflow=]
349 | if (s == dot) *s++ = '.'; *s++ = '0' + (char)(x / d); x %= d
| ~~~~~^~~~~~~~~~~~~~~~~~~~~
./Modules/_decimal/libmpdec/io.c:364:14: note: in expansion of macro ‘EXTRACT_DIGIT’
364 | case 11: EXTRACT_DIGIT(s, x, 10000000000ULL, dot);
| ^~~~~~~~~~~~~
./Modules/_decimal/libmpdec/io.c:349:40: warning: writing 1 byte into a region of size 0 [-Wstringop-overflow=]
349 | if (s == dot) *s++ = '.'; *s++ = '0' + (char)(x / d); x %= d
| ~~~~~^~~~~~~~~~~~~~~~~~~~~
./Modules/_decimal/libmpdec/io.c:366:14: note: in expansion of macro ‘EXTRACT_DIGIT’
366 | case 10: EXTRACT_DIGIT(s, x, 1000000000UL, dot);
| ^~~~~~~~~~~~~
./Modules/_decimal/libmpdec/io.c:349:40: warning: writing 1 byte into a region of size 0 [-Wstringop-overflow=]
349 | if (s == dot) *s++ = '.'; *s++ = '0' + (char)(x / d); x %= d
| ~~~~~^~~~~~~~~~~~~~~~~~~~~
./Modules/_decimal/libmpdec/io.c:367:14: note: in expansion of macro ‘EXTRACT_DIGIT’
367 | case 9: EXTRACT_DIGIT(s, x, 100000000UL, dot);
| ^~~~~~~~~~~~~
./Modules/_decimal/libmpdec/io.c:349:40: warning: writing 1 byte into a region of size 0 [-Wstringop-overflow=]
349 | if (s == dot) *s++ = '.'; *s++ = '0' + (char)(x / d); x %= d
| ~~~~~^~~~~~~~~~~~~~~~~~~~~
./Modules/_decimal/libmpdec/io.c:366:14: note: in expansion of macro ‘EXTRACT_DIGIT’
366 | case 10: EXTRACT_DIGIT(s, x, 1000000000UL, dot);
| ^~~~~~~~~~~~~
./Modules/_decimal/libmpdec/io.c:349:40: warning: writing 1 byte into a region of size 0 [-Wstringop-overflow=]
349 | if (s == dot) *s++ = '.'; *s++ = '0' + (char)(x / d); x %= d
| ~~~~~^~~~~~~~~~~~~~~~~~~~~
./Modules/_decimal/libmpdec/io.c:367:14: note: in expansion of macro ‘EXTRACT_DIGIT’
367 | case 9: EXTRACT_DIGIT(s, x, 100000000UL, dot);
| ^~~~~~~~~~~~~
./Modules/_decimal/libmpdec/io.c:349:40: warning: writing 1 byte into a region of size 0 [-Wstringop-overflow=]
349 | if (s == dot) *s++ = '.'; *s++ = '0' + (char)(x / d); x %= d
| ~~~~~^~~~~~~~~~~~~~~~~~~~~
./Modules/_decimal/libmpdec/io.c:368:14: note: in expansion of macro ‘EXTRACT_DIGIT’
368 | case 8: EXTRACT_DIGIT(s, x, 10000000UL, dot);
| ^~~~~~~~~~~~~
./Modules/_decimal/libmpdec/io.c:349:40: warning: writing 1 byte into a region of size 0 [-Wstringop-overflow=]
349 | if (s == dot) *s++ = '.'; *s++ = '0' + (char)(x / d); x %= d
| ~~~~~^~~~~~~~~~~~~~~~~~~~~
./Modules/_decimal/libmpdec/io.c:367:14: note: in expansion of macro ‘EXTRACT_DIGIT’
367 | case 9: EXTRACT_DIGIT(s, x, 100000000UL, dot);
| ^~~~~~~~~~~~~
./Modules/_decimal/libmpdec/io.c:349:40: warning: writing 1 byte into a region of size 0 [-Wstringop-overflow=]
349 | if (s == dot) *s++ = '.'; *s++ = '0' + (char)(x / d); x %= d
| ~~~~~^~~~~~~~~~~~~~~~~~~~~
./Modules/_decimal/libmpdec/io.c:368:14: note: in expansion of macro ‘EXTRACT_DIGIT’
368 | case 8: EXTRACT_DIGIT(s, x, 10000000UL, dot);
| ^~~~~~~~~~~~~
./Modules/_decimal/libmpdec/io.c:349:40: warning: writing 1 byte into a region of size 0 [-Wstringop-overflow=]
349 | if (s == dot) *s++ = '.'; *s++ = '0' + (char)(x / d); x %= d
| ~~~~~^~~~~~~~~~~~~~~~~~~~~
./Modules/_decimal/libmpdec/io.c:369:14: note: in expansion of macro ‘EXTRACT_DIGIT’
369 | case 7: EXTRACT_DIGIT(s, x, 1000000UL, dot);
| ^~~~~~~~~~~~~
./Modules/_decimal/libmpdec/io.c:349:40: warning: writing 1 byte into a region of size 0 [-Wstringop-overflow=]
349 | if (s == dot) *s++ = '.'; *s++ = '0' + (char)(x / d); x %= d
| ~~~~~^~~~~~~~~~~~~~~~~~~~~
./Modules/_decimal/libmpdec/io.c:368:14: note: in expansion of macro ‘EXTRACT_DIGIT’
368 | case 8: EXTRACT_DIGIT(s, x, 10000000UL, dot);
| ^~~~~~~~~~~~~
./Modules/_decimal/libmpdec/io.c:349:40: warning: writing 1 byte into a region of size 0 [-Wstringop-overflow=]
349 | if (s == dot) *s++ = '.'; *s++ = '0' + (char)(x / d); x %= d
| ~~~~~^~~~~~~~~~~~~~~~~~~~~
./Modules/_decimal/libmpdec/io.c:369:14: note: in expansion of macro ‘EXTRACT_DIGIT’
369 | case 7: EXTRACT_DIGIT(s, x, 1000000UL, dot);
| ^~~~~~~~~~~~~
./Modules/_decimal/libmpdec/io.c:349:40: warning: writing 1 byte into a region of size 0 [-Wstringop-overflow=]
349 | if (s == dot) *s++ = '.'; *s++ = '0' + (char)(x / d); x %= d
| ~~~~~^~~~~~~~~~~~~~~~~~~~~
./Modules/_decimal/libmpdec/io.c:370:14: note: in expansion of macro ‘EXTRACT_DIGIT’
370 | case 6: EXTRACT_DIGIT(s, x, 100000UL, dot);
| ^~~~~~~~~~~~~
./Modules/_decimal/libmpdec/io.c:349:40: warning: writing 1 byte into a region of size 0 [-Wstringop-overflow=]
349 | if (s == dot) *s++ = '.'; *s++ = '0' + (char)(x / d); x %= d
| ~~~~~^~~~~~~~~~~~~~~~~~~~~
./Modules/_decimal/libmpdec/io.c:369:14: note: in expansion of macro ‘EXTRACT_DIGIT’
369 | case 7: EXTRACT_DIGIT(s, x, 1000000UL, dot);
| ^~~~~~~~~~~~~
./Modules/_decimal/libmpdec/io.c:349:40: warning: writing 1 byte into a region of size 0 [-Wstringop-overflow=]
349 | if (s == dot) *s++ = '.'; *s++ = '0' + (char)(x / d); x %= d
| ~~~~~^~~~~~~~~~~~~~~~~~~~~
./Modules/_decimal/libmpdec/io.c:370:14: note: in expansion of macro ‘EXTRACT_DIGIT’
370 | case 6: EXTRACT_DIGIT(s, x, 100000UL, dot);
| ^~~~~~~~~~~~~
./Modules/_decimal/libmpdec/io.c:349:40: warning: writing 1 byte into a region of size 0 [-Wstringop-overflow=]
349 | if (s == dot) *s++ = '.'; *s++ = '0' + (char)(x / d); x %= d
| ~~~~~^~~~~~~~~~~~~~~~~~~~~
./Modules/_decimal/libmpdec/io.c:371:14: note: in expansion of macro ‘EXTRACT_DIGIT’
371 | case 5: EXTRACT_DIGIT(s, x, 10000UL, dot);
| ^~~~~~~~~~~~~
./Modules/_decimal/libmpdec/io.c:349:40: warning: writing 1 byte into a region of size 0 [-Wstringop-overflow=]
349 | if (s == dot) *s++ = '.'; *s++ = '0' + (char)(x / d); x %= d
| ~~~~~^~~~~~~~~~~~~~~~~~~~~
./Modules/_decimal/libmpdec/io.c:370:14: note: in expansion of macro ‘EXTRACT_DIGIT’
370 | case 6: EXTRACT_DIGIT(s, x, 100000UL, dot);
| ^~~~~~~~~~~~~
./Modules/_decimal/libmpdec/io.c:349:40: warning: writing 1 byte into a region of size 0 [-Wstringop-overflow=]
349 | if (s == dot) *s++ = '.'; *s++ = '0' + (char)(x / d); x %= d
| ~~~~~^~~~~~~~~~~~~~~~~~~~~
./Modules/_decimal/libmpdec/io.c:371:14: note: in expansion of macro ‘EXTRACT_DIGIT’
371 | case 5: EXTRACT_DIGIT(s, x, 10000UL, dot);
| ^~~~~~~~~~~~~
./Modules/_decimal/libmpdec/io.c:349:40: warning: writing 1 byte into a region of size 0 [-Wstringop-overflow=]
349 | if (s == dot) *s++ = '.'; *s++ = '0' + (char)(x / d); x %= d
| ~~~~~^~~~~~~~~~~~~~~~~~~~~
./Modules/_decimal/libmpdec/io.c:372:14: note: in expansion of macro ‘EXTRACT_DIGIT’
372 | case 4: EXTRACT_DIGIT(s, x, 1000UL, dot);
| ^~~~~~~~~~~~~
./Modules/_decimal/libmpdec/io.c:349:40: warning: writing 1 byte into a region of size 0 [-Wstringop-overflow=]
349 | if (s == dot) *s++ = '.'; *s++ = '0' + (char)(x / d); x %= d
| ~~~~~^~~~~~~~~~~~~~~~~~~~~
./Modules/_decimal/libmpdec/io.c:371:14: note: in expansion of macro ‘EXTRACT_DIGIT’
371 | case 5: EXTRACT_DIGIT(s, x, 10000UL, dot);
| ^~~~~~~~~~~~~
./Modules/_decimal/libmpdec/io.c:349:40: warning: writing 1 byte into a region of size 0 [-Wstringop-overflow=]
349 | if (s == dot) *s++ = '.'; *s++ = '0' + (char)(x / d); x %= d
| ~~~~~^~~~~~~~~~~~~~~~~~~~~
./Modules/_decimal/libmpdec/io.c:372:14: note: in expansion of macro ‘EXTRACT_DIGIT’
372 | case 4: EXTRACT_DIGIT(s, x, 1000UL, dot);
| ^~~~~~~~~~~~~
./Modules/_decimal/libmpdec/io.c:349:40: warning: writing 1 byte into a region of size 0 [-Wstringop-overflow=]
349 | if (s == dot) *s++ = '.'; *s++ = '0' + (char)(x / d); x %= d
| ~~~~~^~~~~~~~~~~~~~~~~~~~~
./Modules/_decimal/libmpdec/io.c:373:14: note: in expansion of macro ‘EXTRACT_DIGIT’
373 | case 3: EXTRACT_DIGIT(s, x, 100UL, dot);
| ^~~~~~~~~~~~~
./Modules/_decimal/libmpdec/io.c:349:40: warning: writing 1 byte into a region of size 0 [-Wstringop-overflow=]
349 | if (s == dot) *s++ = '.'; *s++ = '0' + (char)(x / d); x %= d
| ~~~~~^~~~~~~~~~~~~~~~~~~~~
./Modules/_decimal/libmpdec/io.c:372:14: note: in expansion of macro ‘EXTRACT_DIGIT’
372 | case 4: EXTRACT_DIGIT(s, x, 1000UL, dot);
| ^~~~~~~~~~~~~
./Modules/_decimal/libmpdec/io.c:349:40: warning: writing 1 byte into a region of size 0 [-Wstringop-overflow=]
349 | if (s == dot) *s++ = '.'; *s++ = '0' + (char)(x / d); x %= d
| ~~~~~^~~~~~~~~~~~~~~~~~~~~
./Modules/_decimal/libmpdec/io.c:373:14: note: in expansion of macro ‘EXTRACT_DIGIT’
373 | case 3: EXTRACT_DIGIT(s, x, 100UL, dot);
| ^~~~~~~~~~~~~
./Modules/_decimal/libmpdec/io.c:349:40: warning: writing 1 byte into a region of size 0 [-Wstringop-overflow=]
349 | if (s == dot) *s++ = '.'; *s++ = '0' + (char)(x / d); x %= d
| ~~~~~^~~~~~~~~~~~~~~~~~~~~
./Modules/_decimal/libmpdec/io.c:374:14: note: in expansion of macro ‘EXTRACT_DIGIT’
374 | case 2: EXTRACT_DIGIT(s, x, 10UL, dot);
| ^~~~~~~~~~~~~
./Modules/_decimal/libmpdec/io.c:349:40: warning: writing 1 byte into a region of size 0 [-Wstringop-overflow=]
349 | if (s == dot) *s++ = '.'; *s++ = '0' + (char)(x / d); x %= d
| ~~~~~^~~~~~~~~~~~~~~~~~~~~
./Modules/_decimal/libmpdec/io.c:373:14: note: in expansion of macro ‘EXTRACT_DIGIT’
373 | case 3: EXTRACT_DIGIT(s, x, 100UL, dot);
| ^~~~~~~~~~~~~
./Modules/_decimal/libmpdec/io.c:349:40: warning: writing 1 byte into a region of size 0 [-Wstringop-overflow=]
349 | if (s == dot) *s++ = '.'; *s++ = '0' + (char)(x / d); x %= d
| ~~~~~^~~~~~~~~~~~~~~~~~~~~
./Modules/_decimal/libmpdec/io.c:374:14: note: in expansion of macro ‘EXTRACT_DIGIT’
374 | case 2: EXTRACT_DIGIT(s, x, 10UL, dot);
| ^~~~~~~~~~~~~
./Modules/_decimal/libmpdec/io.c:349:40: warning: writing 1 byte into a region of size 0 [-Wstringop-overflow=]
349 | if (s == dot) *s++ = '.'; *s++ = '0' + (char)(x / d); x %= d
| ~~~~~^~~~~~~~~~~~~~~~~~~~~
./Modules/_decimal/libmpdec/io.c:374:14: note: in expansion of macro ‘EXTRACT_DIGIT’
374 | case 2: EXTRACT_DIGIT(s, x, 10UL, dot);
| ^~~~~~~~~~~~~
In function ‘word_to_string’,
inlined from ‘coeff_to_string’ at ./Modules/_decimal/libmpdec/io.c:411:13,
inlined from ‘_mpd_to_string’ at ./Modules/_decimal/libmpdec/io.c:502:22:
./Modules/_decimal/libmpdec/io.c:349:40: warning: writing 1 byte into a region of size 0 [-Wstringop-overflow=]
349 | if (s == dot) *s++ = '.'; *s++ = '0' + (char)(x / d); x %= d
| ~~~~~^~~~~~~~~~~~~~~~~~~~~
./Modules/_decimal/libmpdec/io.c:360:14: note: in expansion of macro ‘EXTRACT_DIGIT’
360 | case 15: EXTRACT_DIGIT(s, x, 100000000000000ULL, dot);
| ^~~~~~~~~~~~~
./Modules/_decimal/libmpdec/io.c:349:40: warning: writing 1 byte into a region of size 0 [-Wstringop-overflow=]
349 | if (s == dot) *s++ = '.'; *s++ = '0' + (char)(x / d); x %= d
| ~~~~~^~~~~~~~~~~~~~~~~~~~~
./Modules/_decimal/libmpdec/io.c:361:14: note: in expansion of macro ‘EXTRACT_DIGIT’
361 | case 14: EXTRACT_DIGIT(s, x, 10000000000000ULL, dot);
| ^~~~~~~~~~~~~
./Modules/_decimal/libmpdec/io.c:349:40: warning: writing 1 byte into a region of size 0 [-Wstringop-overflow=]
349 | if (s == dot) *s++ = '.'; *s++ = '0' + (char)(x / d); x %= d
| ~~~~~^~~~~~~~~~~~~~~~~~~~~
./Modules/_decimal/libmpdec/io.c:362:14: note: in expansion of macro ‘EXTRACT_DIGIT’
362 | case 13: EXTRACT_DIGIT(s, x, 1000000000000ULL, dot);
| ^~~~~~~~~~~~~
./Modules/_decimal/libmpdec/io.c:349:40: warning: writing 1 byte into a region of size 0 [-Wstringop-overflow=]
349 | if (s == dot) *s++ = '.'; *s++ = '0' + (char)(x / d); x %= d
| ~~~~~^~~~~~~~~~~~~~~~~~~~~
./Modules/_decimal/libmpdec/io.c:359:14: note: in expansion of macro ‘EXTRACT_DIGIT’
359 | case 16: EXTRACT_DIGIT(s, x, 1000000000000000ULL, dot);
| ^~~~~~~~~~~~~
./Modules/_decimal/libmpdec/io.c:349:40: warning: writing 1 byte into a region of size 0 [-Wstringop-overflow=]
349 | if (s == dot) *s++ = '.'; *s++ = '0' + (char)(x / d); x %= d
| ~~~~~^~~~~~~~~~~~~~~~~~~~~
./Modules/_decimal/libmpdec/io.c:360:14: note: in expansion of macro ‘EXTRACT_DIGIT’
360 | case 15: EXTRACT_DIGIT(s, x, 100000000000000ULL, dot);
| ^~~~~~~~~~~~~
./Modules/_decimal/libmpdec/io.c:349:40: warning: writing 1 byte into a region of size 0 [-Wstringop-overflow=]
349 | if (s == dot) *s++ = '.'; *s++ = '0' + (char)(x / d); x %= d
| ~~~~~^~~~~~~~~~~~~~~~~~~~~
./Modules/_decimal/libmpdec/io.c:361:14: note: in expansion of macro ‘EXTRACT_DIGIT’
361 | case 14: EXTRACT_DIGIT(s, x, 10000000000000ULL, dot);
| ^~~~~~~~~~~~~
./Modules/_decimal/libmpdec/io.c:349:40: warning: writing 1 byte into a region of size 0 [-Wstringop-overflow=]
349 | if (s == dot) *s++ = '.'; *s++ = '0' + (char)(x / d); x %= d
| ~~~~~^~~~~~~~~~~~~~~~~~~~~
./Modules/_decimal/libmpdec/io.c:358:14: note: in expansion of macro ‘EXTRACT_DIGIT’
358 | case 17: EXTRACT_DIGIT(s, x, 10000000000000000ULL, dot);
| ^~~~~~~~~~~~~
./Modules/_decimal/libmpdec/io.c:349:40: warning: writing 1 byte into a region of size 0 [-Wstringop-overflow=]
349 | if (s == dot) *s++ = '.'; *s++ = '0' + (char)(x / d); x %= d
| ~~~~~^~~~~~~~~~~~~~~~~~~~~
./Modules/_decimal/libmpdec/io.c:359:14: note: in expansion of macro ‘EXTRACT_DIGIT’
359 | case 16: EXTRACT_DIGIT(s, x, 1000000000000000ULL, dot);
| ^~~~~~~~~~~~~
./Modules/_decimal/libmpdec/io.c:349:40: warning: writing 1 byte into a region of size 0 [-Wstringop-overflow=]
349 | if (s == dot) *s++ = '.'; *s++ = '0' + (char)(x / d); x %= d
| ~~~~~^~~~~~~~~~~~~~~~~~~~~
./Modules/_decimal/libmpdec/io.c:360:14: note: in expansion of macro ‘EXTRACT_DIGIT’
360 | case 15: EXTRACT_DIGIT(s, x, 100000000000000ULL, dot);
| ^~~~~~~~~~~~~
./Modules/_decimal/libmpdec/io.c:349:40: warning: writing 1 byte into a region of size 0 [-Wstringop-overflow=]
349 | if (s == dot) *s++ = '.'; *s++ = '0' + (char)(x / d); x %= d
| ~~~~~^~~~~~~~~~~~~~~~~~~~~
./Modules/_decimal/libmpdec/io.c:357:14: note: in expansion of macro ‘EXTRACT_DIGIT’
357 | case 18: EXTRACT_DIGIT(s, x, 100000000000000000ULL, dot);
| ^~~~~~~~~~~~~
./Modules/_decimal/libmpdec/io.c:349:40: warning: writing 1 byte into a region of size 0 [-Wstringop-overflow=]
349 | if (s == dot) *s++ = '.'; *s++ = '0' + (char)(x / d); x %= d
| ~~~~~^~~~~~~~~~~~~~~~~~~~~
./Modules/_decimal/libmpdec/io.c:358:14: note: in expansion of macro ‘EXTRACT_DIGIT’
358 | case 17: EXTRACT_DIGIT(s, x, 10000000000000000ULL, dot);
| ^~~~~~~~~~~~~
./Modules/_decimal/libmpdec/io.c:349:40: warning: writing 1 byte into a region of size 0 [-Wstringop-overflow=]
349 | if (s == dot) *s++ = '.'; *s++ = '0' + (char)(x / d); x %= d
| ~~~~~^~~~~~~~~~~~~~~~~~~~~
./Modules/_decimal/libmpdec/io.c:359:14: note: in expansion of macro ‘EXTRACT_DIGIT’
359 | case 16: EXTRACT_DIGIT(s, x, 1000000000000000ULL, dot);
| ^~~~~~~~~~~~~
./Modules/_decimal/libmpdec/io.c:349:40: warning: writing 1 byte into a region of size 0 [-Wstringop-overflow=]
349 | if (s == dot) *s++ = '.'; *s++ = '0' + (char)(x / d); x %= d
| ~~~~~^~~~~~~~~~~~~~~~~~~~~
./Modules/_decimal/libmpdec/io.c:361:14: note: in expansion of macro ‘EXTRACT_DIGIT’
361 | case 14: EXTRACT_DIGIT(s, x, 10000000000000ULL, dot);
| ^~~~~~~~~~~~~
./Modules/_decimal/libmpdec/io.c:349:40: warning: writing 1 byte into a region of size 0 [-Wstringop-overflow=]
349 | if (s == dot) *s++ = '.'; *s++ = '0' + (char)(x / d); x %= d
| ~~~~~^~~~~~~~~~~~~~~~~~~~~
./Modules/_decimal/libmpdec/io.c:362:14: note: in expansion of macro ‘EXTRACT_DIGIT’
362 | case 13: EXTRACT_DIGIT(s, x, 1000000000000ULL, dot);
| ^~~~~~~~~~~~~
./Modules/_decimal/libmpdec/io.c:349:40: warning: writing 1 byte into a region of size 0 [-Wstringop-overflow=]
349 | if (s == dot) *s++ = '.'; *s++ = '0' + (char)(x / d); x %= d
| ~~~~~^~~~~~~~~~~~~~~~~~~~~
./Modules/_decimal/libmpdec/io.c:363:14: note: in expansion of macro ‘EXTRACT_DIGIT’
363 | case 12: EXTRACT_DIGIT(s, x, 100000000000ULL, dot);
| ^~~~~~~~~~~~~
./Modules/_decimal/libmpdec/io.c:349:40: warning: writing 1 byte into a region of size 0 [-Wstringop-overflow=]
349 | if (s == dot) *s++ = '.'; *s++ = '0' + (char)(x / d); x %= d
| ~~~~~^~~~~~~~~~~~~~~~~~~~~
./Modules/_decimal/libmpdec/io.c:362:14: note: in expansion of macro ‘EXTRACT_DIGIT’
362 | case 13: EXTRACT_DIGIT(s, x, 1000000000000ULL, dot);
| ^~~~~~~~~~~~~
./Modules/_decimal/libmpdec/io.c:349:40: warning: writing 1 byte into a region of size 0 [-Wstringop-overflow=]
349 | if (s == dot) *s++ = '.'; *s++ = '0' + (char)(x / d); x %= d
| ~~~~~^~~~~~~~~~~~~~~~~~~~~
./Modules/_decimal/libmpdec/io.c:363:14: note: in expansion of macro ‘EXTRACT_DIGIT’
363 | case 12: EXTRACT_DIGIT(s, x, 100000000000ULL, dot);
| ^~~~~~~~~~~~~
./Modules/_decimal/libmpdec/io.c:349:40: warning: writing 1 byte into a region of size 0 [-Wstringop-overflow=]
349 | if (s == dot) *s++ = '.'; *s++ = '0' + (char)(x / d); x %= d
| ~~~~~^~~~~~~~~~~~~~~~~~~~~
./Modules/_decimal/libmpdec/io.c:364:14: note: in expansion of macro ‘EXTRACT_DIGIT’
364 | case 11: EXTRACT_DIGIT(s, x, 10000000000ULL, dot);
| ^~~~~~~~~~~~~
./Modules/_decimal/libmpdec/io.c:349:40: warning: writing 1 byte into a region of size 0 [-Wstringop-overflow=]
349 | if (s == dot) *s++ = '.'; *s++ = '0' + (char)(x / d); x %= d
| ~~~~~^~~~~~~~~~~~~~~~~~~~~
./Modules/_decimal/libmpdec/io.c:363:14: note: in expansion of macro ‘EXTRACT_DIGIT’
363 | case 12: EXTRACT_DIGIT(s, x, 100000000000ULL, dot);
| ^~~~~~~~~~~~~
./Modules/_decimal/libmpdec/io.c:349:40: warning: writing 1 byte into a region of size 0 [-Wstringop-overflow=]
349 | if (s == dot) *s++ = '.'; *s++ = '0' + (char)(x / d); x %= d
| ~~~~~^~~~~~~~~~~~~~~~~~~~~
./Modules/_decimal/libmpdec/io.c:364:14: note: in expansion of macro ‘EXTRACT_DIGIT’
364 | case 11: EXTRACT_DIGIT(s, x, 10000000000ULL, dot);
| ^~~~~~~~~~~~~
./Modules/_decimal/libmpdec/io.c:349:40: warning: writing 1 byte into a region of size 0 [-Wstringop-overflow=]
349 | if (s == dot) *s++ = '.'; *s++ = '0' + (char)(x / d); x %= d
| ~~~~~^~~~~~~~~~~~~~~~~~~~~
./Modules/_decimal/libmpdec/io.c:366:14: note: in expansion of macro ‘EXTRACT_DIGIT’
366 | case 10: EXTRACT_DIGIT(s, x, 1000000000UL, dot);
| ^~~~~~~~~~~~~
./Modules/_decimal/libmpdec/io.c:349:40: warning: writing 1 byte into a region of size 0 [-Wstringop-overflow=]
349 | if (s == dot) *s++ = '.'; *s++ = '0' + (char)(x / d); x %= d
| ~~~~~^~~~~~~~~~~~~~~~~~~~~
./Modules/_decimal/libmpdec/io.c:364:14: note: in expansion of macro ‘EXTRACT_DIGIT’
364 | case 11: EXTRACT_DIGIT(s, x, 10000000000ULL, dot);
| ^~~~~~~~~~~~~
./Modules/_decimal/libmpdec/io.c:349:40: warning: writing 1 byte into a region of size 0 [-Wstringop-overflow=]
349 | if (s == dot) *s++ = '.'; *s++ = '0' + (char)(x / d); x %= d
| ~~~~~^~~~~~~~~~~~~~~~~~~~~
./Modules/_decimal/libmpdec/io.c:366:14: note: in expansion of macro ‘EXTRACT_DIGIT’
366 | case 10: EXTRACT_DIGIT(s, x, 1000000000UL, dot);
| ^~~~~~~~~~~~~
./Modules/_decimal/libmpdec/io.c:349:40: warning: writing 1 byte into a region of size 0 [-Wstringop-overflow=]
349 | if (s == dot) *s++ = '.'; *s++ = '0' + (char)(x / d); x %= d
| ~~~~~^~~~~~~~~~~~~~~~~~~~~
./Modules/_decimal/libmpdec/io.c:367:14: note: in expansion of macro ‘EXTRACT_DIGIT’
367 | case 9: EXTRACT_DIGIT(s, x, 100000000UL, dot);
| ^~~~~~~~~~~~~
./Modules/_decimal/libmpdec/io.c:349:40: warning: writing 1 byte into a region of size 0 [-Wstringop-overflow=]
349 | if (s == dot) *s++ = '.'; *s++ = '0' + (char)(x / d); x %= d
| ~~~~~^~~~~~~~~~~~~~~~~~~~~
./Modules/_decimal/libmpdec/io.c:366:14: note: in expansion of macro ‘EXTRACT_DIGIT’
366 | case 10: EXTRACT_DIGIT(s, x, 1000000000UL, dot);
| ^~~~~~~~~~~~~
./Modules/_decimal/libmpdec/io.c:349:40: warning: writing 1 byte into a region of size 0 [-Wstringop-overflow=]
349 | if (s == dot) *s++ = '.'; *s++ = '0' + (char)(x / d); x %= d
| ~~~~~^~~~~~~~~~~~~~~~~~~~~
./Modules/_decimal/libmpdec/io.c:367:14: note: in expansion of macro ‘EXTRACT_DIGIT’
367 | case 9: EXTRACT_DIGIT(s, x, 100000000UL, dot);
| ^~~~~~~~~~~~~
./Modules/_decimal/libmpdec/io.c:349:40: warning: writing 1 byte into a region of size 0 [-Wstringop-overflow=]
349 | if (s == dot) *s++ = '.'; *s++ = '0' + (char)(x / d); x %= d
| ~~~~~^~~~~~~~~~~~~~~~~~~~~
./Modules/_decimal/libmpdec/io.c:368:14: note: in expansion of macro ‘EXTRACT_DIGIT’
368 | case 8: EXTRACT_DIGIT(s, x, 10000000UL, dot);
| ^~~~~~~~~~~~~
./Modules/_decimal/libmpdec/io.c:349:40: warning: writing 1 byte into a region of size 0 [-Wstringop-overflow=]
349 | if (s == dot) *s++ = '.'; *s++ = '0' + (char)(x / d); x %= d
| ~~~~~^~~~~~~~~~~~~~~~~~~~~
./Modules/_decimal/libmpdec/io.c:367:14: note: in expansion of macro ‘EXTRACT_DIGIT’
367 | case 9: EXTRACT_DIGIT(s, x, 100000000UL, dot);
| ^~~~~~~~~~~~~
./Modules/_decimal/libmpdec/io.c:349:40: warning: writing 1 byte into a region of size 0 [-Wstringop-overflow=]
349 | if (s == dot) *s++ = '.'; *s++ = '0' + (char)(x / d); x %= d
| ~~~~~^~~~~~~~~~~~~~~~~~~~~
./Modules/_decimal/libmpdec/io.c:368:14: note: in expansion of macro ‘EXTRACT_DIGIT’
368 | case 8: EXTRACT_DIGIT(s, x, 10000000UL, dot);
| ^~~~~~~~~~~~~
./Modules/_decimal/libmpdec/io.c:349:40: warning: writing 1 byte into a region of size 0 [-Wstringop-overflow=]
349 | if (s == dot) *s++ = '.'; *s++ = '0' + (char)(x / d); x %= d
| ~~~~~^~~~~~~~~~~~~~~~~~~~~
./Modules/_decimal/libmpdec/io.c:369:14: note: in expansion of macro ‘EXTRACT_DIGIT’
369 | case 7: EXTRACT_DIGIT(s, x, 1000000UL, dot);
| ^~~~~~~~~~~~~
./Modules/_decimal/libmpdec/io.c:349:40: warning: writing 1 byte into a region of size 0 [-Wstringop-overflow=]
349 | if (s == dot) *s++ = '.'; *s++ = '0' + (char)(x / d); x %= d
| ~~~~~^~~~~~~~~~~~~~~~~~~~~
./Modules/_decimal/libmpdec/io.c:368:14: note: in expansion of macro ‘EXTRACT_DIGIT’
368 | case 8: EXTRACT_DIGIT(s, x, 10000000UL, dot);
| ^~~~~~~~~~~~~
./Modules/_decimal/libmpdec/io.c:349:40: warning: writing 1 byte into a region of size 0 [-Wstringop-overflow=]
349 | if (s == dot) *s++ = '.'; *s++ = '0' + (char)(x / d); x %= d
| ~~~~~^~~~~~~~~~~~~~~~~~~~~
./Modules/_decimal/libmpdec/io.c:369:14: note: in expansion of macro ‘EXTRACT_DIGIT’
369 | case 7: EXTRACT_DIGIT(s, x, 1000000UL, dot);
| ^~~~~~~~~~~~~
./Modules/_decimal/libmpdec/io.c:349:40: warning: writing 1 byte into a region of size 0 [-Wstringop-overflow=]
349 | if (s == dot) *s++ = '.'; *s++ = '0' + (char)(x / d); x %= d
| ~~~~~^~~~~~~~~~~~~~~~~~~~~
./Modules/_decimal/libmpdec/io.c:370:14: note: in expansion of macro ‘EXTRACT_DIGIT’
370 | case 6: EXTRACT_DIGIT(s, x, 100000UL, dot);
| ^~~~~~~~~~~~~
./Modules/_decimal/libmpdec/io.c:349:40: warning: writing 1 byte into a region of size 0 [-Wstringop-overflow=]
349 | if (s == dot) *s++ = '.'; *s++ = '0' + (char)(x / d); x %= d
| ~~~~~^~~~~~~~~~~~~~~~~~~~~
./Modules/_decimal/libmpdec/io.c:369:14: note: in expansion of macro ‘EXTRACT_DIGIT’
369 | case 7: EXTRACT_DIGIT(s, x, 1000000UL, dot);
| ^~~~~~~~~~~~~
./Modules/_decimal/libmpdec/io.c:349:40: warning: writing 1 byte into a region of size 0 [-Wstringop-overflow=]
349 | if (s == dot) *s++ = '.'; *s++ = '0' + (char)(x / d); x %= d
| ~~~~~^~~~~~~~~~~~~~~~~~~~~
./Modules/_decimal/libmpdec/io.c:370:14: note: in expansion of macro ‘EXTRACT_DIGIT’
370 | case 6: EXTRACT_DIGIT(s, x, 100000UL, dot);
| ^~~~~~~~~~~~~
./Modules/_decimal/libmpdec/io.c:349:40: warning: writing 1 byte into a region of size 0 [-Wstringop-overflow=]
349 | if (s == dot) *s++ = '.'; *s++ = '0' + (char)(x / d); x %= d
| ~~~~~^~~~~~~~~~~~~~~~~~~~~
./Modules/_decimal/libmpdec/io.c:371:14: note: in expansion of macro ‘EXTRACT_DIGIT’
371 | case 5: EXTRACT_DIGIT(s, x, 10000UL, dot);
| ^~~~~~~~~~~~~
./Modules/_decimal/libmpdec/io.c:349:40: warning: writing 1 byte into a region of size 0 [-Wstringop-overflow=]
349 | if (s == dot) *s++ = '.'; *s++ = '0' + (char)(x / d); x %= d
| ~~~~~^~~~~~~~~~~~~~~~~~~~~
./Modules/_decimal/libmpdec/io.c:370:14: note: in expansion of macro ‘EXTRACT_DIGIT’
370 | case 6: EXTRACT_DIGIT(s, x, 100000UL, dot);
| ^~~~~~~~~~~~~
./Modules/_decimal/libmpdec/io.c:349:40: warning: writing 1 byte into a region of size 0 [-Wstringop-overflow=]
349 | if (s == dot) *s++ = '.'; *s++ = '0' + (char)(x / d); x %= d
| ~~~~~^~~~~~~~~~~~~~~~~~~~~
./Modules/_decimal/libmpdec/io.c:371:14: note: in expansion of macro ‘EXTRACT_DIGIT’
371 | case 5: EXTRACT_DIGIT(s, x, 10000UL, dot);
| ^~~~~~~~~~~~~
./Modules/_decimal/libmpdec/io.c:349:40: warning: writing 1 byte into a region of size 0 [-Wstringop-overflow=]
349 | if (s == dot) *s++ = '.'; *s++ = '0' + (char)(x / d); x %= d
| ~~~~~^~~~~~~~~~~~~~~~~~~~~
./Modules/_decimal/libmpdec/io.c:372:14: note: in expansion of macro ‘EXTRACT_DIGIT’
372 | case 4: EXTRACT_DIGIT(s, x, 1000UL, dot);
| ^~~~~~~~~~~~~
./Modules/_decimal/libmpdec/io.c:349:40: warning: writing 1 byte into a region of size 0 [-Wstringop-overflow=]
349 | if (s == dot) *s++ = '.'; *s++ = '0' + (char)(x / d); x %= d
| ~~~~~^~~~~~~~~~~~~~~~~~~~~
./Modules/_decimal/libmpdec/io.c:371:14: note: in expansion of macro ‘EXTRACT_DIGIT’
371 | case 5: EXTRACT_DIGIT(s, x, 10000UL, dot);
| ^~~~~~~~~~~~~
./Modules/_decimal/libmpdec/io.c:349:40: warning: writing 1 byte into a region of size 0 [-Wstringop-overflow=]
349 | if (s == dot) *s++ = '.'; *s++ = '0' + (char)(x / d); x %= d
| ~~~~~^~~~~~~~~~~~~~~~~~~~~
./Modules/_decimal/libmpdec/io.c:372:14: note: in expansion of macro ‘EXTRACT_DIGIT’
372 | case 4: EXTRACT_DIGIT(s, x, 1000UL, dot);
| ^~~~~~~~~~~~~
./Modules/_decimal/libmpdec/io.c:349:40: warning: writing 1 byte into a region of size 0 [-Wstringop-overflow=]
349 | if (s == dot) *s++ = '.'; *s++ = '0' + (char)(x / d); x %= d
| ~~~~~^~~~~~~~~~~~~~~~~~~~~
./Modules/_decimal/libmpdec/io.c:373:14: note: in expansion of macro ‘EXTRACT_DIGIT’
373 | case 3: EXTRACT_DIGIT(s, x, 100UL, dot);
| ^~~~~~~~~~~~~
./Modules/_decimal/libmpdec/io.c:349:40: warning: writing 1 byte into a region of size 0 [-Wstringop-overflow=]
349 | if (s == dot) *s++ = '.'; *s++ = '0' + (char)(x / d); x %= d
| ~~~~~^~~~~~~~~~~~~~~~~~~~~
./Modules/_decimal/libmpdec/io.c:372:14: note: in expansion of macro ‘EXTRACT_DIGIT’
372 | case 4: EXTRACT_DIGIT(s, x, 1000UL, dot);
| ^~~~~~~~~~~~~
./Modules/_decimal/libmpdec/io.c:349:40: warning: writing 1 byte into a region of size 0 [-Wstringop-overflow=]
349 | if (s == dot) *s++ = '.'; *s++ = '0' + (char)(x / d); x %= d
| ~~~~~^~~~~~~~~~~~~~~~~~~~~
./Modules/_decimal/libmpdec/io.c:373:14: note: in expansion of macro ‘EXTRACT_DIGIT’
373 | case 3: EXTRACT_DIGIT(s, x, 100UL, dot);
| ^~~~~~~~~~~~~
./Modules/_decimal/libmpdec/io.c:349:40: warning: writing 1 byte into a region of size 0 [-Wstringop-overflow=]
349 | if (s == dot) *s++ = '.'; *s++ = '0' + (char)(x / d); x %= d
| ~~~~~^~~~~~~~~~~~~~~~~~~~~
./Modules/_decimal/libmpdec/io.c:374:14: note: in expansion of macro ‘EXTRACT_DIGIT’
374 | case 2: EXTRACT_DIGIT(s, x, 10UL, dot);
| ^~~~~~~~~~~~~
./Modules/_decimal/libmpdec/io.c:349:40: warning: writing 1 byte into a region of size 0 [-Wstringop-overflow=]
349 | if (s == dot) *s++ = '.'; *s++ = '0' + (char)(x / d); x %= d
| ~~~~~^~~~~~~~~~~~~~~~~~~~~
./Modules/_decimal/libmpdec/io.c:373:14: note: in expansion of macro ‘EXTRACT_DIGIT’
373 | case 3: EXTRACT_DIGIT(s, x, 100UL, dot);
| ^~~~~~~~~~~~~
./Modules/_decimal/libmpdec/io.c:349:40: warning: writing 1 byte into a region of size 0 [-Wstringop-overflow=]
349 | if (s == dot) *s++ = '.'; *s++ = '0' + (char)(x / d); x %= d
| ~~~~~^~~~~~~~~~~~~~~~~~~~~
./Modules/_decimal/libmpdec/io.c:374:14: note: in expansion of macro ‘EXTRACT_DIGIT’
374 | case 2: EXTRACT_DIGIT(s, x, 10UL, dot);
| ^~~~~~~~~~~~~
./Modules/_decimal/libmpdec/io.c:349:40: warning: writing 1 byte into a region of size 0 [-Wstringop-overflow=]
349 | if (s == dot) *s++ = '.'; *s++ = '0' + (char)(x / d); x %= d
| ~~~~~^~~~~~~~~~~~~~~~~~~~~
./Modules/_decimal/libmpdec/io.c:374:14: note: in expansion of macro ‘EXTRACT_DIGIT’
374 | case 2: EXTRACT_DIGIT(s, x, 10UL, dot);
| ^~~~~~~~~~~~~
Timeout (0:05:00)!
Thread 0x0000007fadcef100 (most recent call first):
File "/home/buildbot/buildarea/3.13.pablogsal-rasp.asan/build/Lib/subprocess.py", line 2024 in _try_wait
File "/home/buildbot/buildarea/3.13.pablogsal-rasp.asan/build/Lib/subprocess.py", line 2049 in _wait
File "/home/buildbot/buildarea/3.13.pablogsal-rasp.asan/build/Lib/subprocess.py", line 1280 in wait
File "/home/buildbot/buildarea/3.13.pablogsal-rasp.asan/build/Lib/test/libregrtest/run_workers.py", line 188 in _run_process
File "/home/buildbot/buildarea/3.13.pablogsal-rasp.asan/build/Lib/test/libregrtest/run_workers.py", line 293 in run_tmp_files
File "/home/buildbot/buildarea/3.13.pablogsal-rasp.asan/build/Lib/test/libregrtest/run_workers.py", line 357 in _runtest
File "/home/buildbot/buildarea/3.13.pablogsal-rasp.asan/build/Lib/test/libregrtest/run_workers.py", line 397 in run
File "/home/buildbot/buildarea/3.13.pablogsal-rasp.asan/build/Lib/threading.py", line 1043 in _bootstrap_inner
File "/home/buildbot/buildarea/3.13.pablogsal-rasp.asan/build/Lib/threading.py", line 1014 in _bootstrap
Thread 0x0000007fae4ff100 (most recent call first):
File "/home/buildbot/buildarea/3.13.pablogsal-rasp.asan/build/Lib/test/libregrtest/setup.py", line 85 in _test_audit_hook
File "/home/buildbot/buildarea/3.13.pablogsal-rasp.asan/build/Lib/subprocess.py", line 2060 in _wait
File "/home/buildbot/buildarea/3.13.pablogsal-rasp.asan/build/Lib/subprocess.py", line 1280 in wait
File "/home/buildbot/buildarea/3.13.pablogsal-rasp.asan/build/Lib/test/libregrtest/run_workers.py", line 188 in _run_process
File "/home/buildbot/buildarea/3.13.pablogsal-rasp.asan/build/Lib/test/libregrtest/run_workers.py", line 293 in run_tmp_files
File "/home/buildbot/buildarea/3.13.pablogsal-rasp.asan/build/Lib/test/libregrtest/run_workers.py", line 357 in _runtest
File "/home/buildbot/buildarea/3.13.pablogsal-rasp.asan/build/Lib/test/libregrtest/run_workers.py", line 397 in run
File "/home/buildbot/buildarea/3.13.pablogsal-rasp.asan/build/Lib/threading.py", line 1043 in _bootstrap_inner
File "/home/buildbot/buildarea/3.13.pablogsal-rasp.asan/build/Lib/threading.py", line 1014 in _bootstrap
Thread 0x0000007fb9e79500 (most recent call first):
File "/home/buildbot/buildarea/3.13.pablogsal-rasp.asan/build/Lib/test/libregrtest/utils.py", line 71 in format_duration
File "/home/buildbot/buildarea/3.13.pablogsal-rasp.asan/build/Lib/test/libregrtest/run_workers.py", line 458 in get_running
File "/home/buildbot/buildarea/3.13.pablogsal-rasp.asan/build/Lib/test/libregrtest/run_workers.py", line 545 in _get_result
File "/home/buildbot/buildarea/3.13.pablogsal-rasp.asan/build/Lib/test/libregrtest/run_workers.py", line 604 in run
File "/home/buildbot/buildarea/3.13.pablogsal-rasp.asan/build/Lib/test/libregrtest/main.py", line 433 in _run_tests_mp
File "/home/buildbot/buildarea/3.13.pablogsal-rasp.asan/build/Lib/test/libregrtest/main.py", line 538 in _run_tests
File "/home/buildbot/buildarea/3.13.pablogsal-rasp.asan/build/Lib/test/libregrtest/main.py", line 586 in run_tests
File "/home/buildbot/buildarea/3.13.pablogsal-rasp.asan/build/Lib/test/libregrtest/main.py", line 755 in main
File "/home/buildbot/buildarea/3.13.pablogsal-rasp.asan/build/Lib/test/libregrtest/main.py", line 763 in main
File "/home/buildbot/buildarea/3.13.pablogsal-rasp.asan/build/Lib/test/__main__.py", line 2 in <module>
File "<frozen runpy>", line 88 in _run_code
File "<frozen runpy>", line 198 in _run_module_as_main
make: *** [Makefile:2252: buildbottest] Error 1
Cannot open file '/home/buildbot/buildarea/3.13.pablogsal-rasp.asan/build/test-results.xml' for upload
Test report
===========
Sincerely,
-The Buildbot
1
0
☠ Buildbot (Python): python/cpython - failed test (failure) uploading test-results.xml (failure) (main)
by buildbot@python.org Sept. 7, 2025
by buildbot@python.org Sept. 7, 2025
Sept. 7, 2025
The Buildbot has detected a new failure on builder ARM Raspbian Linux Asan 3.x while building python/cpython.
Full details are available at:
https://buildbot.python.org/#/builders/1811/builds/194
Buildbot URL: https://buildbot.python.org/
Worker for this Build: pablogsal-rasp
Build Reason: <unknown>
Blamelist: Albert Zeyer <albzey(a)gmail.com>, Gilles Peiffer <gilles.peiffer.yt(a)gmail.com>, R. David Murray <rdmurray(a)bitdance.com>, Zachary Ware <zach(a)python.org>, mqudah <mohghq(a)gmail.com>
BUILD FAILED: failed test (failure) uploading test-results.xml (failure)
Summary of the results of the build (if available):
===================================================
Captured traceback
==================
remote: Enumerating objects: 15, done.
remote: Counting objects: 9% (1/11)
remote: Counting objects: 18% (2/11)
remote: Counting objects: 27% (3/11)
remote: Counting objects: 36% (4/11)
remote: Counting objects: 45% (5/11)
remote: Counting objects: 54% (6/11)
remote: Counting objects: 63% (7/11)
remote: Counting objects: 72% (8/11)
remote: Counting objects: 81% (9/11)
remote: Counting objects: 90% (10/11)
remote: Counting objects: 100% (11/11)
remote: Counting objects: 100% (11/11), done.
remote: Compressing objects: 10% (1/10)
remote: Compressing objects: 20% (2/10)
remote: Compressing objects: 30% (3/10)
remote: Compressing objects: 40% (4/10)
remote: Compressing objects: 50% (5/10)
remote: Compressing objects: 60% (6/10)
remote: Compressing objects: 70% (7/10)
remote: Compressing objects: 80% (8/10)
remote: Compressing objects: 90% (9/10)
remote: Compressing objects: 100% (10/10)
remote: Compressing objects: 100% (10/10), done.
remote: Total 15 (delta 1), reused 1 (delta 1), pack-reused 4 (from 2)
From https://github.com/python/cpython
* branch main -> FETCH_HEAD
Note: switching to '8ed5a2b56cc6a8635e586c641b0b837669f6677b'.
You are in 'detached HEAD' state. You can look around, make experimental
changes and commit them, and you can discard any commits you make in this
state without impacting any branches by switching back to a branch.
If you want to create a new branch to retain commits you create, you may
do so (now or later) by using -c with the switch command. Example:
git switch -c <new-branch-name>
Or undo this operation with:
git switch -
Turn off this advice by setting config variable advice.detachedHead to false
HEAD is now at 8ed5a2b56cc gh-118981: multiprocessing.popen_spawn_posix, fix potential hang (gh-118982)
Switched to and reset branch 'main'
configure: WARNING: no system libmpdec found; falling back to pure-Python version for the decimal module
In file included from ./Include/internal/pycore_dict.h:11,
from Objects/typeobject.c:7:
In function ‘Py_DECREF_MORTAL’,
inlined from ‘PyStackRef_XCLOSE’ at ./Include/internal/pycore_stackref.h:730:9,
inlined from ‘_PyThreadState_PopCStackRef’ at ./Include/internal/pycore_stackref.h:810:5,
inlined from ‘vectorcall_maybe’ at Objects/typeobject.c:3108:9:
./Include/internal/pycore_object.h:481:8: warning: array subscript 0 is outside array bounds of ‘PyObject[0]’ {aka ‘struct _object[]’} [-Warray-bounds]
481 | if (--op->ob_refcnt == 0) {
| ^
Timeout (0:05:00)!
Thread 0x0000007f85fef100 [Thread-2] (most recent call first):
File "/home/buildbot/buildarea/3.x.pablogsal-rasp.asan/build/Lib/subprocess.py", line 2021 in _try_wait
File "/home/buildbot/buildarea/3.x.pablogsal-rasp.asan/build/Lib/subprocess.py", line 2046 in _wait
File "/home/buildbot/buildarea/3.x.pablogsal-rasp.asan/build/Lib/subprocess.py", line 1277 in wait
File "/home/buildbot/buildarea/3.x.pablogsal-rasp.asan/build/Lib/test/libregrtest/run_workers.py", line 194 in _run_process
File "/home/buildbot/buildarea/3.x.pablogsal-rasp.asan/build/Lib/test/libregrtest/run_workers.py", line 299 in run_tmp_files
File "/home/buildbot/buildarea/3.x.pablogsal-rasp.asan/build/Lib/test/libregrtest/run_workers.py", line 363 in _runtest
File "/home/buildbot/buildarea/3.x.pablogsal-rasp.asan/build/Lib/test/libregrtest/run_workers.py", line 403 in run
File "/home/buildbot/buildarea/3.x.pablogsal-rasp.asan/build/Lib/threading.py", line 1074 in _bootstrap_inner
File "/home/buildbot/buildarea/3.x.pablogsal-rasp.asan/build/Lib/threading.py", line 1036 in _bootstrap
Thread 0x0000007f867ff100 [Thread-1] (most recent call first):
File "/home/buildbot/buildarea/3.x.pablogsal-rasp.asan/build/Lib/subprocess.py", line 2052 in _wait
File "/home/buildbot/buildarea/3.x.pablogsal-rasp.asan/build/Lib/subprocess.py", line 1277 in wait
File "/home/buildbot/buildarea/3.x.pablogsal-rasp.asan/build/Lib/test/libregrtest/run_workers.py", line 194 in _run_process
File "/home/buildbot/buildarea/3.x.pablogsal-rasp.asan/build/Lib/test/libregrtest/run_workers.py", line 299 in run_tmp_files
File "/home/buildbot/buildarea/3.x.pablogsal-rasp.asan/build/Lib/test/libregrtest/run_workers.py", line 363 in _runtest
File "/home/buildbot/buildarea/3.x.pablogsal-rasp.asan/build/Lib/test/libregrtest/run_workers.py", line 403 in run
File "/home/buildbot/buildarea/3.x.pablogsal-rasp.asan/build/Lib/threading.py", line 1074 in _bootstrap_inner
File "/home/buildbot/buildarea/3.x.pablogsal-rasp.asan/build/Lib/threading.py", line 1036 in _bootstrap
Thread 0x0000007f925656c0 [python] (most recent call first):
File "/home/buildbot/buildarea/3.x.pablogsal-rasp.asan/build/Lib/test/libregrtest/utils.py", line 64 in format_duration
File "/home/buildbot/buildarea/3.x.pablogsal-rasp.asan/build/Lib/test/libregrtest/run_workers.py", line 464 in get_running
File "/home/buildbot/buildarea/3.x.pablogsal-rasp.asan/build/Lib/test/libregrtest/run_workers.py", line 551 in _get_result
File "/home/buildbot/buildarea/3.x.pablogsal-rasp.asan/build/Lib/test/libregrtest/run_workers.py", line 610 in run
File "/home/buildbot/buildarea/3.x.pablogsal-rasp.asan/build/Lib/test/libregrtest/main.py", line 455 in _run_tests_mp
File "/home/buildbot/buildarea/3.x.pablogsal-rasp.asan/build/Lib/test/libregrtest/main.py", line 561 in _run_tests
File "/home/buildbot/buildarea/3.x.pablogsal-rasp.asan/build/Lib/test/libregrtest/main.py", line 598 in run_tests
File "/home/buildbot/buildarea/3.x.pablogsal-rasp.asan/build/Lib/test/libregrtest/main.py", line 767 in main
File "/home/buildbot/buildarea/3.x.pablogsal-rasp.asan/build/Lib/test/libregrtest/main.py", line 775 in main
File "/home/buildbot/buildarea/3.x.pablogsal-rasp.asan/build/Lib/test/__main__.py", line 2 in <module>
File "<frozen runpy>", line 88 in _run_code
File "<frozen runpy>", line 198 in _run_module_as_main
make: *** [Makefile:2494: buildbottest] Error 1
Cannot open file '/home/buildbot/buildarea/3.x.pablogsal-rasp.asan/build/test-results.xml' for upload
Test report
===========
Sincerely,
-The Buildbot
1
0
☠ Buildbot (Python): python/cpython - failed test (failure) (main)
by buildbot@python.org Sept. 7, 2025
by buildbot@python.org Sept. 7, 2025
Sept. 7, 2025
The Buildbot has detected a new failure on builder ARM64 Raspbian 3.x while building python/cpython.
Full details are available at:
https://buildbot.python.org/#/builders/1678/builds/793
Buildbot URL: https://buildbot.python.org/
Worker for this Build: stan-raspbian
Build Reason: <unknown>
Blamelist: R. David Murray <rdmurray(a)bitdance.com>, Zachary Ware <zach(a)python.org>, mqudah <mohghq(a)gmail.com>
BUILD FAILED: failed test (failure)
Summary of the results of the build (if available):
===================================================
==
Captured traceback
==================
Traceback (most recent call last):
File "/home/stan/buildarea/3.x.stan-raspbian.nondebug/build/Lib/test/support/__init__.py", line 837, in gc_collect
gc.collect()
~~~~~~~~~~^^
ResourceWarning: unclosed file <_io.BufferedReader name='/home/stan/buildarea/3.x.stan-raspbian.nondebug/build/Lib/test/test_importlib/metadata/data/example2-1.0.0-py3-none-any.whl'>
k
Test report
===========
Sincerely,
-The Buildbot
1
0
☠ Buildbot (Python): python/cpython - failed test (failure) (3.13)
by buildbot@python.org Sept. 6, 2025
by buildbot@python.org Sept. 6, 2025
Sept. 6, 2025
The Buildbot has detected a new failure on builder AMD64 Windows Server 2022 NoGIL 3.13 while building python/cpython.
Full details are available at:
https://buildbot.python.org/#/builders/1488/builds/1556
Buildbot URL: https://buildbot.python.org/
Worker for this Build: itamaro-win64-srv-22-aws
Build Reason: <unknown>
Blamelist: Adam Turner <9087854+AA-Turner(a)users.noreply.github.com>, Bénédikt Tran <10796600+picnixz(a)users.noreply.github.com>, Miss Islington (bot) <31488909+miss-islington(a)users.noreply.github.com>
BUILD FAILED: failed test (failure)
Summary of the results of the build (if available):
===================================================
==
Captured traceback
==================
Traceback (most recent call last):
File "C:\Users\Administrator\buildarea\3.13.itamaro-win64-srv-22-aws.x64.nogil\build\Lib\test\test_launcher.py", line 445, in test_search_major_3
self.assertEqual("PythonCore", data["env.company"])
~~~~~~~~~~~~~~~~^^^^^^^^^^^^^^^^^^^^^^^^^^^^^^^^^^^
AssertionError: 'PythonCore' != 'PythonTestSuite'
- PythonCore
+ PythonTestSuite
Traceback (most recent call last):
File "C:\Users\Administrator\buildarea\3.13.itamaro-win64-srv-22-aws.x64.nogil\build\Lib\test\test_launcher.py", line 465, in test_search_major_2
self.assertEqual("PythonCore", data["env.company"])
~~~~~~~~~~~~~~~~^^^^^^^^^^^^^^^^^^^^^^^^^^^^^^^^^^^
AssertionError: 'PythonCore' != 'PythonTestSuite'
- PythonCore
+ PythonTestSuite
Test report
===========
Failed tests:
- test_launcher
Failed subtests:
- test_search_major_3 - test.test_launcher.TestLauncher.test_search_major_3
- test_search_major_2 - test.test_launcher.TestLauncher.test_search_major_2
Sincerely,
-The Buildbot
1
0
☠ Buildbot (Python): python/cpython - failed test (failure) (main)
by buildbot@python.org Sept. 6, 2025
by buildbot@python.org Sept. 6, 2025
Sept. 6, 2025
The Buildbot has detected a new failure on builder AMD64 Windows11 Non-Debug 3.x while building python/cpython.
Full details are available at:
https://buildbot.python.org/#/builders/914/builds/5142
Buildbot URL: https://buildbot.python.org/
Worker for this Build: ware-win11
Build Reason: <unknown>
Blamelist: AN Long <aisk(a)users.noreply.github.com>, Adam Turner <9087854+AA-Turner(a)users.noreply.github.com>, Alper <alperyoney(a)fb.com>, Brett Cannon <brett(a)python.org>, Brian Schubert <brianm.schubert(a)gmail.com>, Christoph Walcher <christoph-wa(a)gmx.de>, David Ellis <ducksual(a)gmail.com>, Gyeongjae Choi <def6488(a)gmail.com>, Jacob Walls <jacobtylerwalls(a)gmail.com>, Jelle Zijlstra <jelle.zijlstra(a)gmail.com>, Petr Viktorin <encukou(a)gmail.com>, Ric <11750904+ricsatjr(a)users.noreply.github.com>, Semyon Moroz <donbarbos(a)proton.me>, Serhiy Storchaka <storchaka(a)gmail.com>, W. H. Wang <mattwang44(a)gmail.com>, asas1asas200 <asas1asas200(a)gmail.com>, dbXD320 <devanshbaghla320(a)gmail.com>
BUILD FAILED: failed test (failure)
Summary of the results of the build (if available):
===================================================
==
Captured traceback
==================
Traceback (most recent call last):
File "b:\uildarea\3.x.ware-win11.nondebug\build\Lib\test\test_tarfile.py", line 3880, in test_parent_symlink
self.expect_file('parent/evil')
~~~~~~~~~~~~~~~~^^^^^^^^^^^^^^^
File "b:\uildarea\3.x.ware-win11.nondebug\build\Lib\test\test_tarfile.py", line 3745, in expect_file
raise self.raised_exception
File "b:\uildarea\3.x.ware-win11.nondebug\build\Lib\test\test_tarfile.py", line 3718, in check_context
tar.extractall(self.destdir, filter=filter)
~~~~~~~~~~~~~~^^^^^^^^^^^^^^^^^^^^^^^^^^^^^
File "b:\uildarea\3.x.ware-win11.nondebug\build\Lib\tarfile.py", line 2408, in extractall
tarinfo, unfiltered = self._get_extract_tarinfo(
~~~~~~~~~~~~~~~~~~~~~~~~~^
member, filter_function, path)
^^^^^^^^^^^^^^^^^^^^^^^^^^^^^^
File "b:\uildarea\3.x.ware-win11.nondebug\build\Lib\tarfile.py", line 2497, in _get_extract_tarinfo
self._handle_fatal_error(e)
~~~~~~~~~~~~~~~~~~~~~~~~^^^
File "b:\uildarea\3.x.ware-win11.nondebug\build\Lib\tarfile.py", line 2495, in _get_extract_tarinfo
filtered = filter_function(unfiltered, path)
File "b:\uildarea\3.x.ware-win11.nondebug\build\Lib\tarfile.py", line 858, in data_filter
new_attrs = _get_filtered_attrs(member, dest_path, True)
File "b:\uildarea\3.x.ware-win11.nondebug\build\Lib\tarfile.py", line 845, in _get_filtered_attrs
raise LinkOutsideDestinationError(member, target_path)
tarfile.LinkOutsideDestinationError: 'parent' would link to 'B:\\uildarea\\3.x.ware-win11.nondebug\\build\\build\\test_python_8720æ\\@test_8720_tmpæ-tardir\\outerdir', which is outside the destination
Traceback (most recent call last):
File "b:\uildarea\3.x.ware-win11.nondebug\build\Lib\test\test_wmi.py", line 41, in test_wmi_query_repeated
self.test_wmi_query_os_version()
~~~~~~~~~~~~~~~~~~~~~~~~~~~~~~^^
File "b:\uildarea\3.x.ware-win11.nondebug\build\Lib\test\test_wmi.py", line 29, in test_wmi_query_os_version
r = wmi_exec_query("SELECT Version FROM Win32_OperatingSystem").split("\0")
~~~~~~~~~~~~~~^^^^^^^^^^^^^^^^^^^^^^^^^^^^^^^^^^^^^^^^^^^^^
File "b:\uildarea\3.x.ware-win11.nondebug\build\Lib\test\test_wmi.py", line 17, in wmi_exec_query
return _wmi.exec_query(query)
~~~~~~~~~~~~~~~^^^^^^^
OSError: [WinError -2147024890] The handle is invalid
Traceback (most recent call last):
File "b:\uildarea\3.x.ware-win11.nondebug\build\Lib\test\test_tarfile.py", line 3880, in test_parent_symlink
self.expect_file('parent/evil')
~~~~~~~~~~~~~~~~^^^^^^^^^^^^^^^
File "b:\uildarea\3.x.ware-win11.nondebug\build\Lib\test\test_tarfile.py", line 3745, in expect_file
raise self.raised_exception
File "b:\uildarea\3.x.ware-win11.nondebug\build\Lib\test\test_tarfile.py", line 3718, in check_context
tar.extractall(self.destdir, filter=filter)
~~~~~~~~~~~~~~^^^^^^^^^^^^^^^^^^^^^^^^^^^^^
File "b:\uildarea\3.x.ware-win11.nondebug\build\Lib\tarfile.py", line 2408, in extractall
tarinfo, unfiltered = self._get_extract_tarinfo(
~~~~~~~~~~~~~~~~~~~~~~~~~^
member, filter_function, path)
^^^^^^^^^^^^^^^^^^^^^^^^^^^^^^
File "b:\uildarea\3.x.ware-win11.nondebug\build\Lib\tarfile.py", line 2497, in _get_extract_tarinfo
self._handle_fatal_error(e)
~~~~~~~~~~~~~~~~~~~~~~~~^^^
File "b:\uildarea\3.x.ware-win11.nondebug\build\Lib\tarfile.py", line 2495, in _get_extract_tarinfo
filtered = filter_function(unfiltered, path)
File "b:\uildarea\3.x.ware-win11.nondebug\build\Lib\tarfile.py", line 858, in data_filter
new_attrs = _get_filtered_attrs(member, dest_path, True)
File "b:\uildarea\3.x.ware-win11.nondebug\build\Lib\tarfile.py", line 845, in _get_filtered_attrs
raise LinkOutsideDestinationError(member, target_path)
tarfile.LinkOutsideDestinationError: 'parent' would link to 'B:\\uildarea\\3.x.ware-win11.nondebug\\build\\build\\test_python_12840æ\\@test_12840_tmpæ-tardir\\outerdir', which is outside the destination
Test report
===========
Failed tests:
- test_tarfile
- test_wmi
Failed subtests:
- test_parent_symlink - test.test_tarfile.TestExtractionFilters.test_parent_symlink
- test_wmi_query_repeated - test.test_wmi.WmiTests.test_wmi_query_repeated
Sincerely,
-The Buildbot
1
0
☠ Buildbot (Python): python/cpython - failed test (failure) (main)
by buildbot@python.org Sept. 6, 2025
by buildbot@python.org Sept. 6, 2025
Sept. 6, 2025
The Buildbot has detected a new failure on builder AMD64 Windows11 Refleaks 3.x while building python/cpython.
Full details are available at:
https://buildbot.python.org/#/builders/920/builds/1867
Buildbot URL: https://buildbot.python.org/
Worker for this Build: ware-win11
Build Reason: <unknown>
Blamelist: AN Long <aisk(a)users.noreply.github.com>, Adam Turner <9087854+AA-Turner(a)users.noreply.github.com>, Brett Cannon <brett(a)python.org>, Brian Schubert <brianm.schubert(a)gmail.com>, Christoph Walcher <christoph-wa(a)gmx.de>, Jacob Walls <jacobtylerwalls(a)gmail.com>, Jelle Zijlstra <jelle.zijlstra(a)gmail.com>, Petr Viktorin <encukou(a)gmail.com>, Serhiy Storchaka <storchaka(a)gmail.com>, W. H. Wang <mattwang44(a)gmail.com>, dbXD320 <devanshbaghla320(a)gmail.com>
BUILD FAILED: failed test (failure)
Summary of the results of the build (if available):
===================================================
==
Captured traceback
==================
Traceback (most recent call last):
File "b:\uildarea\3.x.ware-win11.refleak\build\Lib\test\test_tarfile.py", line 3880, in test_parent_symlink
self.expect_file('parent/evil')
~~~~~~~~~~~~~~~~^^^^^^^^^^^^^^^
File "b:\uildarea\3.x.ware-win11.refleak\build\Lib\test\test_tarfile.py", line 3745, in expect_file
raise self.raised_exception
File "b:\uildarea\3.x.ware-win11.refleak\build\Lib\test\test_tarfile.py", line 3718, in check_context
tar.extractall(self.destdir, filter=filter)
~~~~~~~~~~~~~~^^^^^^^^^^^^^^^^^^^^^^^^^^^^^
File "b:\uildarea\3.x.ware-win11.refleak\build\Lib\tarfile.py", line 2408, in extractall
tarinfo, unfiltered = self._get_extract_tarinfo(
~~~~~~~~~~~~~~~~~~~~~~~~~^
member, filter_function, path)
^^^^^^^^^^^^^^^^^^^^^^^^^^^^^^
File "b:\uildarea\3.x.ware-win11.refleak\build\Lib\tarfile.py", line 2497, in _get_extract_tarinfo
self._handle_fatal_error(e)
~~~~~~~~~~~~~~~~~~~~~~~~^^^
File "b:\uildarea\3.x.ware-win11.refleak\build\Lib\tarfile.py", line 2495, in _get_extract_tarinfo
filtered = filter_function(unfiltered, path)
File "b:\uildarea\3.x.ware-win11.refleak\build\Lib\tarfile.py", line 858, in data_filter
new_attrs = _get_filtered_attrs(member, dest_path, True)
File "b:\uildarea\3.x.ware-win11.refleak\build\Lib\tarfile.py", line 845, in _get_filtered_attrs
raise LinkOutsideDestinationError(member, target_path)
tarfile.LinkOutsideDestinationError: 'parent' would link to 'B:\\uildarea\\3.x.ware-win11.refleak\\build\\build\\test_python_12412æ\\@test_12412_tmpæ-tardir\\outerdir', which is outside the destination
Traceback (most recent call last):
File "b:\uildarea\3.x.ware-win11.refleak\build\Lib\test\test_tarfile.py", line 3880, in test_parent_symlink
self.expect_file('parent/evil')
~~~~~~~~~~~~~~~~^^^^^^^^^^^^^^^
File "b:\uildarea\3.x.ware-win11.refleak\build\Lib\test\test_tarfile.py", line 3745, in expect_file
raise self.raised_exception
File "b:\uildarea\3.x.ware-win11.refleak\build\Lib\test\test_tarfile.py", line 3718, in check_context
tar.extractall(self.destdir, filter=filter)
~~~~~~~~~~~~~~^^^^^^^^^^^^^^^^^^^^^^^^^^^^^
File "b:\uildarea\3.x.ware-win11.refleak\build\Lib\tarfile.py", line 2408, in extractall
tarinfo, unfiltered = self._get_extract_tarinfo(
~~~~~~~~~~~~~~~~~~~~~~~~~^
member, filter_function, path)
^^^^^^^^^^^^^^^^^^^^^^^^^^^^^^
File "b:\uildarea\3.x.ware-win11.refleak\build\Lib\tarfile.py", line 2497, in _get_extract_tarinfo
self._handle_fatal_error(e)
~~~~~~~~~~~~~~~~~~~~~~~~^^^
File "b:\uildarea\3.x.ware-win11.refleak\build\Lib\tarfile.py", line 2495, in _get_extract_tarinfo
filtered = filter_function(unfiltered, path)
File "b:\uildarea\3.x.ware-win11.refleak\build\Lib\tarfile.py", line 858, in data_filter
new_attrs = _get_filtered_attrs(member, dest_path, True)
File "b:\uildarea\3.x.ware-win11.refleak\build\Lib\tarfile.py", line 845, in _get_filtered_attrs
raise LinkOutsideDestinationError(member, target_path)
tarfile.LinkOutsideDestinationError: 'parent' would link to 'B:\\uildarea\\3.x.ware-win11.refleak\\build\\build\\test_python_5632æ\\@test_5632_tmpæ-tardir\\outerdir', which is outside the destination
Test report
===========
Failed tests:
- test_tarfile
Failed subtests:
- test_parent_symlink - test.test_tarfile.TestExtractionFilters.test_parent_symlink
Sincerely,
-The Buildbot
1
0
☠ Buildbot (Python): python/cpython - failed test (failure) (main)
by buildbot@python.org Sept. 6, 2025
by buildbot@python.org Sept. 6, 2025
Sept. 6, 2025
The Buildbot has detected a new failure on builder AMD64 Windows Server 2022 NoGIL 3.x while building python/cpython.
Full details are available at:
https://buildbot.python.org/#/builders/1241/builds/6594
Buildbot URL: https://buildbot.python.org/
Worker for this Build: itamaro-win64-srv-22-aws
Build Reason: <unknown>
Blamelist: Brett Cannon <brett(a)python.org>
BUILD FAILED: failed test (failure)
Summary of the results of the build (if available):
===================================================
==
Captured traceback
==================
Traceback (most recent call last):
File "C:\Users\Administrator\buildarea\3.x.itamaro-win64-srv-22-aws.x64.nogil\build\Lib\test\test_launcher.py", line 465, in test_search_major_2
self.assertEqual("PythonCore", data["env.company"])
~~~~~~~~~~~~~~~~^^^^^^^^^^^^^^^^^^^^^^^^^^^^^^^^^^^
AssertionError: 'PythonCore' != 'PythonTestSuite'
- PythonCore
+ PythonTestSuite
Traceback (most recent call last):
File "C:\Users\Administrator\buildarea\3.x.itamaro-win64-srv-22-aws.x64.nogil\build\Lib\test\test_launcher.py", line 511, in test_py_default_short_argv0
data = self.run_py(["--version"], argv=f'{argv0} --version')
File "C:\Users\Administrator\buildarea\3.x.itamaro-win64-srv-22-aws.x64.nogil\build\Lib\test\test_launcher.py", line 254, in run_py
self.assertEqual(expect_returncode, p.returncode)
~~~~~~~~~~~~~~~~^^^^^^^^^^^^^^^^^^^^^^^^^^^^^^^^^
AssertionError: 0 != 103
Traceback (most recent call last):
File "C:\Users\Administrator\buildarea\3.x.itamaro-win64-srv-22-aws.x64.nogil\build\Lib\test\test_launcher.py", line 787, in test_shebang_command_in_venv
data = self.run_py([script], env=env)
File "C:\Users\Administrator\buildarea\3.x.itamaro-win64-srv-22-aws.x64.nogil\build\Lib\test\test_launcher.py", line 254, in run_py
self.assertEqual(expect_returncode, p.returncode)
~~~~~~~~~~~~~~~~^^^^^^^^^^^^^^^^^^^^^^^^^^^^^^^^^
AssertionError: 0 != 103
Traceback (most recent call last):
File "C:\Users\Administrator\buildarea\3.x.itamaro-win64-srv-22-aws.x64.nogil\build\Lib\test\test_launcher.py", line 309, in tearDownClass
delete_registry_data(key, TEST_DATA)
~~~~~~~~~~~~~~~~~~~~^^^^^^^^^^^^^^^^
File "C:\Users\Administrator\buildarea\3.x.itamaro-win64-srv-22-aws.x64.nogil\build\Lib\test\test_launcher.py", line 129, in delete_registry_data
with winreg.OpenKey(root, key, access=ACCESS) as hkey:
~~~~~~~~~~~~~~^^^^^^^^^^^^^^^^^^^^^^^^^^
FileNotFoundError: [WinError 2] The system cannot find the file specified
Traceback (most recent call last):
File "C:\Users\Administrator\buildarea\3.x.itamaro-win64-srv-22-aws.x64.nogil\build\Lib\test\test_launcher.py", line 751, in test_literal_shebang_command
self.assertEqual(
~~~~~~~~~~~~~~~~^
f"TEST_EXE.exe arg1 {quote(script)}",
^^^^^^^^^^^^^^^^^^^^^^^^^^^^^^^^^^^^^
data["stdout"].strip(),
^^^^^^^^^^^^^^^^^^^^^^^
)
^
AssertionError: 'TEST_EXE.exe arg1 C:\\Users\\Administrato[97 chars]p.py' != 'C:\\Users\\Administrator\\buildarea\\3.x.[207 chars]p.py'
- TEST_EXE.exe arg1 C:\Users\Administrator\buildarea\3.x.itamaro-win64-srv-22-aws.x64.nogil\build\build\test_python_6840æ\tmpz5y16zmp.py
+ C:\Users\Administrator\buildarea\3.x.itamaro-win64-srv-22-aws.x64.nogil\build\build\test_python_6840æ\test-command arg1 C:\Users\Administrator\buildarea\3.x.itamaro-win64-srv-22-aws.x64.nogil\build\build\test_python_6840æ\tmpz5y16zmp.py
Traceback (most recent call last):
File "C:\Users\Administrator\buildarea\3.x.itamaro-win64-srv-22-aws.x64.nogil\build\Lib\test\test_launcher.py", line 552, in test_virtualenv_with_env
data2 = self.run_py(["-V:PythonTestSuite/3"], env={**env, "PY_PYTHON": "PythonTestSuite/3"})
File "C:\Users\Administrator\buildarea\3.x.itamaro-win64-srv-22-aws.x64.nogil\build\Lib\test\test_launcher.py", line 254, in run_py
self.assertEqual(expect_returncode, p.returncode)
~~~~~~~~~~~~~~~~^^^^^^^^^^^^^^^^^^^^^^^^^^^^^^^^^
AssertionError: 0 != 103
Traceback (most recent call last):
File "C:\Users\Administrator\buildarea\3.x.itamaro-win64-srv-22-aws.x64.nogil\build\Lib\test\test_launcher.py", line 445, in test_search_major_3
self.assertEqual("PythonCore", data["env.company"])
~~~~~~~~~~~~~~~~^^^^^^^^^^^^^^^^^^^^^^^^^^^^^^^^^^^
AssertionError: 'PythonCore' != 'PythonTestSuite'
- PythonCore
+ PythonTestSuite
Traceback (most recent call last):
File "C:\Users\Administrator\buildarea\3.x.itamaro-win64-srv-22-aws.x64.nogil\build\Lib\test\test_launcher.py", line 652, in test_py_handle_64_in_ini
data = self.run_py([], allow_fail=True, expect_returncode=103)
File "C:\Users\Administrator\buildarea\3.x.itamaro-win64-srv-22-aws.x64.nogil\build\Lib\test\test_launcher.py", line 252, in run_py
raise subprocess.CalledProcessError(p.returncode, [self.py_exe, *args], out, err)
subprocess.CalledProcessError: Command '[WindowsPath('C:/Users/Administrator/buildarea/3.x.itamaro-win64-srv-22-aws.x64.nogil/build/PCbuild/amd64/py_d.exe')]' returned non-zero exit status 0.
Test report
===========
Failed tests:
- test_launcher
Failed subtests:
- tearDownClass - test.test_launcher.TestLauncher
- test_search_major_2 - test.test_launcher.TestLauncher.test_search_major_2
- test_py_handle_64_in_ini - test.test_launcher.TestLauncher.test_py_handle_64_in_ini
- test_virtualenv_with_env - test.test_launcher.TestLauncher.test_virtualenv_with_env
- test_literal_shebang_command - test.test_launcher.TestLauncher.test_literal_shebang_command
- test_py_default_short_argv0 - test.test_launcher.TestLauncher.test_py_default_short_argv0
- test_shebang_command_in_venv - test.test_launcher.TestLauncher.test_shebang_command_in_venv
- test_search_major_3 - test.test_launcher.TestLauncher.test_search_major_3
Sincerely,
-The Buildbot
1
0
☠ Buildbot (Python): python/cpython - failed test (failure) (3.14)
by buildbot@python.org Sept. 6, 2025
by buildbot@python.org Sept. 6, 2025
Sept. 6, 2025
The Buildbot has detected a new failure on builder AMD64 FreeBSD Refleaks 3.14 while building python/cpython.
Full details are available at:
https://buildbot.python.org/#/builders/1800/builds/445
Buildbot URL: https://buildbot.python.org/
Worker for this Build: ware-freebsd
Build Reason: <unknown>
Blamelist: Miss Islington (bot) <31488909+miss-islington(a)users.noreply.github.com>
BUILD FAILED: failed test (failure)
Summary of the results of the build (if available):
===================================================
==
Captured traceback
==================
Traceback (most recent call last):
File "/buildbot/buildarea/3.14.ware-freebsd.refleak/build/Lib/test/support/__init__.py", line 835, in gc_collect
gc.collect()
ResourceWarning: unclosed <socket.socket fd=8, family=2, type=1, proto=6, laddr=('127.0.0.1', 35910), raddr=('127.0.0.1', 35911)>
Task was destroyed but it is pending!
task: <Task pending name='Task-1257' coro=<BaseSelectorEventLoop._accept_connection2() done, defined at /buildbot/buildarea/3.14.ware-freebsd.refleak/build/Lib/asyncio/selector_events.py:217> wait_for=<Future pending cb=[Task.task_wakeup()]>>
Warning -- Unraisable exception
Exception ignored while calling deallocator <function _SelectorTransport.__del__ at 0x8409371d0>:
Traceback (most recent call last):
File "/buildbot/buildarea/3.14.ware-freebsd.refleak/build/Lib/asyncio/selector_events.py", line 873, in __del__
_warn(f"unclosed transport {self!r}", ResourceWarning, source=self)
ResourceWarning: unclosed transport <_SelectorSocketTransport closing fd=8>
k
Traceback (most recent call last):
File "/buildbot/buildarea/3.14.ware-freebsd.refleak/build/Lib/test/support/__init__.py", line 835, in gc_collect
gc.collect()
ResourceWarning: unclosed <socket.socket fd=9, family=2, type=1, proto=6, laddr=('127.0.0.1', 39409), raddr=('127.0.0.1', 39410)>
Task was destroyed but it is pending!
task: <Task pending name='Task-4079' coro=<BaseSelectorEventLoop._accept_connection2() done, defined at /buildbot/buildarea/3.14.ware-freebsd.refleak/build/Lib/asyncio/selector_events.py:217> wait_for=<Future pending cb=[Task.task_wakeup()]>>
Warning -- Unraisable exception
Exception ignored while calling deallocator <function _SelectorTransport.__del__ at 0x842b1b1d0>:
Traceback (most recent call last):
File "/buildbot/buildarea/3.14.ware-freebsd.refleak/build/Lib/asyncio/selector_events.py", line 873, in __del__
_warn(f"unclosed transport {self!r}", ResourceWarning, source=self)
ResourceWarning: unclosed transport <_SelectorSocketTransport closing fd=9>
k
Test report
===========
Sincerely,
-The Buildbot
1
0
☠ Buildbot (Python): python/cpython - failed test (failure) (main)
by buildbot@python.org Sept. 5, 2025
by buildbot@python.org Sept. 5, 2025
Sept. 5, 2025
The Buildbot has detected a new failure on builder AMD64 Windows PGO NoGIL 3.x while building python/cpython.
Full details are available at:
https://buildbot.python.org/#/builders/1622/builds/2571
Buildbot URL: https://buildbot.python.org/
Worker for this Build: itamaro-win64-srv-22-aws
Build Reason: <unknown>
Blamelist: Jacob Walls <jacobtylerwalls(a)gmail.com>, W. H. Wang <mattwang44(a)gmail.com>
BUILD FAILED: failed test (failure)
Summary of the results of the build (if available):
===================================================
==
Captured traceback
==================
Traceback (most recent call last):
File "C:\Users\Administrator\buildarea\3.x.itamaro-win64-srv-22-aws.nogil.pgo\build\Lib\test\test_launcher.py", line 643, in test_py_shebang_invalid_bom
data = self.run_py([script, "-postarg"])
File "C:\Users\Administrator\buildarea\3.x.itamaro-win64-srv-22-aws.nogil.pgo\build\Lib\test\test_launcher.py", line 254, in run_py
self.assertEqual(expect_returncode, p.returncode)
~~~~~~~~~~~~~~~~^^^^^^^^^^^^^^^^^^^^^^^^^^^^^^^^^
AssertionError: 0 != 103
Traceback (most recent call last):
File "C:\Users\Administrator\buildarea\3.x.itamaro-win64-srv-22-aws.nogil.pgo\build\Lib\test\test_launcher.py", line 579, in test_py2_shebang
data = self.run_py([script, "-postarg"])
File "C:\Users\Administrator\buildarea\3.x.itamaro-win64-srv-22-aws.nogil.pgo\build\Lib\test\test_launcher.py", line 254, in run_py
self.assertEqual(expect_returncode, p.returncode)
~~~~~~~~~~~~~~~~^^^^^^^^^^^^^^^^^^^^^^^^^^^^^^^^^
AssertionError: 0 != 103
Traceback (most recent call last):
File "C:\Users\Administrator\buildarea\3.x.itamaro-win64-srv-22-aws.nogil.pgo\build\Lib\test\test_launcher.py", line 465, in test_search_major_2
self.assertEqual("PythonCore", data["env.company"])
~~~~~~~~~~~~~~~~^^^^^^^^^^^^^^^^^^^^^^^^^^^^^^^^^^^
AssertionError: 'PythonCore' != 'PythonTestSuite'
- PythonCore
+ PythonTestSuite
Traceback (most recent call last):
File "C:\Users\Administrator\buildarea\3.x.itamaro-win64-srv-22-aws.nogil.pgo\build\Lib\test\test_launcher.py", line 385, in test_list_paths
self.assertDictEqual(expect, actual)
~~~~~~~~~~~~~~~~~~~~^^^^^^^^^^^^^^^^
AssertionError: {'-V:[238 chars]rv-22-aws.nogil.pgo\\build\\PCbuild\\amd64\\python3.15t.exe'} != {'-V:[238 chars]rv-22-aws.x64.nogil\\build\\PCbuild\\amd64\\python3.15t_d.exe'}
Diff is 727 characters long. Set self.maxDiff to None to see it.
Traceback (most recent call last):
File "C:\Users\Administrator\buildarea\3.x.itamaro-win64-srv-22-aws.nogil.pgo\build\Lib\test\test_launcher.py", line 445, in test_search_major_3
self.assertEqual("PythonCore", data["env.company"])
~~~~~~~~~~~~~~~~^^^^^^^^^^^^^^^^^^^^^^^^^^^^^^^^^^^
AssertionError: 'PythonCore' != 'PythonTestSuite'
- PythonCore
+ PythonTestSuite
Test report
===========
Failed tests:
- test_launcher
Failed subtests:
- test_search_major_2 - test.test_launcher.TestLauncher.test_search_major_2
- test_py_shebang_invalid_bom - test.test_launcher.TestLauncher.test_py_shebang_invalid_bom
- test_py2_shebang - test.test_launcher.TestLauncher.test_py2_shebang
- test_list_paths - test.test_launcher.TestLauncher.test_list_paths
- test_search_major_3 - test.test_launcher.TestLauncher.test_search_major_3
Sincerely,
-The Buildbot
1
0