Traceback (most recent call last):
  File "/srv/buildbot/buildarea/3.x.bolen-ubuntu/build/Lib/test/test_gdb.py", line 890, in test_pycfunction
    self.assertIn('#2 <built-in method gmtime', gdb_output)
AssertionError: '#2 <built-in method gmtime' not found in 'Breakpoint 1 (time_gmtime) pending.\n[Thread debugging using libthread_db enabled]\nUsing host libthread_db library "/lib/x86_64-linux-gnu/libthread_db.so.1".\n\nBreakpoint 1, time_gmtime (self=<module at remote 0x7ffff7f05fb0>, args=(1,)) at ./Modules/timemodule.c:446\n446\t{\n#6 Frame 0x7ffff7f11a50, for file <string>, line 3, in foo ()\n#12 Frame 0x5555557be620, for file <string>, line 5, in bar ()\n#18 Frame 0x5555557be3f0, for file <string>, line 6, in <module> ()\n'

On Wed, 29 May 2019 at 20:02, <buildbot@python.org> wrote:
The Buildbot has detected a failed build on builder ARMv7 Debian buster 3.x while building python/cpython.
Full details are available at:
    https://buildbot.python.org/all/#builders/176/builds/590

Buildbot URL: https://buildbot.python.org/all/

Worker for this Build: gps-ubuntu-exynos5-armv7l

Build Reason: <unknown>
Blamelist: Jeroen Demeyer <J.Demeyer@UGent.be>

BUILD FAILED: failed test (failure)

Sincerely,
 -The Buildbot
_______________________________________________
Buildbot-status mailing list -- buildbot-status@python.org
To unsubscribe send an email to buildbot-status-leave@python.org
https://mail.python.org/mailman3/lists/buildbot-status.python.org/