
The Buildbot has detected a new failure on builder aarch64 Fedora Rawhide 3.x while building python/cpython. Full details are available at: https://buildbot.python.org/all/#builders/339/builds/69
Buildbot URL: https://buildbot.python.org/all/
Worker for this Build: cstratak-fedora-rawhide-aarch64
Build Reason: <unknown> Blamelist: Adorilson Bezerra adorilson@gmail.com, Allen 64019758+aboddie@users.noreply.github.com, Alperen Serkan Aksöz 61659936+Sekomer@users.noreply.github.com, Ammar Askar ammar@ammaraskar.com, Andre Delfino adelfino@gmail.com, Anthony Sottile asottile@umich.edu, Barney Gale barney.gale@gmail.com, Batuhan Taskaya isidentical@gmail.com, Brandt Bucher brandt@python.org, Brett Cannon brett@python.org, Carl Friedrich Bolz-Tereick cfbolz@gmx.de, Christian Heimes christian@python.org, Denis Laxalde denis@laxalde.org, Dennis Sweeney 36520290+sweeneyde@users.noreply.github.com, E-Paine 63801254+E-Paine@users.noreply.github.com, Eric V. Smith ericvsmith@users.noreply.github.com, Erlend Egeberg Aasland erlend.aasland@innova.no, Ethan Furman ethan@stoneleaf.us, Etienne Gautier etienne.gautier@outlook.com, Gabriel R F github@gabrf.com, Géry Ogam gery.ogam@gmail.com, Hai Shi shihai1992@gmail.com, Hristo Venev hristo@venev.name, Inada Naoki <songo facandy@gmail.com>, Irit Katriel iritkatriel@yahoo.com, Jason R. Coombs jaraco@jaraco.com, Joonas Paalasmaa joonas.paalasmaa@wolt.com, JunWei Song sungboss2004@gmail.com, Ken Jin 28750310+Fidget-Spinner@users.noreply.github.com, Llandy Riveron Del Risco llandy3d@gmail.com, Lumír 'Frenzy' Balhar frenzy.madness@gmail.com, M. Kocher michael.kocher@me.com, Ma Lin animalize@users.noreply.github.com, Mark Shannon mark@hotpy.org, Ned Batchelder ned@nedbatchelder.com, Ned Deily nad@python.org, Nick Coghlan ncoghlan@gmail.com, Pablo Galindo Pablogsal@gmail.com, Paul Moore p.f.moore@gmail.com, Petr Viktorin encukou@gmail.com, Raymond Hettinger rhettinger@users.noreply.github.com, Ryan Hileman lunixbochs@gmail.com, Saiyang Gou gousaiyang@163.com, Segev Finer segev208@gmail.com, Senthil Kumaran senthil@uthcode.com, Sergey Fedoseev fedoseev.sergey@gmail.com, Serhiy Storchaka storchaka@gmail.com, Shreyan Avigyan shreyan.avigyan@gmail.com, Simon Cha rette charette.s@gmail.com, Steve Dower steve.dower@python.org, Stéphane Bidoul stephane.bidoul@acsone.eu, Sviatoslav Sydorenko wk@sydorenko.org.ua, Tal Einat 532281+taleinat@users.noreply.github.com, Taneli Hukkinen hukkinj1@users.noreply.github.com, Terry Jan Reedy tjreedy@udel.edu, Tymoteusz Wołodźko twolodzko@users.noreply.github.com, Tzu-ping Chung uranusjr@gmail.com, Victor Stinner vstinner@python.org, Zackery Spytz zspytz@gmail.com, juhovh juhovh@iki.fi, kfollstad kfollstad@gmail.com, l0x 37248016+l0x-c0d3z@users.noreply.github.com, larryhastings larry@hastings.org, sblondon sblondon@users.noreply.github.com, scoder stefan_ml@behnel.de, uy-rrodriguez 5296200+uy-rrodriguez@users.noreply.github.com
BUILD FAILED: failed test (failure) clean (failure)
Summary of the results of the build (if available):
== Tests result: FAILURE then FAILURE ==
412 tests OK.
10 slowest tests:
- test_concurrent_futures: 4 min 8 sec
- test_peg_generator: 3 min 29 sec
- test_unparse: 2 min 45 sec
- test_multiprocessing_spawn: 2 min 42 sec
- test_capi: 2 min 35 sec
- test_tokenize: 2 min 15 sec
- test_asyncio: 1 min 56 sec
- test_lib2to3: 1 min 48 sec
- test_multiprocessing_forkserver: 1 min 36 sec
- test_gdb: 1 min 32 sec
2 tests failed: test_datetime test_zoneinfo
13 tests skipped: test_devpoll test_ioctl test_kqueue test_msilib test_ossaudiodev test_startfile test_tix test_tk test_ttk_guionly test_winconsoleio test_winreg test_winsound test_zipfile64
2 re-run tests: test_datetime test_zoneinfo
Total duration: 6 min 54 sec
Captured traceback
Traceback (most recent call last): File "/home/buildbot/buildarea/3.x.cstratak-fedora-rawhide-aarch64/build/Lib/test/datetimetester.py", line 503, in test_constructor eq(td(milliseconds=1), td(microseconds=1000)) AssertionError: datetime.timedelta(microseconds=1000) != datetime.timedelta(microseconds=3000)
Traceback (most recent call last): File "/home/buildbot/buildarea/3.x.cstratak-fedora-rawhide-aarch64/build/Lib/test/datetimetester.py", line 526, in test_computations eq(-c, td(-1, 24*3600 - 1, 999000)) AssertionError: datetime.timedelta(days=-1, seconds=86399, microseconds=997000) != datetime.timedelta(seconds=1, microseconds=997000)
Traceback (most recent call last): File "/home/buildbot/buildarea/3.x.cstratak-fedora-rawhide-aarch64/build/Lib/test/datetimetester.py", line 676, in test_pickling self.assertEqual(orig, derived) AssertionError: datetime.timedelta(days=12, seconds=34, microseconds=168) != datetime.timedelta(days=12, seconds=34, microseconds=504)
Traceback (most recent call last): File "/home/buildbot/buildarea/3.x.cstratak-fedora-rawhide-aarch64/build/Lib/test/datetimetester.py", line 626, in test_basic_attributes self.assertEqual(td.microseconds, us) AssertionError: 93 != 31
Traceback (most recent call last): File "/home/buildbot/buildarea/3.x.cstratak-fedora-rawhide-aarch64/build/Lib/test/datetimetester.py", line 409, in test_offset_boundaries timezone(delta) ValueError: offset must be a timedelta strictly between -timedelta(hours=24) and timedelta(hours=24), not datetime.timedelta(days=1, seconds=1, microseconds=999997).
Traceback (most recent call last): File "/home/buildbot/buildarea/3.x.cstratak-fedora-rawhide-aarch64/build/Lib/test/datetimetester.py", line 3275, in test_isoformat_timezone assert t.isoformat() == exp AssertionError
Traceback (most recent call last): File "/home/buildbot/buildarea/3.x.cstratak-fedora-rawhide-aarch64/build/Lib/test/datetimetester.py", line 320, in test_tzname self.assertEqual('UTC+01:06:40.000001', AssertionError: 'UTC+01:06:40.000001' != 'UTC+01:06:40.000003'
- UTC+01:06:40.000001
? ^
- UTC+01:06:40.000003
? ^
Traceback (most recent call last): File "/home/buildbot/buildarea/3.x.cstratak-fedora-rawhide-aarch64/build/Lib/test/datetimetester.py", line 733, in test_str eq(str(td(microseconds=3)), "0:00:00.000003") AssertionError: '0:00:00.000009' != '0:00:00.000003'
- 0:00:00.000009
? ^
- 0:00:00.000003
? ^
Traceback (most recent call last): File "/home/buildbot/buildarea/3.x.cstratak-fedora-rawhide-aarch64/build/Lib/test/datetimetester.py", line 658, in test_hash_equality self.assertEqual(hash(t1), hash(t2)) AssertionError: -1699877187250727576 != 3010437511937009226
Traceback (most recent call last): File "/home/buildbot/buildarea/3.x.cstratak-fedora-rawhide-aarch64/build/Lib/test/datetimetester.py", line 2128, in test_tz_independent_comparing dt2 = dt1 + us OverflowError: date value out of range
Traceback (most recent call last): File "/home/buildbot/buildarea/3.x.cstratak-fedora-rawhide-aarch64/build/Lib/test/datetimetester.py", line 1544, in test_extreme_timedelta self.assertEqual(big, justasbig) AssertionError: datetime.timedelta(days=3652058) != datetime.timedelta(days=10956174)
Traceback (most recent call last): File "/home/buildbot/buildarea/3.x.cstratak-fedora-rawhide-aarch64/build/Lib/test/datetimetester.py", line 848, in test_massive_normalization self.assertEqual((td.days, td.seconds, td.microseconds), AssertionError: Tuples differ: (-1, 86399, 999997) != (-1, 86399, 999999)
Traceback (most recent call last): File "/home/buildbot/buildarea/3.x.cstratak-fedora-rawhide-aarch64/build/Lib/test/datetimetester.py", line 759, in test_roundtrip for td in (timedelta(days=999999999, hours=23, minutes=59, OverflowError: days=1000000000; must have magnitude <= 999999999
Traceback (most recent call last): File "/home/buildbot/buildarea/3.x.cstratak-fedora-rawhide-aarch64/build/Lib/test/datetimetester.py", line 2678, in test_more_strftime self.assertEqual(t.strftime("%z"), "-0200" + z) AssertionError: '-020033.000369' != '-020033.000123'
- -020033.000369
? --
- -020033.000123
? ++
Traceback (most recent call last): File "/home/buildbot/buildarea/3.x.cstratak-fedora-rawhide-aarch64/build/Lib/test/datetimetester.py", line 2260, in test_computations self.assertEqual(a + (week + day + hour + millisec), AssertionError: SubclassDatetime(2002, 3, 10, 18, 6, 0, 3000) != SubclassDatetime(2002, 3, 10, 18, 6, 0, 1000)
Traceback (most recent call last): File "/home/buildbot/buildarea/3.x.cstratak-fedora-rawhide-aarch64/build/Lib/test/datetimetester.py", line 745, in test_repr self.assertEqual(repr(self.theclass(-10, 2, 400000)), AssertionError: 'datetime.timedelta(days=-10, seconds=3, microseconds=200000)' != 'datetime.timedelta(days=-10, seconds=2, microseconds=400000)'
- datetime.timedelta(days=-10, seconds=3, microseconds=200000)
? ^ ^
- datetime.timedelta(days=-10, seconds=2, microseconds=400000)
? ^ ^
Traceback (most recent call last): File "/home/buildbot/buildarea/3.x.cstratak-fedora-rawhide-aarch64/build/Lib/test/datetimetester.py", line 2067, in test_isoformat_timezone assert dt.isoformat() == exp AssertionError
Traceback (most recent call last): File "/home/buildbot/buildarea/3.x.cstratak-fedora-rawhide-aarch64/build/Lib/test/test_zoneinfo/test_zoneinfo.py", line 452, in test_fold_mutate dt_fromutc = zi.fromutc(dt) ValueError: fold must be either 0 or 1
Traceback (most recent call last): File "/home/buildbot/buildarea/3.x.cstratak-fedora-rawhide-aarch64/build/Lib/test/test_zoneinfo/test_zoneinfo.py", line 378, in test_folds_from_utc dt_after = dt_after_utc.astimezone(zi) ValueError: fold must be either 0 or 1
Traceback (most recent call last): File "/home/buildbot/buildarea/3.x.cstratak-fedora-rawhide-aarch64/build/Lib/test/datetimetester.py", line 2260, in test_computations self.assertEqual(a + (week + day + hour + millisec), AssertionError: datetime.datetime(2002, 3, 10, 18, 6, 0, 3000) != datetime.datetime(2002, 3, 10, 18, 6, 0, 1000)
Traceback (most recent call last): File "/home/buildbot/buildarea/3.x.cstratak-fedora-rawhide-aarch64/build/Lib/test/datetimetester.py", line 648, in test_carries self.assertEqual(t1, t2) AssertionError: datetime.timedelta(seconds=336, microseconds=3) != datetime.timedelta(microseconds=3)
Traceback (most recent call last): File "/home/buildbot/buildarea/3.x.cstratak-fedora-rawhide-aarch64/build/Lib/test/datetimetester.py", line 822, in test_microsecond_rounding eq(td(milliseconds=0.6/1000), td(microseconds=1)) AssertionError: datetime.timedelta(microseconds=1) != datetime.timedelta(microseconds=3)
Traceback (most recent call last): File "/home/buildbot/buildarea/3.x.cstratak-fedora-rawhide-aarch64/build/Lib/test/datetimetester.py", line 782, in test_resolution_info self.assertEqual(timedelta.max, timedelta(999999999, 24*3600-1, 1e6-1)) OverflowError: days=1000000000; must have magnitude <= 999999999
Traceback (most recent call last): File "/home/buildbot/buildarea/3.x.cstratak-fedora-rawhide-aarch64/build/Lib/test/datetimetester.py", line 409, in test_offset_boundaries timezone(delta) ValueError: offset must be a timedelta strictly between -timedelta(hours=24) and timedelta(hours=24), not datetime.timedelta(days=-2, seconds=86398, microseconds=3).
Traceback (most recent call last): File "/home/buildbot/buildarea/3.x.cstratak-fedora-rawhide-aarch64/build/Lib/test/datetimetester.py", line 1544, in test_extreme_timedelta self.assertEqual(big, justasbig) AssertionError: datetime.timedelta(days=3652058, seconds=86399, microseconds=999999) != datetime.timedelta(days=10956176, seconds=86399, microseconds=999997)
Test report
Failed tests:
- test_datetime
- test_zoneinfo
Failed subtests:
- test_resolution_info - test.datetimetester.TestTimeDelta_Fast
- test_roundtrip - test.datetimetester.TestTimeDelta_Fast
- test_computations - test.datetimetester.TestDateTime_Fast
- test_isoformat_timezone - test.datetimetester.TestTime_Fast
- test_extreme_timedelta - test.datetimetester.TestDateTime_Fast
- test_constructor - test.datetimetester.TestTimeDelta_Fast
- test_repr - test.datetimetester.TestTimeDelta_Fast
- test_tz_independent_comparing - test.datetimetester.TestDateTimeTZ_Fast
- test_isoformat_timezone - test.datetimetester.TestDateTimeTZ_Fast
- test_microsecond_rounding - test.datetimetester.TestTimeDelta_Fast
- test_more_strftime - test.datetimetester.TestDateTimeTZ_Fast
- test_massive_normalization - test.datetimetester.TestTimeDelta_Fast
- test_tz_independent_comparing - test.datetimetester.TestSubclassDateTime_Fast
- test_carries - test.datetimetester.TestTimeDelta_Fast
- test_offset_boundaries - test.datetimetester.TestTimeZone_Fast
- test_computations - test.datetimetester.TestTimeDelta_Fast
- test_isoformat_timezone - test.datetimetester.TestSubclassDateTime_Fast
- test_tz_independent_comparing - test.datetimetester.TestDateTime_Fast
- test_tzname - test.datetimetester.TestTimeZone_Fast
- test_folds_from_utc - test.test_zoneinfo.test_zoneinfo.CZoneInfoDatetimeSubclassTest
- test_isoformat_timezone - test.datetimetester.TestDateTime_Fast
- test_more_strftime - test.datetimetester.TestSubclassDateTime_Fast
- test_str - test.datetimetester.TestTimeDelta_Fast
- test_isoformat_timezone - test.datetimetester.TestTimeTZ_Fast
- test_hash_equality - test.datetimetester.TestTimeDelta_Fast
- test_more_strftime - test.datetimetester.TestDateTime_Fast
- test_extreme_timedelta - test.datetimetester.TestDate_Fast
- test_extreme_timedelta - test.datetimetester.TestDateTimeTZ_Fast
- test_computations - test.datetimetester.TestDateTimeTZ_Fast
- test_pickling - test.datetimetester.TestTimeDelta_Fast
- test_extreme_timedelta - test.datetimetester.TestSubclassDateTime_Fast
- test_computations - test.datetimetester.TestSubclassDateTime_Fast
- test_basic_attributes - test.datetimetester.TestTimeDelta_Fast
Sincerely, -The Buildbot