Traceback (most recent call last):
  File "/srv/buildbot/buildarea/3.x.bolen-ubuntu/build/Lib/test/", line 890, in test_pycfunction
    self.assertIn('#2 <built-in method gmtime', gdb_output)
AssertionError: '#2 <built-in method gmtime' not found in 'Breakpoint 1 (time_gmtime) pending.\n[Thread debugging using libthread_db enabled]\nUsing host libthread_db library "/lib/x86_64-linux-gnu/".\n\nBreakpoint 1, time_gmtime (self=<module at remote 0x7ffff7f05fb0>, args=(1,)) at ./Modules/timemodule.c:446\n446\t{\n#6 Frame 0x7ffff7f11a50, for file <string>, line 3, in foo ()\n#12 Frame 0x5555557be620, for file <string>, line 5, in bar ()\n#18 Frame 0x5555557be3f0, for file <string>, line 6, in <module> ()\n'

On Wed, 29 May 2019 at 19:45, <> wrote:
The Buildbot has detected a failed build on builder AMD64 Fedora Rawhide 3.x while building python/cpython.
Full details are available at:

Buildbot URL:

Worker for this Build: cstratak-fedora

Build Reason: <unknown>
Blamelist: Jeroen Demeyer <>

BUILD FAILED: failed test (failure)

 -The Buildbot
Buildbot-status mailing list --
To unsubscribe send an email to