Tests result: FAILURE then FAILURE
test test_urllibnet failed -- Traceback (most recent call last):
  File "D:\cygwin\home\db3l\buildarea\2.7.bolen-windows7\build\lib\test\test_urllibnet.py", line 232, in test_multiple_ftp_retrieves
    "multiple times.\n Error message was : %s" % e)
AssertionError: Failed FTP retrieve while accessing ftp url multiple times.
 Error message was : [Errno 13] Permission denied: 'd:\\temp\\tmpiuquqa'


On Tue, 31 Dec 2019 at 05:24, <buildbot@python.org> wrote:
The Buildbot has detected a failed build on builder AMD64 Windows7 SP1 VS9.0 2.7 while building python/cpython.
Full details are available at:

Buildbot URL: https://buildbot.python.org/all/

Worker for this Build: kloth-win64

Build Reason: <unknown>
Blamelist: Benjamin Peterson <benjamin@python.org>, Senthil Kumaran <orsenthil@gmail.com>

BUILD FAILED: failed test (failure)

 -The Buildbot
Buildbot-status mailing list -- buildbot-status@python.org
To unsubscribe send an email to buildbot-status-leave@python.org