New builds work correctly. Seem transient error when compiling. bad filesystem/file/checkout??

"D:\buildarea\2.7.bolen-windows8\build\PCbuild\pcbuild.proj" (Build target) (1) ->
"D:\buildarea\2.7.bolen-windows8\build\PCbuild\_ctypes.vcxproj" (Build target) (8) ->
(ClCompile target) -> 
  ..\Modules\_ctypes\libffi_msvc\ffi.c(225): error C2143: syntax error : missing ';' before 'type' [D:\buildarea\2.7.bolen-windows8\build\PCbuild\_ctypes.vcxproj]
  ..\Modules\_ctypes\libffi_msvc\ffi.c(225): error C2143: syntax error : missing ';' before 'type' [D:\buildarea\2.7.bolen-windows8\build\PCbuild\_ctypes.vcxproj]
  ..\Modules\_ctypes\libffi_msvc\ffi.c(225): error C2143: syntax error : missing ')' before 'type' [D:\buildarea\2.7.bolen-windows8\build\PCbuild\_ctypes.vcxproj]
  ..\Modules\_ctypes\libffi_msvc\ffi.c(225): error C2143: syntax error : missing ';' before 'type' [D:\buildarea\2.7.bolen-windows8\build\PCbuild\_ctypes.vcxproj]
  ..\Modules\_ctypes\libffi_msvc\ffi.c(225): error C2065: 'i' : undeclared identifier [D:\buildarea\2.7.bolen-windows8\build\PCbuild\_ctypes.vcxproj]
  ..\Modules\_ctypes\libffi_msvc\ffi.c(225): error C2065: 'i' : undeclared identifier [D:\buildarea\2.7.bolen-windows8\build\PCbuild\_ctypes.vcxproj]
  ..\Modules\_ctypes\libffi_msvc\ffi.c(225): error C2059: syntax error : ')' [D:\buildarea\2.7.bolen-windows8\build\PCbuild\_ctypes.vcxproj]
  ..\Modules\_ctypes\libffi_msvc\ffi.c(225): error C2143: syntax error : missing ';' before '{' [D:\buildarea\2.7.bolen-windows8\build\PCbuild\_ctypes.vcxproj]
  ..\Modules\_ctypes\libffi_msvc\ffi.c(226): error C2065: 'i' : undeclared identifier [D:\buildarea\2.7.bolen-windows8\build\PCbuild\_ctypes.vcxproj]
  ..\Modules\_ctypes\libffi_msvc\ffi.c(229): error C2065: 'i' : undeclared identifier [D:\buildarea\2.7.bolen-windows8\build\PCbuild\_ctypes.vcxproj]
  ..\Modules\_ctypes\libffi_msvc\ffi.c(230): error C2065: 'i' : undeclared identifier [D:\buildarea\2.7.bolen-windows8\build\PCbuild\_ctypes.vcxproj]


On Thu, 2 Aug 2018 at 15:49, <buildbot@python.org> wrote:
The Buildbot has detected a failed build on builder AMD64 Windows8 2.7 while building python/cpython.
Full details are available at:
    https://buildbot.python.org/all/#builders/74/builds/194

Buildbot URL: https://buildbot.python.org/all/

Worker for this Build: bolen-windows8

Build Reason: <unknown>
Blamelist: Victor Stinner <vstinner@redhat.com>

BUILD FAILED: failed compile (failure) clean (failure)

Sincerely,
 -The Buildbot
_______________________________________________
Buildbot-status mailing list -- buildbot-status@python.org
To unsubscribe send an email to buildbot-status-leave@python.org
https://mail.python.org/mm3/mailman3/lists/buildbot-status.python.org/