☠ Buildbot (Python): python/cpython - failed test (failure) (main)
The Buildbot has detected a new failure on builder AMD64 FreeBSD 3.x while building python/cpython. Full details are available at: https://buildbot.python.org/all/#/builders/1223/builds/696
Buildbot URL: https://buildbot.python.org/all/
Worker for this Build: ware-freebsd
Build Reason: <unknown> Blamelist: Anthony Shaw <anthony.p.shaw@gmail.com>
BUILD FAILED: failed test (failure)
Summary of the results of the build (if available):
==
Captured traceback
Traceback (most recent call last): File "<frozen getpath>", line 352, in <module> ValueError: embedded null byte Warning -- Uncaught thread exception: RuntimeError Exception in thread Thread-119 (task): RuntimeError: error evaluating path
Traceback (most recent call last): File "/buildbot/buildarea/3.x.ware-freebsd/build/Lib/threading.py", line 1083, in _bootstrap_inner self.run() File "/buildbot/buildarea/3.x.ware-freebsd/build/Lib/threading.py", line 1020, in run self._target(*self._args, **self._kwargs) File "/buildbot/buildarea/3.x.ware-freebsd/build/Lib/test/test_interpreters.py", line 595, in task interp = interpreters.create() ^^^^^^^^^^^^^^^^^^^^^ File "/buildbot/buildarea/3.x.ware-freebsd/build/Lib/test/support/interpreters.py", line 26, in create id = _interpreters.create(isolated=isolated) ^^^^^^^^^^^^^^^^^^^^^^^^^^^^^^^^^^^^^^^ RuntimeError: interpreter creation failed k
Test report
Failed tests:
- test_interpreters
Sincerely, -The Buildbot
participants (1)
-
buildbot@python.org