☠ Buildbot (Python): python/cpython - failed test (failure) (3.14)
The Buildbot has detected a new failure on builder s390x Fedora Stable Refleaks 3.14 while building python/cpython. Full details are available at: https://buildbot.python.org/#/builders/1776/builds/1264
Buildbot URL: https://buildbot.python.org/
Worker for this Build: cstratak-fedora-stable-s390x
Build Reason: <unknown> Blamelist: Gregory P. Smith <68491+gpshead@users.noreply.github.com>, Miss Islington (bot) <31488909+miss-islington@users.noreply.github.com>, Łukasz Langa <lukasz@langa.pl>
BUILD FAILED: failed test (failure)
Summary of the results of the build (if available):
==
Captured traceback
Traceback (most recent call last): File "/var/lib/buildbot/worker/cstratak-fedora-stable-s390x/3.14.cstratak-fedora-stable-s390x.refleak/build/Lib/test/test_external_inspection.py", line 1289, in test_only_active_thread self.assertEqual( ~~~~~~~~~~~~~~~~^ len(gil_traces), 1, "Should have exactly one GIL holder" ^^^^^^^^^^^^^^^^^^^^^^^^^^^^^^^^^^^^^^^^^^^^^^^^^^^^^^^^ ) ^ AssertionError: 0 != 1 : Should have exactly one GIL holder
Test report
Failed tests:
- test_external_inspection
Failed subtests:
- test_only_active_thread - test.test_external_inspection.TestGetStackTrace.test_only_active_thread
Sincerely, -The Buildbot
participants (1)
-
buildbot@python.org