☠ Buildbot (Python): python/cpython - failed test (failure) (3.14)
The Buildbot has detected a new failure on builder AMD64 FreeBSD Refleaks 3.14 while building python/cpython. Full details are available at: https://buildbot.python.org/#/builders/1800/builds/690
Buildbot URL: https://buildbot.python.org/
Worker for this Build: ware-freebsd
Build Reason: <unknown> Blamelist: Miss Islington (bot) <31488909+miss-islington@users.noreply.github.com>
BUILD FAILED: failed test (failure)
Summary of the results of the build (if available):
==
Captured traceback
Traceback (most recent call last): File "/buildbot/buildarea/3.14.ware-freebsd.refleak/build/Lib/test/support/__init__.py", line 847, in gc_collect gc.collect() ResourceWarning: unclosed file <_io.FileIO name=11 mode='wb' closefd=True> .test_cancel_make_subprocess_transport_exec (test.test_asyncio.test_subprocess.SubprocessPidfdWatcherTests.test_cancel_make_subprocess_transport_exec) ... skipped 'operating system does not support pidfds'
Traceback (most recent call last): File "/buildbot/buildarea/3.14.ware-freebsd.refleak/build/Lib/concurrent/futures/thread.py", line 99, in _worker ctx.initialize() ~~~~~~~~~~~~~~^^ File "/buildbot/buildarea/3.14.ware-freebsd.refleak/build/Lib/concurrent/futures/interpreter.py", line 61, in initialize self.interp = interpreters.create() ~~~~~~~~~~~~~~~~~~~^^ File "/buildbot/buildarea/3.14.ware-freebsd.refleak/build/Lib/concurrent/interpreters/__init__.py", line 65, in create id = _interpreters.create(reqrefs=True) concurrent.interpreters.InterpreterError: interpreter creation failed Timeout (0:45:00)! Thread 0x0000000843371900 [InterpreterPoolExec] (most recent call first): File "/buildbot/buildarea/3.14.ware-freebsd.refleak/build/Lib/concurrent/interpreters/__init__.py", line 220 in _call File "/buildbot/buildarea/3.14.ware-freebsd.refleak/build/Lib/concurrent/interpreters/__init__.py", line 238 in call File "/buildbot/buildarea/3.14.ware-freebsd.refleak/build/Lib/concurrent/futures/interpreter.py", line 84 in run File "/buildbot/buildarea/3.14.ware-freebsd.refleak/build/Lib/concurrent/futures/thread.py", line 86 in run File "/buildbot/buildarea/3.14.ware-freebsd.refleak/build/Lib/concurrent/futures/thread.py", line 119 in _worker File "/buildbot/buildarea/3.14.ware-freebsd.refleak/build/Lib/threading.py", line 1024 in run File "/buildbot/buildarea/3.14.ware-freebsd.refleak/build/Lib/threading.py", line 1082 in _bootstrap_inner File "/buildbot/buildarea/3.14.ware-freebsd.refleak/build/Lib/threading.py", line 1044 in _bootstrap
Traceback (most recent call last): File "<frozen importlib._bootstrap>", line 1371, in _find_and_load File "<frozen importlib._bootstrap>", line 1333, in _find_and_load_unlocked File "<frozen importlib._bootstrap>", line 1267, in _find_spec File "<frozen importlib._bootstrap_external>", line 1296, in find_spec File "<frozen importlib._bootstrap_external>", line 1270, in _get_spec File "<frozen importlib._bootstrap_external>", line 1388, in find_spec File "<frozen importlib._bootstrap_external>", line 166, in _path_isfile File "<frozen importlib._bootstrap_external>", line 158, in _path_is_mode_type File "<frozen importlib._bootstrap_external>", line 152, in _path_stat ValueError: embedded null byte Exception in initializer: RuntimeError: Failed to import encodings module
Traceback (most recent call last): File "/buildbot/buildarea/3.14.ware-freebsd.refleak/build/Lib/test/support/__init__.py", line 847, in gc_collect gc.collect() ResourceWarning: unclosed file <_io.FileIO name=11 mode='wb' closefd=True> .test_cancel_make_subprocess_transport_exec (test.test_asyncio.test_subprocess.SubprocessPidfdWatcherTests.test_cancel_make_subprocess_transport_exec) ... skipped 'operating system does not support pidfds'
Test report
Failed tests:
- test.test_concurrent_futures.test_interpreter_pool
Sincerely, -The Buildbot
participants (1)
-
buildbot@python.org