☠ Buildbot (Python): python/cpython - failed test (failure) uploading test-results.xml (failure) (3.11)
The Buildbot has detected a new failure on builder s390x Fedora Rawhide LTO + PGO 3.11 while building python/cpython. Full details are available at: https://buildbot.python.org/all/#/builders/1037/builds/869
Buildbot URL: https://buildbot.python.org/all/
Worker for this Build: edelsohn-fedora-rawhide-z
Build Reason: <unknown> Blamelist: Alex Waygood <Alex.Waygood@Gmail.com>, Charlie Zhao <zhaoyu_hit@qq.com>, Erlend E. Aasland <erlend@python.org>, Hugo van Kemenade <hugovk@users.noreply.github.com>, Miss Islington (bot) <31488909+miss-islington@users.noreply.github.com>, Ned Deily <nad@python.org>, Serhiy Storchaka <storchaka@gmail.com>, Tomas R <tomas.roun8@gmail.com>, Victor Stinner <vstinner@python.org>, da-woods <dw-git@d-woods.co.uk>, justdan6 <134341009+justdan6@users.noreply.github.com>, Łukasz Langa <lukasz@langa.pl>
BUILD FAILED: failed test (failure) uploading test-results.xml (failure)
Summary of the results of the build (if available):
==
Captured traceback
Traceback (most recent call last): File "/home/dje/cpython-buildarea/3.11.edelsohn-fedora-rawhide-z.lto-pgo/build/Lib/multiprocessing/resource_tracker.py", line 209, in main cache[rtype].remove(name) KeyError: '/psm_4dcab22d'
Traceback (most recent call last): File "/home/dje/cpython-buildarea/3.11.edelsohn-fedora-rawhide-z.lto-pgo/build/Lib/multiprocessing/resource_tracker.py", line 209, in main cache[rtype].remove(name) KeyError: '/psm_1b8d32c9'
Traceback (most recent call last): File "/home/dje/cpython-buildarea/3.11.edelsohn-fedora-rawhide-z.lto-pgo/build/Lib/multiprocessing/resource_tracker.py", line 209, in main cache[rtype].remove(name) KeyError: '/psm_7797a86f'
Test report
Failed tests:
- test_tools
Sincerely, -The Buildbot
participants (1)
-
buildbot@python.org