Buildbot failure in Python on aarch64 Fedora Rawhide Refleaks 3.x
The Buildbot has detected a new failure on builder aarch64 Fedora Rawhide Refleaks 3.x while building Python. Full details are available at: https://buildbot.python.org/all/#builders/290/builds/309
Buildbot URL: https://buildbot.python.org/all/
Worker for this Build: cstratak-fedora-rawhide-aarch64
Build Reason: <unknown> Blamelist:
BUILD FAILED: failed test (failure)
Summary of the results of the build (if available):
== Tests result: FAILURE then FAILURE ==
407 tests OK.
10 slowest tests:
- test_asyncio: 2 hour 22 min
- test_signal: 31 min 14 sec
- test_pydoc: 30 min 2 sec
- test_peg_generator: 23 min 27 sec
- test_concurrent_futures: 21 min 59 sec
- test_multiprocessing_spawn: 17 min 28 sec
- test_multiprocessing_forkserver: 11 min 3 sec
- test_zipfile: 8 min 40 sec
- test_nntplib: 8 min 1 sec
- test_lib2to3: 7 min 40 sec
4 tests failed: test_asyncgen test_asyncio test_coroutines test_unittest
14 tests skipped: test_devpoll test_gdb test_ioctl test_kqueue test_msilib test_ossaudiodev test_startfile test_tix test_tk test_ttk_guionly test_winconsoleio test_winreg test_winsound test_zipfile64
5 re-run tests: test_asyncgen test_asyncio test_coroutines test_glob test_unittest
Total duration: 4 hour 57 min
Captured traceback
Traceback (most recent call last): File "/home/buildbot/buildarea/3.x.cstratak-fedora-rawhide-aarch64.refleak/build/Lib/multiprocessing/util.py", line 300, in _run_finalizers finalizer() File "/home/buildbot/buildarea/3.x.cstratak-fedora-rawhide-aarch64.refleak/build/Lib/multiprocessing/util.py", line 224, in __call__ res = self._callback(*self._args, **self._kwargs) File "/home/buildbot/buildarea/3.x.cstratak-fedora-rawhide-aarch64.refleak/build/Lib/multiprocessing/synchronize.py", line 87, in _cleanup sem_unlink(name) FileNotFoundError: [Errno 2] No such file or directory Traceback (most recent call last): File "/home/buildbot/buildarea/3.x.cstratak-fedora-rawhide-aarch64.refleak/build/Lib/multiprocessing/util.py", line 300, in _run_finalizers finalizer() File "/home/buildbot/buildarea/3.x.cstratak-fedora-rawhide-aarch64.refleak/build/Lib/multiprocessing/util.py", line 224, in __call__ res = self._callback(*self._args, **self._kwargs) File "/home/buildbot/buildarea/3.x.cstratak-fedora-rawhide-aarch64.refleak/build/Lib/multiprocessing/synchronize.py", line 87, in _cleanup sem_unlink(name) FileNotFoundError: [Errno 2] No such file or directory Traceback (most recent call last): File "/home/buildbot/buildarea/3.x.cstratak-fedora-rawhide-aarch64.refleak/build/Lib/multiprocessing/util.py", line 300, in _run_finalizers finalizer() File "/home/buildbot/buildarea/3.x.cstratak-fedora-rawhide-aarch64.refleak/build/Lib/multiprocessing/util.py", line 224, in __call__ res = self._callback(*self._args, **self._kwargs) File "/home/buildbot/buildarea/3.x.cstratak-fedora-rawhide-aarch64.refleak/build/Lib/multiprocessing/synchronize.py", line 87, in _cleanup sem_unlink(name) FileNotFoundError: [Errno 2] No such file or directory Traceback (most recent call last): File "/home/buildbot/buildarea/3.x.cstratak-fedora-rawhide-aarch64.refleak/build/Lib/multiprocessing/util.py", line 300, in _run_finalizers finalizer() File "/home/buildbot/buildarea/3.x.cstratak-fedora-rawhide-aarch64.refleak/build/Lib/multiprocessing/util.py", line 224, in __call__ res = self._callback(*self._args, **self._kwargs) File "/home/buildbot/buildarea/3.x.cstratak-fedora-rawhide-aarch64.refleak/build/Lib/multiprocessing/synchronize.py", line 87, in _cleanup sem_unlink(name) FileNotFoundError: [Errno 2] No such file or directory Traceback (most recent call last): File "/home/buildbot/buildarea/3.x.cstratak-fedora-rawhide-aarch64.refleak/build/Lib/multiprocessing/util.py", line 300, in _run_finalizers finalizer() File "/home/buildbot/buildarea/3.x.cstratak-fedora-rawhide-aarch64.refleak/build/Lib/multiprocessing/util.py", line 224, in __call__ res = self._callback(*self._args, **self._kwargs) File "/home/buildbot/buildarea/3.x.cstratak-fedora-rawhide-aarch64.refleak/build/Lib/multiprocessing/synchronize.py", line 87, in _cleanup sem_unlink(name) FileNotFoundError: [Errno 2] No such file or directory Traceback (most recent call last): File "/home/buildbot/buildarea/3.x.cstratak-fedora-rawhide-aarch64.refleak/build/Lib/multiprocessing/util.py", line 300, in _run_finalizers finalizer() File "/home/buildbot/buildarea/3.x.cstratak-fedora-rawhide-aarch64.refleak/build/Lib/multiprocessing/util.py", line 224, in __call__ res = self._callback(*self._args, **self._kwargs) File "/home/buildbot/buildarea/3.x.cstratak-fedora-rawhide-aarch64.refleak/build/Lib/multiprocessing/synchronize.py", line 87, in _cleanup sem_unlink(name) FileNotFoundError: [Errno 2] No such file or directory ./home/buildbot/buildarea/3.x.cstratak-fedora-rawhide-aarch64.refleak/build/Lib/multiprocessing/resource_tracker.py:216: UserWarning: resource_tracker: There appear to be 6 leaked semaphore objects to clean up at shutdown warnings.warn('resource_tracker: There appear to be %d ' Traceback (most recent call last): File "/home/buildbot/buildarea/3.x.cstratak-fedora-rawhide-aarch64.refleak/build/Lib/multiprocessing/util.py", line 300, in _run_finalizers finalizer() File "/home/buildbot/buildarea/3.x.cstratak-fedora-rawhide-aarch64.refleak/build/Lib/multiprocessing/util.py", line 224, in __call__ res = self._callback(*self._args, **self._kwargs) File "/home/buildbot/buildarea/3.x.cstratak-fedora-rawhide-aarch64.refleak/build/Lib/multiprocessing/synchronize.py", line 87, in _cleanup sem_unlink(name) FileNotFoundError: [Errno 2] No such file or directory Traceback (most recent call last): File "/home/buildbot/buildarea/3.x.cstratak-fedora-rawhide-aarch64.refleak/build/Lib/multiprocessing/util.py", line 300, in _run_finalizers finalizer() File "/home/buildbot/buildarea/3.x.cstratak-fedora-rawhide-aarch64.refleak/build/Lib/multiprocessing/util.py", line 224, in __call__ res = self._callback(*self._args, **self._kwargs) File "/home/buildbot/buildarea/3.x.cstratak-fedora-rawhide-aarch64.refleak/build/Lib/multiprocessing/synchronize.py", line 87, in _cleanup sem_unlink(name) FileNotFoundError: [Errno 2] No such file or directory Traceback (most recent call last): File "/home/buildbot/buildarea/3.x.cstratak-fedora-rawhide-aarch64.refleak/build/Lib/multiprocessing/util.py", line 300, in _run_finalizers finalizer() File "/home/buildbot/buildarea/3.x.cstratak-fedora-rawhide-aarch64.refleak/build/Lib/multiprocessing/util.py", line 224, in __call__ res = self._callback(*self._args, **self._kwargs) File "/home/buildbot/buildarea/3.x.cstratak-fedora-rawhide-aarch64.refleak/build/Lib/multiprocessing/synchronize.py", line 87, in _cleanup sem_unlink(name) FileNotFoundError: [Errno 2] No such file or directory Traceback (most recent call last): File "/home/buildbot/buildarea/3.x.cstratak-fedora-rawhide-aarch64.refleak/build/Lib/multiprocessing/util.py", line 300, in _run_finalizers finalizer() File "/home/buildbot/buildarea/3.x.cstratak-fedora-rawhide-aarch64.refleak/build/Lib/multiprocessing/util.py", line 224, in __call__ res = self._callback(*self._args, **self._kwargs) File "/home/buildbot/buildarea/3.x.cstratak-fedora-rawhide-aarch64.refleak/build/Lib/multiprocessing/synchronize.py", line 87, in _cleanup sem_unlink(name) FileNotFoundError: [Errno 2] No such file or directory Traceback (most recent call last): File "/home/buildbot/buildarea/3.x.cstratak-fedora-rawhide-aarch64.refleak/build/Lib/multiprocessing/util.py", line 300, in _run_finalizers finalizer() File "/home/buildbot/buildarea/3.x.cstratak-fedora-rawhide-aarch64.refleak/build/Lib/multiprocessing/util.py", line 224, in __call__ res = self._callback(*self._args, **self._kwargs) File "/home/buildbot/buildarea/3.x.cstratak-fedora-rawhide-aarch64.refleak/build/Lib/multiprocessing/synchronize.py", line 87, in _cleanup sem_unlink(name) FileNotFoundError: [Errno 2] No such file or directory Traceback (most recent call last): File "/home/buildbot/buildarea/3.x.cstratak-fedora-rawhide-aarch64.refleak/build/Lib/multiprocessing/util.py", line 300, in _run_finalizers finalizer() File "/home/buildbot/buildarea/3.x.cstratak-fedora-rawhide-aarch64.refleak/build/Lib/multiprocessing/util.py", line 224, in __call__ res = self._callback(*self._args, **self._kwargs) File "/home/buildbot/buildarea/3.x.cstratak-fedora-rawhide-aarch64.refleak/build/Lib/multiprocessing/synchronize.py", line 87, in _cleanup sem_unlink(name) FileNotFoundError: [Errno 2] No such file or directory ./home/buildbot/buildarea/3.x.cstratak-fedora-rawhide-aarch64.refleak/build/Lib/multiprocessing/resource_tracker.py:216: UserWarning: resource_tracker: There appear to be 6 leaked semaphore objects to clean up at shutdown warnings.warn('resource_tracker: There appear to be %d ' Traceback (most recent call last): File "/home/buildbot/buildarea/3.x.cstratak-fedora-rawhide-aarch64.refleak/build/Lib/multiprocessing/util.py", line 300, in _run_finalizers finalizer() File "/home/buildbot/buildarea/3.x.cstratak-fedora-rawhide-aarch64.refleak/build/Lib/multiprocessing/util.py", line 224, in __call__ res = self._callback(*self._args, **self._kwargs) File "/home/buildbot/buildarea/3.x.cstratak-fedora-rawhide-aarch64.refleak/build/Lib/multiprocessing/synchronize.py", line 87, in _cleanup sem_unlink(name) FileNotFoundError: [Errno 2] No such file or directory Traceback (most recent call last): File "/home/buildbot/buildarea/3.x.cstratak-fedora-rawhide-aarch64.refleak/build/Lib/multiprocessing/util.py", line 300, in _run_finalizers finalizer() File "/home/buildbot/buildarea/3.x.cstratak-fedora-rawhide-aarch64.refleak/build/Lib/multiprocessing/util.py", line 224, in __call__ res = self._callback(*self._args, **self._kwargs) File "/home/buildbot/buildarea/3.x.cstratak-fedora-rawhide-aarch64.refleak/build/Lib/multiprocessing/synchronize.py", line 87, in _cleanup sem_unlink(name) FileNotFoundError: [Errno 2] No such file or directory Traceback (most recent call last): File "/home/buildbot/buildarea/3.x.cstratak-fedora-rawhide-aarch64.refleak/build/Lib/multiprocessing/util.py", line 300, in _run_finalizers finalizer() File "/home/buildbot/buildarea/3.x.cstratak-fedora-rawhide-aarch64.refleak/build/Lib/multiprocessing/util.py", line 224, in __call__ res = self._callback(*self._args, **self._kwargs) File "/home/buildbot/buildarea/3.x.cstratak-fedora-rawhide-aarch64.refleak/build/Lib/multiprocessing/synchronize.py", line 87, in _cleanup sem_unlink(name) FileNotFoundError: [Errno 2] No such file or directory Traceback (most recent call last): File "/home/buildbot/buildarea/3.x.cstratak-fedora-rawhide-aarch64.refleak/build/Lib/multiprocessing/util.py", line 300, in _run_finalizers finalizer() File "/home/buildbot/buildarea/3.x.cstratak-fedora-rawhide-aarch64.refleak/build/Lib/multiprocessing/util.py", line 224, in __call__ res = self._callback(*self._args, **self._kwargs) File "/home/buildbot/buildarea/3.x.cstratak-fedora-rawhide-aarch64.refleak/build/Lib/multiprocessing/synchronize.py", line 87, in _cleanup sem_unlink(name) FileNotFoundError: [Errno 2] No such file or directory Traceback (most recent call last): File "/home/buildbot/buildarea/3.x.cstratak-fedora-rawhide-aarch64.refleak/build/Lib/multiprocessing/util.py", line 300, in _run_finalizers finalizer() File "/home/buildbot/buildarea/3.x.cstratak-fedora-rawhide-aarch64.refleak/build/Lib/multiprocessing/util.py", line 224, in __call__ res = self._callback(*self._args, **self._kwargs) File "/home/buildbot/buildarea/3.x.cstratak-fedora-rawhide-aarch64.refleak/build/Lib/multiprocessing/synchronize.py", line 87, in _cleanup sem_unlink(name) FileNotFoundError: [Errno 2] No such file or directory Traceback (most recent call last): File "/home/buildbot/buildarea/3.x.cstratak-fedora-rawhide-aarch64.refleak/build/Lib/multiprocessing/util.py", line 300, in _run_finalizers finalizer() File "/home/buildbot/buildarea/3.x.cstratak-fedora-rawhide-aarch64.refleak/build/Lib/multiprocessing/util.py", line 224, in __call__ res = self._callback(*self._args, **self._kwargs) File "/home/buildbot/buildarea/3.x.cstratak-fedora-rawhide-aarch64.refleak/build/Lib/multiprocessing/synchronize.py", line 87, in _cleanup sem_unlink(name) FileNotFoundError: [Errno 2] No such file or directory ./home/buildbot/buildarea/3.x.cstratak-fedora-rawhide-aarch64.refleak/build/Lib/multiprocessing/resource_tracker.py:216: UserWarning: resource_tracker: There appear to be 6 leaked semaphore objects to clean up at shutdown warnings.warn('resource_tracker: There appear to be %d ' Traceback (most recent call last): File "/home/buildbot/buildarea/3.x.cstratak-fedora-rawhide-aarch64.refleak/build/Lib/multiprocessing/util.py", line 300, in _run_finalizers finalizer() File "/home/buildbot/buildarea/3.x.cstratak-fedora-rawhide-aarch64.refleak/build/Lib/multiprocessing/util.py", line 224, in __call__ res = self._callback(*self._args, **self._kwargs) File "/home/buildbot/buildarea/3.x.cstratak-fedora-rawhide-aarch64.refleak/build/Lib/multiprocessing/synchronize.py", line 87, in _cleanup sem_unlink(name) FileNotFoundError: [Errno 2] No such file or directory Traceback (most recent call last): File "/home/buildbot/buildarea/3.x.cstratak-fedora-rawhide-aarch64.refleak/build/Lib/multiprocessing/util.py", line 300, in _run_finalizers finalizer() File "/home/buildbot/buildarea/3.x.cstratak-fedora-rawhide-aarch64.refleak/build/Lib/multiprocessing/util.py", line 224, in __call__ res = self._callback(*self._args, **self._kwargs) File "/home/buildbot/buildarea/3.x.cstratak-fedora-rawhide-aarch64.refleak/build/Lib/multiprocessing/synchronize.py", line 87, in _cleanup sem_unlink(name) FileNotFoundError: [Errno 2] No such file or directory Traceback (most recent call last): File "/home/buildbot/buildarea/3.x.cstratak-fedora-rawhide-aarch64.refleak/build/Lib/multiprocessing/util.py", line 300, in _run_finalizers finalizer() File "/home/buildbot/buildarea/3.x.cstratak-fedora-rawhide-aarch64.refleak/build/Lib/multiprocessing/util.py", line 224, in __call__ res = self._callback(*self._args, **self._kwargs) File "/home/buildbot/buildarea/3.x.cstratak-fedora-rawhide-aarch64.refleak/build/Lib/multiprocessing/synchronize.py", line 87, in _cleanup sem_unlink(name) FileNotFoundError: [Errno 2] No such file or directory Traceback (most recent call last): File "/home/buildbot/buildarea/3.x.cstratak-fedora-rawhide-aarch64.refleak/build/Lib/multiprocessing/util.py", line 300, in _run_finalizers finalizer() File "/home/buildbot/buildarea/3.x.cstratak-fedora-rawhide-aarch64.refleak/build/Lib/multiprocessing/util.py", line 224, in __call__ res = self._callback(*self._args, **self._kwargs) File "/home/buildbot/buildarea/3.x.cstratak-fedora-rawhide-aarch64.refleak/build/Lib/multiprocessing/synchronize.py", line 87, in _cleanup sem_unlink(name) FileNotFoundError: [Errno 2] No such file or directory Traceback (most recent call last): File "/home/buildbot/buildarea/3.x.cstratak-fedora-rawhide-aarch64.refleak/build/Lib/multiprocessing/util.py", line 300, in _run_finalizers finalizer() File "/home/buildbot/buildarea/3.x.cstratak-fedora-rawhide-aarch64.refleak/build/Lib/multiprocessing/util.py", line 224, in __call__ res = self._callback(*self._args, **self._kwargs) File "/home/buildbot/buildarea/3.x.cstratak-fedora-rawhide-aarch64.refleak/build/Lib/multiprocessing/synchronize.py", line 87, in _cleanup sem_unlink(name) FileNotFoundError: [Errno 2] No such file or directory Traceback (most recent call last): File "/home/buildbot/buildarea/3.x.cstratak-fedora-rawhide-aarch64.refleak/build/Lib/multiprocessing/util.py", line 300, in _run_finalizers finalizer() File "/home/buildbot/buildarea/3.x.cstratak-fedora-rawhide-aarch64.refleak/build/Lib/multiprocessing/util.py", line 224, in __call__ res = self._callback(*self._args, **self._kwargs) File "/home/buildbot/buildarea/3.x.cstratak-fedora-rawhide-aarch64.refleak/build/Lib/multiprocessing/synchronize.py", line 87, in _cleanup sem_unlink(name) FileNotFoundError: [Errno 2] No such file or directory ./home/buildbot/buildarea/3.x.cstratak-fedora-rawhide-aarch64.refleak/build/Lib/multiprocessing/resource_tracker.py:216: UserWarning: resource_tracker: There appear to be 6 leaked semaphore objects to clean up at shutdown warnings.warn('resource_tracker: There appear to be %d ' Traceback (most recent call last): File "/home/buildbot/buildarea/3.x.cstratak-fedora-rawhide-aarch64.refleak/build/Lib/multiprocessing/util.py", line 300, in _run_finalizers finalizer() File "/home/buildbot/buildarea/3.x.cstratak-fedora-rawhide-aarch64.refleak/build/Lib/multiprocessing/util.py", line 224, in __call__ res = self._callback(*self._args, **self._kwargs) File "/home/buildbot/buildarea/3.x.cstratak-fedora-rawhide-aarch64.refleak/build/Lib/multiprocessing/synchronize.py", line 87, in _cleanup sem_unlink(name) FileNotFoundError: [Errno 2] No such file or directory Traceback (most recent call last): File "/home/buildbot/buildarea/3.x.cstratak-fedora-rawhide-aarch64.refleak/build/Lib/multiprocessing/util.py", line 300, in _run_finalizers finalizer() File "/home/buildbot/buildarea/3.x.cstratak-fedora-rawhide-aarch64.refleak/build/Lib/multiprocessing/util.py", line 224, in __call__ res = self._callback(*self._args, **self._kwargs) File "/home/buildbot/buildarea/3.x.cstratak-fedora-rawhide-aarch64.refleak/build/Lib/multiprocessing/synchronize.py", line 87, in _cleanup sem_unlink(name) FileNotFoundError: [Errno 2] No such file or directory Traceback (most recent call last): File "/home/buildbot/buildarea/3.x.cstratak-fedora-rawhide-aarch64.refleak/build/Lib/multiprocessing/util.py", line 300, in _run_finalizers finalizer() File "/home/buildbot/buildarea/3.x.cstratak-fedora-rawhide-aarch64.refleak/build/Lib/multiprocessing/util.py", line 224, in __call__ res = self._callback(*self._args, **self._kwargs) File "/home/buildbot/buildarea/3.x.cstratak-fedora-rawhide-aarch64.refleak/build/Lib/multiprocessing/synchronize.py", line 87, in _cleanup sem_unlink(name) FileNotFoundError: [Errno 2] No such file or directory Traceback (most recent call last): File "/home/buildbot/buildarea/3.x.cstratak-fedora-rawhide-aarch64.refleak/build/Lib/multiprocessing/util.py", line 300, in _run_finalizers finalizer() File "/home/buildbot/buildarea/3.x.cstratak-fedora-rawhide-aarch64.refleak/build/Lib/multiprocessing/util.py", line 224, in __call__ res = self._callback(*self._args, **self._kwargs) File "/home/buildbot/buildarea/3.x.cstratak-fedora-rawhide-aarch64.refleak/build/Lib/multiprocessing/synchronize.py", line 87, in _cleanup sem_unlink(name) FileNotFoundError: [Errno 2] No such file or directory Traceback (most recent call last): File "/home/buildbot/buildarea/3.x.cstratak-fedora-rawhide-aarch64.refleak/build/Lib/multiprocessing/util.py", line 300, in _run_finalizers finalizer() File "/home/buildbot/buildarea/3.x.cstratak-fedora-rawhide-aarch64.refleak/build/Lib/multiprocessing/util.py", line 224, in __call__ res = self._callback(*self._args, **self._kwargs) File "/home/buildbot/buildarea/3.x.cstratak-fedora-rawhide-aarch64.refleak/build/Lib/multiprocessing/synchronize.py", line 87, in _cleanup sem_unlink(name) FileNotFoundError: [Errno 2] No such file or directory Traceback (most recent call last): File "/home/buildbot/buildarea/3.x.cstratak-fedora-rawhide-aarch64.refleak/build/Lib/multiprocessing/util.py", line 300, in _run_finalizers finalizer() File "/home/buildbot/buildarea/3.x.cstratak-fedora-rawhide-aarch64.refleak/build/Lib/multiprocessing/util.py", line 224, in __call__ res = self._callback(*self._args, **self._kwargs) File "/home/buildbot/buildarea/3.x.cstratak-fedora-rawhide-aarch64.refleak/build/Lib/multiprocessing/synchronize.py", line 87, in _cleanup sem_unlink(name) FileNotFoundError: [Errno 2] No such file or directory ./home/buildbot/buildarea/3.x.cstratak-fedora-rawhide-aarch64.refleak/build/Lib/multiprocessing/resource_tracker.py:216: UserWarning: resource_tracker: There appear to be 6 leaked semaphore objects to clean up at shutdown warnings.warn('resource_tracker: There appear to be %d ' Traceback (most recent call last): File "/home/buildbot/buildarea/3.x.cstratak-fedora-rawhide-aarch64.refleak/build/Lib/multiprocessing/util.py", line 300, in _run_finalizers finalizer() File "/home/buildbot/buildarea/3.x.cstratak-fedora-rawhide-aarch64.refleak/build/Lib/multiprocessing/util.py", line 224, in __call__ res = self._callback(*self._args, **self._kwargs) File "/home/buildbot/buildarea/3.x.cstratak-fedora-rawhide-aarch64.refleak/build/Lib/multiprocessing/synchronize.py", line 87, in _cleanup sem_unlink(name) FileNotFoundError: [Errno 2] No such file or directory Traceback (most recent call last): File "/home/buildbot/buildarea/3.x.cstratak-fedora-rawhide-aarch64.refleak/build/Lib/multiprocessing/util.py", line 300, in _run_finalizers finalizer() File "/home/buildbot/buildarea/3.x.cstratak-fedora-rawhide-aarch64.refleak/build/Lib/multiprocessing/util.py", line 224, in __call__ res = self._callback(*self._args, **self._kwargs) File "/home/buildbot/buildarea/3.x.cstratak-fedora-rawhide-aarch64.refleak/build/Lib/multiprocessing/synchronize.py", line 87, in _cleanup sem_unlink(name) FileNotFoundError: [Errno 2] No such file or directory Traceback (most recent call last): File "/home/buildbot/buildarea/3.x.cstratak-fedora-rawhide-aarch64.refleak/build/Lib/multiprocessing/util.py", line 300, in _run_finalizers finalizer() File "/home/buildbot/buildarea/3.x.cstratak-fedora-rawhide-aarch64.refleak/build/Lib/multiprocessing/util.py", line 224, in __call__ res = self._callback(*self._args, **self._kwargs) File "/home/buildbot/buildarea/3.x.cstratak-fedora-rawhide-aarch64.refleak/build/Lib/multiprocessing/synchronize.py", line 87, in _cleanup sem_unlink(name) FileNotFoundError: [Errno 2] No such file or directory Traceback (most recent call last): File "/home/buildbot/buildarea/3.x.cstratak-fedora-rawhide-aarch64.refleak/build/Lib/multiprocessing/util.py", line 300, in _run_finalizers finalizer() File "/home/buildbot/buildarea/3.x.cstratak-fedora-rawhide-aarch64.refleak/build/Lib/multiprocessing/util.py", line 224, in __call__ res = self._callback(*self._args, **self._kwargs) File "/home/buildbot/buildarea/3.x.cstratak-fedora-rawhide-aarch64.refleak/build/Lib/multiprocessing/synchronize.py", line 87, in _cleanup sem_unlink(name) FileNotFoundError: [Errno 2] No such file or directory Traceback (most recent call last): File "/home/buildbot/buildarea/3.x.cstratak-fedora-rawhide-aarch64.refleak/build/Lib/multiprocessing/util.py", line 300, in _run_finalizers finalizer() File "/home/buildbot/buildarea/3.x.cstratak-fedora-rawhide-aarch64.refleak/build/Lib/multiprocessing/util.py", line 224, in __call__ res = self._callback(*self._args, **self._kwargs) File "/home/buildbot/buildarea/3.x.cstratak-fedora-rawhide-aarch64.refleak/build/Lib/multiprocessing/synchronize.py", line 87, in _cleanup sem_unlink(name) FileNotFoundError: [Errno 2] No such file or directory Traceback (most recent call last): File "/home/buildbot/buildarea/3.x.cstratak-fedora-rawhide-aarch64.refleak/build/Lib/multiprocessing/util.py", line 300, in _run_finalizers finalizer() File "/home/buildbot/buildarea/3.x.cstratak-fedora-rawhide-aarch64.refleak/build/Lib/multiprocessing/util.py", line 224, in __call__ res = self._callback(*self._args, **self._kwargs) File "/home/buildbot/buildarea/3.x.cstratak-fedora-rawhide-aarch64.refleak/build/Lib/multiprocessing/synchronize.py", line 87, in _cleanup sem_unlink(name) FileNotFoundError: [Errno 2] No such file or directory .
Traceback (most recent call last): File "/home/buildbot/buildarea/3.x.cstratak-fedora-rawhide-aarch64.refleak/build/Lib/test/test_glob.py", line 368, in test_selflink self.assertIn(path, results) AssertionError: 'dir/link/link/link/link/link/link/link/link/link/link/link/link/link/link/link/link/link/link/link/link/link/link/link/link/link/link/link/file' not found in {'dir/link/link/link/link/link/link/link/link/link/link/link/link/link/link/link/link/link/link/link/link/link/link/link/link/link/link/link/link/link/file', 'dir/link/link/link/link/link/link/link/link/link/link/link/link/link/link/link/link/link/link/link/link/link/link/link/link/link/link/link/link/link/link/link/file', 'dir/link/link/link/link/link/link/link/link/link/link/link/link/link/link/link/link/link/link/link/link/link/link/link/link/link/link/link/link/link/link/link/link/file', 'dir/link/link/link/link/link/link/link/link/link/link/link/link/link/link/link/link/link/link/link/link/link/link/link/link/link/link/link/link/link/link/link/link/link/link/link/link/link/link/link/link/file', 'dir/link/link/link/link/link/link/link/link/link/link/link/link/link/link/link/link/link/link/link/link/link/link /link/link/link/link/link/link/link/link/file', 'dir/link/link/link/link/link/link/link/link/link/link/link/link/link/link/link/link/link/link/link/link/link/link/link/link/link/link/link/link/link/link/link/link/link/link/link/file', 'dir/link/link/link/link/link/link/link/link/link/link/link/link/link/link/link/link/link/link/link/link/link/link/link/link/link/link/link/link/link/link/link/link/link/link/link/link/link/link/file', 'dir/link/link/link/link/link/link/link/link/link/link/link/link/link/link/link/link/link/link/link/link/link/link/link/link/link/link/link/link/link/link/link/link/link/link/link/link/link/link/link/file', 'dir/link/link/link/link/link/link/link/link/link/link/link/link/link/link/link/link/link/link/link/link/link/link/link/link/link/link/link/link/file', 'dir/link/link/link/link/link/link/link/link/link/link/link/link/link/link/link/link/link/link/link/link/link/link/link/link/link/link/link/link/link/link/link/link/link/link/file', 'dir/link/link/link /link/link/link/link/link/link/link/link/link/link/li nk/link/link/link/link/link/link/link/link/link/link/link/link/link/link/link/link/link/link/link/link/link/link/link/file'}
Test report
Failed tests:
- test_coroutines
- test_glob
- test_asyncgen
- test_unittest
- test_asyncio
Test leaking resources:
- test_asyncio: references
- test_asyncgen: references
- test_coroutines: references
- test_asyncio: memory blocks
- test_asyncgen: memory blocks
- test_coroutines: memory blocks
- test_unittest: references
- test_unittest: memory blocks
Sincerely, -The Buildbot
https://bugs.python.org/issue42085
New changeset 1e996c3a3b51e9c6f1f4cea8a6dbcf3bcb865060 by Vladimir Matveev in branch 'master':
This change introduced big reference leaks:
4 tests failed: test_asyncgen test_asyncio test_coroutines test_unittest
Example:
$ ./python -m test test_asyncgen -R 3:3 -m test.test_asyncgen.AsyncGenAsyncioTest.test_async_gen_asyncio_03 (...) test_asyncgen leaked [63, 63, 63] references, sum=189 (...)
Please fix the leak, or revert if nobody is avaible to fix it: https://pythondev.readthedocs.io/ci.html#revert-on-fail
Le mer. 11 nov. 2020 à 09:34, <buildbot@python.org> a écrit :
The Buildbot has detected a new failure on builder aarch64 Fedora Rawhide Refleaks 3.x while building Python. Full details are available at: https://buildbot.python.org/all/#builders/290/builds/309
Buildbot URL: https://buildbot.python.org/all/
Worker for this Build: cstratak-fedora-rawhide-aarch64
Build Reason: <unknown> Blamelist:
BUILD FAILED: failed test (failure)
Summary of the results of the build (if available):
== Tests result: FAILURE then FAILURE ==
407 tests OK.
10 slowest tests:
- test_asyncio: 2 hour 22 min
- test_signal: 31 min 14 sec
- test_pydoc: 30 min 2 sec
- test_peg_generator: 23 min 27 sec
- test_concurrent_futures: 21 min 59 sec
- test_multiprocessing_spawn: 17 min 28 sec
- test_multiprocessing_forkserver: 11 min 3 sec
- test_zipfile: 8 min 40 sec
- test_nntplib: 8 min 1 sec
- test_lib2to3: 7 min 40 sec
4 tests failed: test_asyncgen test_asyncio test_coroutines test_unittest
14 tests skipped: test_devpoll test_gdb test_ioctl test_kqueue test_msilib test_ossaudiodev test_startfile test_tix test_tk test_ttk_guionly test_winconsoleio test_winreg test_winsound test_zipfile64
5 re-run tests: test_asyncgen test_asyncio test_coroutines test_glob test_unittest
Total duration: 4 hour 57 min
Captured traceback
Traceback (most recent call last): File "/home/buildbot/buildarea/3.x.cstratak-fedora-rawhide-aarch64.refleak/build/Lib/multiprocessing/util.py", line 300, in _run_finalizers finalizer() File "/home/buildbot/buildarea/3.x.cstratak-fedora-rawhide-aarch64.refleak/build/Lib/multiprocessing/util.py", line 224, in __call__ res = self._callback(*self._args, **self._kwargs) File "/home/buildbot/buildarea/3.x.cstratak-fedora-rawhide-aarch64.refleak/build/Lib/multiprocessing/synchronize.py", line 87, in _cleanup sem_unlink(name) FileNotFoundError: [Errno 2] No such file or directory Traceback (most recent call last): File "/home/buildbot/buildarea/3.x.cstratak-fedora-rawhide-aarch64.refleak/build/Lib/multiprocessing/util.py", line 300, in _run_finalizers finalizer() File "/home/buildbot/buildarea/3.x.cstratak-fedora-rawhide-aarch64.refleak/build/Lib/multiprocessing/util.py", line 224, in __call__ res = self._callback(*self._args, **self._kwargs) File "/home/buildbot/buildarea/3.x.cstratak-fedora-rawhide-aarch64.refleak/build/Lib/multiprocessing/synchronize.py", line 87, in _cleanup sem_unlink(name) FileNotFoundError: [Errno 2] No such file or directory Traceback (most recent call last): File "/home/buildbot/buildarea/3.x.cstratak-fedora-rawhide-aarch64.refleak/build/Lib/multiprocessing/util.py", line 300, in _run_finalizers finalizer() File "/home/buildbot/buildarea/3.x.cstratak-fedora-rawhide-aarch64.refleak/build/Lib/multiprocessing/util.py", line 224, in __call__ res = self._callback(*self._args, **self._kwargs) File "/home/buildbot/buildarea/3.x.cstratak-fedora-rawhide-aarch64.refleak/build/Lib/multiprocessing/synchronize.py", line 87, in _cleanup sem_unlink(name) FileNotFoundError: [Errno 2] No such file or directory Traceback (most recent call last): File "/home/buildbot/buildarea/3.x.cstratak-fedora-rawhide-aarch64.refleak/build/Lib/multiprocessing/util.py", line 300, in _run_finalizers finalizer() File "/home/buildbot/buildarea/3.x.cstratak-fedora-rawhide-aarch64.refleak/build/Lib/multiprocessing/util.py", line 224, in __call__ res = self._callback(*self._args, **self._kwargs) File "/home/buildbot/buildarea/3.x.cstratak-fedora-rawhide-aarch64.refleak/build/Lib/multiprocessing/synchronize.py", line 87, in _cleanup sem_unlink(name) FileNotFoundError: [Errno 2] No such file or directory Traceback (most recent call last): File "/home/buildbot/buildarea/3.x.cstratak-fedora-rawhide-aarch64.refleak/build/Lib/multiprocessing/util.py", line 300, in _run_finalizers finalizer() File "/home/buildbot/buildarea/3.x.cstratak-fedora-rawhide-aarch64.refleak/build/Lib/multiprocessing/util.py", line 224, in __call__ res = self._callback(*self._args, **self._kwargs) File "/home/buildbot/buildarea/3.x.cstratak-fedora-rawhide-aarch64.refleak/build/Lib/multiprocessing/synchronize.py", line 87, in _cleanup sem_unlink(name) FileNotFoundError: [Errno 2] No such file or directory Traceback (most recent call last): File "/home/buildbot/buildarea/3.x.cstratak-fedora-rawhide-aarch64.refleak/build/Lib/multiprocessing/util.py", line 300, in _run_finalizers finalizer() File "/home/buildbot/buildarea/3.x.cstratak-fedora-rawhide-aarch64.refleak/build/Lib/multiprocessing/util.py", line 224, in __call__ res = self._callback(*self._args, **self._kwargs) File "/home/buildbot/buildarea/3.x.cstratak-fedora-rawhide-aarch64.refleak/build/Lib/multiprocessing/synchronize.py", line 87, in _cleanup sem_unlink(name) FileNotFoundError: [Errno 2] No such file or directory ./home/buildbot/buildarea/3.x.cstratak-fedora-rawhide-aarch64.refleak/build/Lib/multiprocessing/resource_tracker.py:216: UserWarning: resource_tracker: There appear to be 6 leaked semaphore objects to clean up at shutdown warnings.warn('resource_tracker: There appear to be %d ' Traceback (most recent call last): File "/home/buildbot/buildarea/3.x.cstratak-fedora-rawhide-aarch64.refleak/build/Lib/multiprocessing/util.py", line 300, in _run_finalizers finalizer() File "/home/buildbot/buildarea/3.x.cstratak-fedora-rawhide-aarch64.refleak/build/Lib/multiprocessing/util.py", line 224, in __call__ res = self._callback(*self._args, **self._kwargs) File "/home/buildbot/buildarea/3.x.cstratak-fedora-rawhide-aarch64.refleak/build/Lib/multiprocessing/synchronize.py", line 87, in _cleanup sem_unlink(name) FileNotFoundError: [Errno 2] No such file or directory Traceback (most recent call last): File "/home/buildbot/buildarea/3.x.cstratak-fedora-rawhide-aarch64.refleak/build/Lib/multiprocessing/util.py", line 300, in _run_finalizers finalizer() File "/home/buildbot/buildarea/3.x.cstratak-fedora-rawhide-aarch64.refleak/build/Lib/multiprocessing/util.py", line 224, in __call__ res = self._callback(*self._args, **self._kwargs) File "/home/buildbot/buildarea/3.x.cstratak-fedora-rawhide-aarch64.refleak/build/Lib/multiprocessing/synchronize.py", line 87, in _cleanup sem_unlink(name) FileNotFoundError: [Errno 2] No such file or directory Traceback (most recent call last): File "/home/buildbot/buildarea/3.x.cstratak-fedora-rawhide-aarch64.refleak/build/Lib/multiprocessing/util.py", line 300, in _run_finalizers finalizer() File "/home/buildbot/buildarea/3.x.cstratak-fedora-rawhide-aarch64.refleak/build/Lib/multiprocessing/util.py", line 224, in __call__ res = self._callback(*self._args, **self._kwargs) File "/home/buildbot/buildarea/3.x.cstratak-fedora-rawhide-aarch64.refleak/build/Lib/multiprocessing/synchronize.py", line 87, in _cleanup sem_unlink(name) FileNotFoundError: [Errno 2] No such file or directory Traceback (most recent call last): File "/home/buildbot/buildarea/3.x.cstratak-fedora-rawhide-aarch64.refleak/build/Lib/multiprocessing/util.py", line 300, in _run_finalizers finalizer() File "/home/buildbot/buildarea/3.x.cstratak-fedora-rawhide-aarch64.refleak/build/Lib/multiprocessing/util.py", line 224, in __call__ res = self._callback(*self._args, **self._kwargs) File "/home/buildbot/buildarea/3.x.cstratak-fedora-rawhide-aarch64.refleak/build/Lib/multiprocessing/synchronize.py", line 87, in _cleanup sem_unlink(name) FileNotFoundError: [Errno 2] No such file or directory Traceback (most recent call last): File "/home/buildbot/buildarea/3.x.cstratak-fedora-rawhide-aarch64.refleak/build/Lib/multiprocessing/util.py", line 300, in _run_finalizers finalizer() File "/home/buildbot/buildarea/3.x.cstratak-fedora-rawhide-aarch64.refleak/build/Lib/multiprocessing/util.py", line 224, in __call__ res = self._callback(*self._args, **self._kwargs) File "/home/buildbot/buildarea/3.x.cstratak-fedora-rawhide-aarch64.refleak/build/Lib/multiprocessing/synchronize.py", line 87, in _cleanup sem_unlink(name) FileNotFoundError: [Errno 2] No such file or directory Traceback (most recent call last): File "/home/buildbot/buildarea/3.x.cstratak-fedora-rawhide-aarch64.refleak/build/Lib/multiprocessing/util.py", line 300, in _run_finalizers finalizer() File "/home/buildbot/buildarea/3.x.cstratak-fedora-rawhide-aarch64.refleak/build/Lib/multiprocessing/util.py", line 224, in __call__ res = self._callback(*self._args, **self._kwargs) File "/home/buildbot/buildarea/3.x.cstratak-fedora-rawhide-aarch64.refleak/build/Lib/multiprocessing/synchronize.py", line 87, in _cleanup sem_unlink(name) FileNotFoundError: [Errno 2] No such file or directory ./home/buildbot/buildarea/3.x.cstratak-fedora-rawhide-aarch64.refleak/build/Lib/multiprocessing/resource_tracker.py:216: UserWarning: resource_tracker: There appear to be 6 leaked semaphore objects to clean up at shutdown warnings.warn('resource_tracker: There appear to be %d ' Traceback (most recent call last): File "/home/buildbot/buildarea/3.x.cstratak-fedora-rawhide-aarch64.refleak/build/Lib/multiprocessing/util.py", line 300, in _run_finalizers finalizer() File "/home/buildbot/buildarea/3.x.cstratak-fedora-rawhide-aarch64.refleak/build/Lib/multiprocessing/util.py", line 224, in __call__ res = self._callback(*self._args, **self._kwargs) File "/home/buildbot/buildarea/3.x.cstratak-fedora-rawhide-aarch64.refleak/build/Lib/multiprocessing/synchronize.py", line 87, in _cleanup sem_unlink(name) FileNotFoundError: [Errno 2] No such file or directory Traceback (most recent call last): File "/home/buildbot/buildarea/3.x.cstratak-fedora-rawhide-aarch64.refleak/build/Lib/multiprocessing/util.py", line 300, in _run_finalizers finalizer() File "/home/buildbot/buildarea/3.x.cstratak-fedora-rawhide-aarch64.refleak/build/Lib/multiprocessing/util.py", line 224, in __call__ res = self._callback(*self._args, **self._kwargs) File "/home/buildbot/buildarea/3.x.cstratak-fedora-rawhide-aarch64.refleak/build/Lib/multiprocessing/synchronize.py", line 87, in _cleanup sem_unlink(name) FileNotFoundError: [Errno 2] No such file or directory Traceback (most recent call last): File "/home/buildbot/buildarea/3.x.cstratak-fedora-rawhide-aarch64.refleak/build/Lib/multiprocessing/util.py", line 300, in _run_finalizers finalizer() File "/home/buildbot/buildarea/3.x.cstratak-fedora-rawhide-aarch64.refleak/build/Lib/multiprocessing/util.py", line 224, in __call__ res = self._callback(*self._args, **self._kwargs) File "/home/buildbot/buildarea/3.x.cstratak-fedora-rawhide-aarch64.refleak/build/Lib/multiprocessing/synchronize.py", line 87, in _cleanup sem_unlink(name) FileNotFoundError: [Errno 2] No such file or directory Traceback (most recent call last): File "/home/buildbot/buildarea/3.x.cstratak-fedora-rawhide-aarch64.refleak/build/Lib/multiprocessing/util.py", line 300, in _run_finalizers finalizer() File "/home/buildbot/buildarea/3.x.cstratak-fedora-rawhide-aarch64.refleak/build/Lib/multiprocessing/util.py", line 224, in __call__ res = self._callback(*self._args, **self._kwargs) File "/home/buildbot/buildarea/3.x.cstratak-fedora-rawhide-aarch64.refleak/build/Lib/multiprocessing/synchronize.py", line 87, in _cleanup sem_unlink(name) FileNotFoundError: [Errno 2] No such file or directory Traceback (most recent call last): File "/home/buildbot/buildarea/3.x.cstratak-fedora-rawhide-aarch64.refleak/build/Lib/multiprocessing/util.py", line 300, in _run_finalizers finalizer() File "/home/buildbot/buildarea/3.x.cstratak-fedora-rawhide-aarch64.refleak/build/Lib/multiprocessing/util.py", line 224, in __call__ res = self._callback(*self._args, **self._kwargs) File "/home/buildbot/buildarea/3.x.cstratak-fedora-rawhide-aarch64.refleak/build/Lib/multiprocessing/synchronize.py", line 87, in _cleanup sem_unlink(name) FileNotFoundError: [Errno 2] No such file or directory Traceback (most recent call last): File "/home/buildbot/buildarea/3.x.cstratak-fedora-rawhide-aarch64.refleak/build/Lib/multiprocessing/util.py", line 300, in _run_finalizers finalizer() File "/home/buildbot/buildarea/3.x.cstratak-fedora-rawhide-aarch64.refleak/build/Lib/multiprocessing/util.py", line 224, in __call__ res = self._callback(*self._args, **self._kwargs) File "/home/buildbot/buildarea/3.x.cstratak-fedora-rawhide-aarch64.refleak/build/Lib/multiprocessing/synchronize.py", line 87, in _cleanup sem_unlink(name) FileNotFoundError: [Errno 2] No such file or directory ./home/buildbot/buildarea/3.x.cstratak-fedora-rawhide-aarch64.refleak/build/Lib/multiprocessing/resource_tracker.py:216: UserWarning: resource_tracker: There appear to be 6 leaked semaphore objects to clean up at shutdown warnings.warn('resource_tracker: There appear to be %d ' Traceback (most recent call last): File "/home/buildbot/buildarea/3.x.cstratak-fedora-rawhide-aarch64.refleak/build/Lib/multiprocessing/util.py", line 300, in _run_finalizers finalizer() File "/home/buildbot/buildarea/3.x.cstratak-fedora-rawhide-aarch64.refleak/build/Lib/multiprocessing/util.py", line 224, in __call__ res = self._callback(*self._args, **self._kwargs) File "/home/buildbot/buildarea/3.x.cstratak-fedora-rawhide-aarch64.refleak/build/Lib/multiprocessing/synchronize.py", line 87, in _cleanup sem_unlink(name) FileNotFoundError: [Errno 2] No such file or directory Traceback (most recent call last): File "/home/buildbot/buildarea/3.x.cstratak-fedora-rawhide-aarch64.refleak/build/Lib/multiprocessing/util.py", line 300, in _run_finalizers finalizer() File "/home/buildbot/buildarea/3.x.cstratak-fedora-rawhide-aarch64.refleak/build/Lib/multiprocessing/util.py", line 224, in __call__ res = self._callback(*self._args, **self._kwargs) File "/home/buildbot/buildarea/3.x.cstratak-fedora-rawhide-aarch64.refleak/build/Lib/multiprocessing/synchronize.py", line 87, in _cleanup sem_unlink(name) FileNotFoundError: [Errno 2] No such file or directory Traceback (most recent call last): File "/home/buildbot/buildarea/3.x.cstratak-fedora-rawhide-aarch64.refleak/build/Lib/multiprocessing/util.py", line 300, in _run_finalizers finalizer() File "/home/buildbot/buildarea/3.x.cstratak-fedora-rawhide-aarch64.refleak/build/Lib/multiprocessing/util.py", line 224, in __call__ res = self._callback(*self._args, **self._kwargs) File "/home/buildbot/buildarea/3.x.cstratak-fedora-rawhide-aarch64.refleak/build/Lib/multiprocessing/synchronize.py", line 87, in _cleanup sem_unlink(name) FileNotFoundError: [Errno 2] No such file or directory Traceback (most recent call last): File "/home/buildbot/buildarea/3.x.cstratak-fedora-rawhide-aarch64.refleak/build/Lib/multiprocessing/util.py", line 300, in _run_finalizers finalizer() File "/home/buildbot/buildarea/3.x.cstratak-fedora-rawhide-aarch64.refleak/build/Lib/multiprocessing/util.py", line 224, in __call__ res = self._callback(*self._args, **self._kwargs) File "/home/buildbot/buildarea/3.x.cstratak-fedora-rawhide-aarch64.refleak/build/Lib/multiprocessing/synchronize.py", line 87, in _cleanup sem_unlink(name) FileNotFoundError: [Errno 2] No such file or directory Traceback (most recent call last): File "/home/buildbot/buildarea/3.x.cstratak-fedora-rawhide-aarch64.refleak/build/Lib/multiprocessing/util.py", line 300, in _run_finalizers finalizer() File "/home/buildbot/buildarea/3.x.cstratak-fedora-rawhide-aarch64.refleak/build/Lib/multiprocessing/util.py", line 224, in __call__ res = self._callback(*self._args, **self._kwargs) File "/home/buildbot/buildarea/3.x.cstratak-fedora-rawhide-aarch64.refleak/build/Lib/multiprocessing/synchronize.py", line 87, in _cleanup sem_unlink(name) FileNotFoundError: [Errno 2] No such file or directory Traceback (most recent call last): File "/home/buildbot/buildarea/3.x.cstratak-fedora-rawhide-aarch64.refleak/build/Lib/multiprocessing/util.py", line 300, in _run_finalizers finalizer() File "/home/buildbot/buildarea/3.x.cstratak-fedora-rawhide-aarch64.refleak/build/Lib/multiprocessing/util.py", line 224, in __call__ res = self._callback(*self._args, **self._kwargs) File "/home/buildbot/buildarea/3.x.cstratak-fedora-rawhide-aarch64.refleak/build/Lib/multiprocessing/synchronize.py", line 87, in _cleanup sem_unlink(name) FileNotFoundError: [Errno 2] No such file or directory ./home/buildbot/buildarea/3.x.cstratak-fedora-rawhide-aarch64.refleak/build/Lib/multiprocessing/resource_tracker.py:216: UserWarning: resource_tracker: There appear to be 6 leaked semaphore objects to clean up at shutdown warnings.warn('resource_tracker: There appear to be %d ' Traceback (most recent call last): File "/home/buildbot/buildarea/3.x.cstratak-fedora-rawhide-aarch64.refleak/build/Lib/multiprocessing/util.py", line 300, in _run_finalizers finalizer() File "/home/buildbot/buildarea/3.x.cstratak-fedora-rawhide-aarch64.refleak/build/Lib/multiprocessing/util.py", line 224, in __call__ res = self._callback(*self._args, **self._kwargs) File "/home/buildbot/buildarea/3.x.cstratak-fedora-rawhide-aarch64.refleak/build/Lib/multiprocessing/synchronize.py", line 87, in _cleanup sem_unlink(name) FileNotFoundError: [Errno 2] No such file or directory Traceback (most recent call last): File "/home/buildbot/buildarea/3.x.cstratak-fedora-rawhide-aarch64.refleak/build/Lib/multiprocessing/util.py", line 300, in _run_finalizers finalizer() File "/home/buildbot/buildarea/3.x.cstratak-fedora-rawhide-aarch64.refleak/build/Lib/multiprocessing/util.py", line 224, in __call__ res = self._callback(*self._args, **self._kwargs) File "/home/buildbot/buildarea/3.x.cstratak-fedora-rawhide-aarch64.refleak/build/Lib/multiprocessing/synchronize.py", line 87, in _cleanup sem_unlink(name) FileNotFoundError: [Errno 2] No such file or directory Traceback (most recent call last): File "/home/buildbot/buildarea/3.x.cstratak-fedora-rawhide-aarch64.refleak/build/Lib/multiprocessing/util.py", line 300, in _run_finalizers finalizer() File "/home/buildbot/buildarea/3.x.cstratak-fedora-rawhide-aarch64.refleak/build/Lib/multiprocessing/util.py", line 224, in __call__ res = self._callback(*self._args, **self._kwargs) File "/home/buildbot/buildarea/3.x.cstratak-fedora-rawhide-aarch64.refleak/build/Lib/multiprocessing/synchronize.py", line 87, in _cleanup sem_unlink(name) FileNotFoundError: [Errno 2] No such file or directory Traceback (most recent call last): File "/home/buildbot/buildarea/3.x.cstratak-fedora-rawhide-aarch64.refleak/build/Lib/multiprocessing/util.py", line 300, in _run_finalizers finalizer() File "/home/buildbot/buildarea/3.x.cstratak-fedora-rawhide-aarch64.refleak/build/Lib/multiprocessing/util.py", line 224, in __call__ res = self._callback(*self._args, **self._kwargs) File "/home/buildbot/buildarea/3.x.cstratak-fedora-rawhide-aarch64.refleak/build/Lib/multiprocessing/synchronize.py", line 87, in _cleanup sem_unlink(name) FileNotFoundError: [Errno 2] No such file or directory Traceback (most recent call last): File "/home/buildbot/buildarea/3.x.cstratak-fedora-rawhide-aarch64.refleak/build/Lib/multiprocessing/util.py", line 300, in _run_finalizers finalizer() File "/home/buildbot/buildarea/3.x.cstratak-fedora-rawhide-aarch64.refleak/build/Lib/multiprocessing/util.py", line 224, in __call__ res = self._callback(*self._args, **self._kwargs) File "/home/buildbot/buildarea/3.x.cstratak-fedora-rawhide-aarch64.refleak/build/Lib/multiprocessing/synchronize.py", line 87, in _cleanup sem_unlink(name) FileNotFoundError: [Errno 2] No such file or directory Traceback (most recent call last): File "/home/buildbot/buildarea/3.x.cstratak-fedora-rawhide-aarch64.refleak/build/Lib/multiprocessing/util.py", line 300, in _run_finalizers finalizer() File "/home/buildbot/buildarea/3.x.cstratak-fedora-rawhide-aarch64.refleak/build/Lib/multiprocessing/util.py", line 224, in __call__ res = self._callback(*self._args, **self._kwargs) File "/home/buildbot/buildarea/3.x.cstratak-fedora-rawhide-aarch64.refleak/build/Lib/multiprocessing/synchronize.py", line 87, in _cleanup sem_unlink(name) FileNotFoundError: [Errno 2] No such file or directory ./home/buildbot/buildarea/3.x.cstratak-fedora-rawhide-aarch64.refleak/build/Lib/multiprocessing/resource_tracker.py:216: UserWarning: resource_tracker: There appear to be 6 leaked semaphore objects to clean up at shutdown warnings.warn('resource_tracker: There appear to be %d ' Traceback (most recent call last): File "/home/buildbot/buildarea/3.x.cstratak-fedora-rawhide-aarch64.refleak/build/Lib/multiprocessing/util.py", line 300, in _run_finalizers finalizer() File "/home/buildbot/buildarea/3.x.cstratak-fedora-rawhide-aarch64.refleak/build/Lib/multiprocessing/util.py", line 224, in __call__ res = self._callback(*self._args, **self._kwargs) File "/home/buildbot/buildarea/3.x.cstratak-fedora-rawhide-aarch64.refleak/build/Lib/multiprocessing/synchronize.py", line 87, in _cleanup sem_unlink(name) FileNotFoundError: [Errno 2] No such file or directory Traceback (most recent call last): File "/home/buildbot/buildarea/3.x.cstratak-fedora-rawhide-aarch64.refleak/build/Lib/multiprocessing/util.py", line 300, in _run_finalizers finalizer() File "/home/buildbot/buildarea/3.x.cstratak-fedora-rawhide-aarch64.refleak/build/Lib/multiprocessing/util.py", line 224, in __call__ res = self._callback(*self._args, **self._kwargs) File "/home/buildbot/buildarea/3.x.cstratak-fedora-rawhide-aarch64.refleak/build/Lib/multiprocessing/synchronize.py", line 87, in _cleanup sem_unlink(name) FileNotFoundError: [Errno 2] No such file or directory Traceback (most recent call last): File "/home/buildbot/buildarea/3.x.cstratak-fedora-rawhide-aarch64.refleak/build/Lib/multiprocessing/util.py", line 300, in _run_finalizers finalizer() File "/home/buildbot/buildarea/3.x.cstratak-fedora-rawhide-aarch64.refleak/build/Lib/multiprocessing/util.py", line 224, in __call__ res = self._callback(*self._args, **self._kwargs) File "/home/buildbot/buildarea/3.x.cstratak-fedora-rawhide-aarch64.refleak/build/Lib/multiprocessing/synchronize.py", line 87, in _cleanup sem_unlink(name) FileNotFoundError: [Errno 2] No such file or directory Traceback (most recent call last): File "/home/buildbot/buildarea/3.x.cstratak-fedora-rawhide-aarch64.refleak/build/Lib/multiprocessing/util.py", line 300, in _run_finalizers finalizer() File "/home/buildbot/buildarea/3.x.cstratak-fedora-rawhide-aarch64.refleak/build/Lib/multiprocessing/util.py", line 224, in __call__ res = self._callback(*self._args, **self._kwargs) File "/home/buildbot/buildarea/3.x.cstratak-fedora-rawhide-aarch64.refleak/build/Lib/multiprocessing/synchronize.py", line 87, in _cleanup sem_unlink(name) FileNotFoundError: [Errno 2] No such file or directory Traceback (most recent call last): File "/home/buildbot/buildarea/3.x.cstratak-fedora-rawhide-aarch64.refleak/build/Lib/multiprocessing/util.py", line 300, in _run_finalizers finalizer() File "/home/buildbot/buildarea/3.x.cstratak-fedora-rawhide-aarch64.refleak/build/Lib/multiprocessing/util.py", line 224, in __call__ res = self._callback(*self._args, **self._kwargs) File "/home/buildbot/buildarea/3.x.cstratak-fedora-rawhide-aarch64.refleak/build/Lib/multiprocessing/synchronize.py", line 87, in _cleanup sem_unlink(name) FileNotFoundError: [Errno 2] No such file or directory Traceback (most recent call last): File "/home/buildbot/buildarea/3.x.cstratak-fedora-rawhide-aarch64.refleak/build/Lib/multiprocessing/util.py", line 300, in _run_finalizers finalizer() File "/home/buildbot/buildarea/3.x.cstratak-fedora-rawhide-aarch64.refleak/build/Lib/multiprocessing/util.py", line 224, in __call__ res = self._callback(*self._args, **self._kwargs) File "/home/buildbot/buildarea/3.x.cstratak-fedora-rawhide-aarch64.refleak/build/Lib/multiprocessing/synchronize.py", line 87, in _cleanup sem_unlink(name) FileNotFoundError: [Errno 2] No such file or directory .
Traceback (most recent call last): File "/home/buildbot/buildarea/3.x.cstratak-fedora-rawhide-aarch64.refleak/build/Lib/test/test_glob.py", line 368, in test_selflink self.assertIn(path, results) AssertionError: 'dir/link/link/link/link/link/link/link/link/link/link/link/link/link/link/link/link/link/link/link/link/link/link/link/link/link/link/link/file' not found in {'dir/link/link/link/link/link/link/link/link/link/link/link/link/link/link/link/link/link/link/link/link/link/link/link/link/link/link/link/link/link/file', 'dir/link/link/link/link/link/link/link/link/link/link/link/link/link/link/link/link/link/link/link/link/link/link/link/link/link/link/link/link/link/link/link/file', 'dir/link/link/link/link/link/link/link/link/link/link/link/link/link/link/link/link/link/link/link/link/link/link/link/link/link/link/link/link/link/link/link/link/file', 'dir/link/link/link/link/link/link/link/link/link/link/link/link/link/link/link/link/link/link/link/link/link/link/link/link/link/link/link/link/link/link/link/link/link/link/link/link/link/link/link/link/file', 'dir/link/link/link/link/link/link/link/link/link/link/link/link/link/link/link/link/link/link/link/link/link/link /link/link/link/link/link/link/link/link/file', 'dir/link/link/link/link/link/link/link/link/link/link/link/link/link/link/link/link/link/link/link/link/link/link/link/link/link/link/link/link/link/link/link/link/link/link/link/file', 'dir/link/link/link/link/link/link/link/link/link/link/link/link/link/link/link/link/link/link/link/link/link/link/link/link/link/link/link/link/link/link/link/link/link/link/link/link/link/link/file', 'dir/link/link/link/link/link/link/link/link/link/link/link/link/link/link/link/link/link/link/link/link/link/link/link/link/link/link/link/link/link/link/link/link/link/link/link/link/link/link/link/file', 'dir/link/link/link/link/link/link/link/link/link/link/link/link/link/link/link/link/link/link/link/link/link/link/link/link/link/link/link/link/file', 'dir/link/link/link/link/link/link/link/link/link/link/link/link/link/link/link/link/link/link/link/link/link/link/link/link/link/link/link/link/link/link/link/link/link/link/file', 'dir/link/link/link /link/link/link/link/link/link/link/link/link/link/li nk/link/link/link/link/link/link/link/link/link/link/link/link/link/link/link/link/link/link/link/link/link/link/link/file'}
Test report
Failed tests:
- test_coroutines
- test_glob
- test_asyncgen
- test_unittest
- test_asyncio
Test leaking resources:
- test_asyncio: references
- test_asyncgen: references
- test_coroutines: references
- test_asyncio: memory blocks
- test_asyncgen: memory blocks
- test_coroutines: memory blocks
- test_unittest: references
- test_unittest: memory blocks
Sincerely, -The Buildbot
Buildbot-status mailing list -- buildbot-status@python.org To unsubscribe send an email to buildbot-status-leave@python.org https://mail.python.org/mailman3/lists/buildbot-status.python.org/ Member address: vstinner@python.org
-- Night gathers, and now my watch begins. It shall not end until my death.
participants (2)
-
buildbot@python.org -
Victor Stinner