☠ Buildbot (Python): python/cpython - failed test (failure) (3.13)
The Buildbot has detected a new failure on builder ARM64 macOS 3.13 while building python/cpython. Full details are available at: https://buildbot.python.org/#/builders/1404/builds/1404
Buildbot URL: https://buildbot.python.org/
Worker for this Build: pablogsal-macos-m1
Build Reason: <unknown> Blamelist: Gregory P. Smith <68491+gpshead@users.noreply.github.com>
BUILD FAILED: failed test (failure)
Summary of the results of the build (if available):
==
Captured traceback
Traceback (most recent call last): File "/Users/buildbot/buildarea/3.13.pablogsal-macos-m1.macos-with-brew/build/Lib/test/support/__init__.py", line 845, in gc_collect gc.collect() ResourceWarning: unclosed <socket.socket fd=7, family=2, type=1, proto=6, laddr=('192.168.0.101', 62595), raddr=('68.183.26.59', 21)>
Traceback (most recent call last): File "/Users/buildbot/buildarea/3.13.pablogsal-macos-m1.macos-with-brew/build/Lib/socket.py", line 790, in close self._sock = None ResourceWarning: unclosed <socket.socket fd=6, family=2, type=1, proto=6, laddr=('192.168.0.101', 62526), raddr=('68.183.26.59', 21)> Warning -- Unraisable exception Exception ignored in: <socket.socket fd=7, family=2, type=1, proto=6, laddr=('192.168.0.101', 62528), raddr=('68.183.26.59', 21)> Traceback (most recent call last): File "/Users/buildbot/buildarea/3.13.pablogsal-macos-m1.macos-with-brew/build/Lib/socket.py", line 790, in close self._sock = None ResourceWarning: unclosed <socket.socket fd=7, family=2, type=1, proto=6, laddr=('192.168.0.101', 62528), raddr=('68.183.26.59', 21)> skipped "Resource 'ftp://www.pythontest.net/' is not available"
Traceback (most recent call last): File "/Users/buildbot/buildarea/3.13.pablogsal-macos-m1.macos-with-brew/build/Lib/socket.py", line 790, in close self._sock = None ResourceWarning: unclosed <socket.socket fd=7, family=2, type=1, proto=6, laddr=('192.168.0.101', 62571), raddr=('68.183.26.59', 21)> Warning -- Unraisable exception Exception ignored in: <socket.socket fd=8, family=2, type=1, proto=6, laddr=('192.168.0.101', 62573), raddr=('68.183.26.59', 21)> Traceback (most recent call last): File "/Users/buildbot/buildarea/3.13.pablogsal-macos-m1.macos-with-brew/build/Lib/socket.py", line 790, in close self._sock = None ResourceWarning: unclosed <socket.socket fd=8, family=2, type=1, proto=6, laddr=('192.168.0.101', 62573), raddr=('68.183.26.59', 21)> skipped "Resource 'ftp://www.pythontest.net/' is not available"
Traceback (most recent call last): File "/Users/buildbot/buildarea/3.13.pablogsal-macos-m1.macos-with-brew/build/Lib/socket.py", line 790, in close self._sock = None ResourceWarning: unclosed <socket.socket fd=8, family=2, type=1, proto=6, laddr=('192.168.0.101', 62539), raddr=('68.183.26.59', 21)> Warning -- Unraisable exception Exception ignored in: <socket.socket fd=9, family=2, type=1, proto=6, laddr=('192.168.0.101', 62541), raddr=('68.183.26.59', 21)> Traceback (most recent call last): File "/Users/buildbot/buildarea/3.13.pablogsal-macos-m1.macos-with-brew/build/Lib/socket.py", line 790, in close self._sock = None ResourceWarning: unclosed <socket.socket fd=9, family=2, type=1, proto=6, laddr=('192.168.0.101', 62541), raddr=('68.183.26.59', 21)> skipped "Resource 'ftp://www.pythontest.net/' is not available"
Traceback (most recent call last): File "/Users/buildbot/buildarea/3.13.pablogsal-macos-m1.macos-with-brew/build/Lib/test/support/socket_helper.py", line 225, in transient_internet captured_errnos = [getattr(errno, name, num) ResourceWarning: unclosed <socket.socket fd=7, family=2, type=1, proto=6, laddr=('192.168.0.101', 62575), raddr=('68.183.26.59', 21)> Warning -- Unraisable exception Exception ignored in: <socket.socket fd=8, family=2, type=1, proto=6, laddr=('192.168.0.101', 62582), raddr=('68.183.26.59', 21)> Traceback (most recent call last): File "/Users/buildbot/buildarea/3.13.pablogsal-macos-m1.macos-with-brew/build/Lib/test/support/socket_helper.py", line 225, in transient_internet captured_errnos = [getattr(errno, name, num) ResourceWarning: unclosed <socket.socket fd=8, family=2, type=1, proto=6, laddr=('192.168.0.101', 62582), raddr=('68.183.26.59', 21)> Warning -- Unraisable exception Exception ignored in: <socket.socket fd=9, family=2, type=1, proto=6, laddr=('192.168.0.101', 62588), raddr=('68.183.26.59', 21)> Traceback (most recent call last): File "/Users/buildbot/buildarea/3.13.pablogsal-macos-m1.macos-with-brew/build/Lib/test/support/socket_helper.py", line 225, in transient_internet captured_errnos = [getattr(errno, name, num) ResourceWarning: unclosed <socket.socket fd=9, family=2, type=1, proto=6, laddr=('192.168.0.101', 62588), raddr=('68.183.26.59', 21)> Warning -- Unraisable exception Exception ignored in: <socket.socket fd=7, family=2, type=1, proto=6, laddr=('192.168.0.101', 62590), raddr=('68.183.26.59', 21)> Traceback (most recent call last): File "/Users/buildbot/buildarea/3.13.pablogsal-macos-m1.macos-with-brew/build/Lib/socket.py", line 790, in close self._sock = None ResourceWarning: unclosed <socket.socket fd=7, family=2, type=1, proto=6, laddr=('192.168.0.101', 62590), raddr=('68.183.26.59', 21)> Warning -- Unraisable exception Exception ignored in: <socket.socket fd=8, family=2, type=1, proto=6, laddr=('192.168.0.101', 62593), raddr=('68.183.26.59', 21)> Traceback (most recent call last): File "/Users/buildbot/buildarea/3.13.pablogsal-macos-m1.macos-with-brew/build/Lib/socket.py", line 790, in close self._sock = None ResourceWarning: unclosed <socket.socket fd=8, family=2, type=1, proto=6, laddr=('192.168.0.101', 62593), raddr=('68.183.26.59', 21)> skipped "Resource 'ftp://www.pythontest.net/' is not available"
Traceback (most recent call last): File "/Users/buildbot/buildarea/3.13.pablogsal-macos-m1.macos-with-brew/build/Lib/socket.py", line 790, in close self._sock = None ResourceWarning: unclosed <socket.socket fd=9, family=2, type=1, proto=6, laddr=('192.168.0.101', 62584), raddr=('68.183.26.59', 21)> Warning -- Unraisable exception Exception ignored in: <socket.socket fd=10, family=2, type=1, proto=6, laddr=('192.168.0.101', 62586), raddr=('68.183.26.59', 21)> Traceback (most recent call last): File "/Users/buildbot/buildarea/3.13.pablogsal-macos-m1.macos-with-brew/build/Lib/socket.py", line 790, in close self._sock = None ResourceWarning: unclosed <socket.socket fd=10, family=2, type=1, proto=6, laddr=('192.168.0.101', 62586), raddr=('68.183.26.59', 21)> skipped "Resource 'ftp://www.pythontest.net/' is not available"
Traceback (most recent call last): File "/Users/buildbot/buildarea/3.13.pablogsal-macos-m1.macos-with-brew/build/Lib/socket.py", line 790, in close self._sock = None ResourceWarning: unclosed <socket.socket fd=9, family=2, type=1, proto=6, laddr=('192.168.0.101', 62546), raddr=('68.183.26.59', 21)> Timeout (0:20:00)! Thread 0x00000001f9324800 (most recent call first): File "/Users/buildbot/buildarea/3.13.pablogsal-macos-m1.macos-with-brew/build/Lib/socket.py", line 849 in create_connection File "/Users/buildbot/buildarea/3.13.pablogsal-macos-m1.macos-with-brew/build/Lib/ftplib.py", line 354 in ntransfercmd File "/Users/buildbot/buildarea/3.13.pablogsal-macos-m1.macos-with-brew/build/Lib/urllib/request.py", line 2458 in retrfile File "/Users/buildbot/buildarea/3.13.pablogsal-macos-m1.macos-with-brew/build/Lib/urllib/request.py", line 1548 in ftp_open File "/Users/buildbot/buildarea/3.13.pablogsal-macos-m1.macos-with-brew/build/Lib/urllib/request.py", line 466 in _call_chain File "/Users/buildbot/buildarea/3.13.pablogsal-macos-m1.macos-with-brew/build/Lib/urllib/request.py", line 506 in _open File "/Users/buildbot/buildarea/3.13.pablogsal-macos-m1.macos-with-brew/build/Lib/urllib/request.py", line 489 in open File "/Users/buildbot/buildarea/3.13.pablogsal-macos-m1.macos-with-brew/build/Lib/urllib/request.py", line 189 in urlopen File "/Users/buildbot/buildarea/3.13.pablogsal-macos-m1.macos-with-brew/build/Lib/test/test_urllib2net.py", line 21 in _retry_thrice File "/Users/buildbot/buildarea/3.13.pablogsal-macos-m1.macos-with-brew/build/Lib/test/test_urllib2net.py", line 29 in wrapped File "/Users/buildbot/buildarea/3.13.pablogsal-macos-m1.macos-with-brew/build/Lib/test/test_urllib2net.py", line 373 in test_ftp_timeout File "/Users/buildbot/buildarea/3.13.pablogsal-macos-m1.macos-with-brew/build/Lib/unittest/case.py", line 606 in _callTestMethod File "/Users/buildbot/buildarea/3.13.pablogsal-macos-m1.macos-with-brew/build/Lib/unittest/case.py", line 651 in run File "/Users/buildbot/buildarea/3.13.pablogsal-macos-m1.macos-with-brew/build/Lib/unittest/case.py", line 707 in __call__ File "/Users/buildbot/buildarea/3.13.pablogsal-macos-m1.macos-with-brew/build/Lib/unittest/suite.py", line 122 in run File "/Users/buildbot/buildarea/3.13.pablogsal-macos-m1.macos-with-brew/build/Lib/unittest/suite.py", line 84 in __call__ File "/Users/buildbot/buildarea/3.13.pablogsal-macos-m1.macos-with-brew/build/Lib/unittest/suite.py", line 122 in run File "/Users/buildbot/buildarea/3.13.pablogsal-macos-m1.macos-with-brew/build/Lib/unittest/suite.py", line 84 in __call__ File "/Users/buildbot/buildarea/3.13.pablogsal-macos-m1.macos-with-brew/build/Lib/unittest/runner.py", line 240 in run File "/Users/buildbot/buildarea/3.13.pablogsal-macos-m1.macos-with-brew/build/Lib/test/libregrtest/single.py", line 57 in _run_suite File "/Users/buildbot/buildarea/3.13.pablogsal-macos-m1.macos-with-brew/build/Lib/test/libregrtest/single.py", line 37 in run_unittest File "/Users/buildbot/buildarea/3.13.pablogsal-macos-m1.macos-with-brew/build/Lib/test/libregrtest/single.py", line 135 in test_func File "/Users/buildbot/buildarea/3.13.pablogsal-macos-m1.macos-with-brew/build/Lib/test/libregrtest/single.py", line 91 in regrtest_runner File "/Users/buildbot/buildarea/3.13.pablogsal-macos-m1.macos-with-brew/build/Lib/test/libregrtest/single.py", line 138 in _load_run_test File "/Users/buildbot/buildarea/3.13.pablogsal-macos-m1.macos-with-brew/build/Lib/test/libregrtest/single.py", line 181 in _runtest_env_changed_exc File "/Users/buildbot/buildarea/3.13.pablogsal-macos-m1.macos-with-brew/build/Lib/test/libregrtest/single.py", line 281 in _runtest File "/Users/buildbot/buildarea/3.13.pablogsal-macos-m1.macos-with-brew/build/Lib/test/libregrtest/single.py", line 310 in run_single_test File "/Users/buildbot/buildarea/3.13.pablogsal-macos-m1.macos-with-brew/build/Lib/test/libregrtest/worker.py", line 84 in worker_process File "/Users/buildbot/buildarea/3.13.pablogsal-macos-m1.macos-with-brew/build/Lib/test/libregrtest/worker.py", line 119 in main File "/Users/buildbot/buildarea/3.13.pablogsal-macos-m1.macos-with-brew/build/Lib/test/libregrtest/worker.py", line 123 in <module> File "/Users/buildbot/buildarea/3.13.pablogsal-macos-m1.macos-with-brew/build/Lib/runpy.py", line 88 in _run_code File "/Users/buildbot/buildarea/3.13.pablogsal-macos-m1.macos-with-brew/build/Lib/runpy.py", line 198 in _run_module_as_main
Traceback (most recent call last): File "/Users/buildbot/buildarea/3.13.pablogsal-macos-m1.macos-with-brew/build/Lib/socket.py", line 790, in close self._sock = None ResourceWarning: unclosed <socket.socket fd=8, family=2, type=1, proto=6, laddr=('192.168.0.101', 62577), raddr=('68.183.26.59', 21)> Warning -- Unraisable exception Exception ignored in: <socket.socket fd=9, family=2, type=1, proto=6, laddr=('192.168.0.101', 62580), raddr=('68.183.26.59', 21)> Traceback (most recent call last): File "/Users/buildbot/buildarea/3.13.pablogsal-macos-m1.macos-with-brew/build/Lib/socket.py", line 790, in close self._sock = None ResourceWarning: unclosed <socket.socket fd=9, family=2, type=1, proto=6, laddr=('192.168.0.101', 62580), raddr=('68.183.26.59', 21)> skipped "Resource 'ftp://www.pythontest.net/' is not available"
Traceback (most recent call last): File "/Users/buildbot/buildarea/3.13.pablogsal-macos-m1.macos-with-brew/build/Lib/socket.py", line 790, in close self._sock = None ResourceWarning: unclosed <socket.socket fd=7, family=2, type=1, proto=6, laddr=('192.168.0.101', 62533), raddr=('68.183.26.59', 21)> Warning -- Unraisable exception Exception ignored in: <socket.socket fd=8, family=2, type=1, proto=6, laddr=('192.168.0.101', 62535), raddr=('68.183.26.59', 21)> Traceback (most recent call last): File "/Users/buildbot/buildarea/3.13.pablogsal-macos-m1.macos-with-brew/build/Lib/socket.py", line 790, in close self._sock = None ResourceWarning: unclosed <socket.socket fd=8, family=2, type=1, proto=6, laddr=('192.168.0.101', 62535), raddr=('68.183.26.59', 21)> skipped "Resource 'ftp://www.pythontest.net/' is not available"
Test report
Failed tests:
- test_urllib2net
Sincerely, -The Buildbot
participants (1)
-
buildbot@python.org