☠ Buildbot (Python): python/cpython - failed test (failure) (main)
The Buildbot has detected a new failure on builder x86 Gentoo Installed with X 3.x while building python/cpython. Full details are available at: https://buildbot.python.org/all/#builders/464/builds/3172
Buildbot URL: https://buildbot.python.org/all/
Worker for this Build: ware-gentoo-x86
Build Reason: <unknown> Blamelist: Nikita Sobolev <mail@sobolevn.me>
BUILD FAILED: failed test (failure)
Summary of the results of the build (if available):
== Tests result: FAILURE then FAILURE ==
417 tests OK.
1 test failed: test_unicode
17 tests skipped: test_asdl_parser test_check_c_globals test_clinic test_dbm_ndbm test_devpoll test_gdb test_ioctl test_kqueue test_launcher test_msilib test_perf_profiler test_startfile test_winconsoleio test_winreg test_winsound test_wmi test_zipfile64
1 re-run test: test_unicode
Total duration: 53 min 22 sec
Captured traceback
Traceback (most recent call last): File "/buildbot/buildarea/cpython/3.x.ware-gentoo-x86.installed/build/target/lib/python3.12/test/test_unicode.py", line 2817, in test_from_format self.assertRegex(p_format1, p_format_regex) AssertionError: Regex didn't match: '^0x[a-zA-Z0-9]{8,}$' not found in '0x8bd9f0'
Traceback (most recent call last): File "/buildbot/buildarea/cpython/3.x.ware-gentoo-x86.installed/build/target/lib/python3.12/test/test_unicode.py", line 2817, in test_from_format self.assertRegex(p_format1, p_format_regex) AssertionError: Regex didn't match: '^0x[a-zA-Z0-9]{8,}$' not found in '0x9809f0'
Test report
Failed tests:
- test_unicode
Failed subtests:
- test_from_format - test.test_unicode.CAPITest.test_from_format
Sincerely, -The BuildbotThe Buildbot has detected a new failure on builder aarch64 CentOS9 LTO 3.x while building python/cpython. Full details are available at: https://buildbot.python.org/all/#builders/882/builds/2134
Buildbot URL: https://buildbot.python.org/all/
Worker for this Build: cstratak-CentOS9-aarch64
Build Reason: <unknown> Blamelist: Nikita Sobolev <mail@sobolevn.me>
BUILD FAILED: failed test (failure)
Summary of the results of the build (if available):
== Tests result: FAILURE then FAILURE ==
421 tests OK.
10 slowest tests:
- test_gdb: 4 min 9 sec
- test_concurrent_futures: 2 min 35 sec
- test_multiprocessing_spawn: 2 min 5 sec
- test_asyncio: 1 min 42 sec
- test_multiprocessing_forkserver: 1 min 19 sec
- test_multiprocessing_fork: 1 min 11 sec
- test_nntplib: 1 min 6 sec
- test_tokenize: 57.1 sec
- test_signal: 50.6 sec
- test_io: 42.3 sec
1 test failed: test_unicode
15 tests skipped: test_devpoll test_ioctl test_kqueue test_launcher test_msilib test_nis test_startfile test_tix test_tkinter test_ttk test_winconsoleio test_winreg test_winsound test_wmi test_zipfile64
1 re-run test: test_unicode
Total duration: 4 min 17 sec
Captured traceback
Traceback (most recent call last): File "/home/buildbot/buildarea/3.x.cstratak-CentOS9-aarch64.lto/build/Lib/test/test_unicode.py", line 2817, in test_from_format self.assertRegex(p_format1, p_format_regex) AssertionError: Regex didn't match: '^0x[a-zA-Z0-9]{8,}$' not found in '0x89d730'
Test report
Failed tests:
- test_unicode
Failed subtests:
- test_from_format - test.test_unicode.CAPITest.test_from_format
Sincerely, -The BuildbotThe Buildbot has detected a new failure on builder AMD64 CentOS9 LTO 3.x while building python/cpython. Full details are available at: https://buildbot.python.org/all/#builders/831/builds/1568
Buildbot URL: https://buildbot.python.org/all/
Worker for this Build: cstratak-CentOS9-x86_64
Build Reason: <unknown> Blamelist: Nikita Sobolev <mail@sobolevn.me>
BUILD FAILED: failed test (failure)
Summary of the results of the build (if available):
== Tests result: FAILURE then FAILURE ==
421 tests OK.
10 slowest tests:
- test_concurrent_futures: 2 min 31 sec
- test_gdb: 2 min 14 sec
- test_multiprocessing_spawn: 1 min 46 sec
- test_asyncio: 1 min 26 sec
- test_multiprocessing_forkserver: 1 min 16 sec
- test_multiprocessing_fork: 1 min 6 sec
- test_signal: 59.6 sec
- test_io: 36.3 sec
- test_socket: 32.9 sec
- test_xmlrpc: 27.7 sec
1 test failed: test_unicode
15 tests skipped: test_devpoll test_ioctl test_kqueue test_launcher test_msilib test_nis test_startfile test_tix test_tkinter test_ttk test_winconsoleio test_winreg test_winsound test_wmi test_zipfile64
1 re-run test: test_unicode
Total duration: 4 min 51 sec
Captured traceback
Traceback (most recent call last): File "/home/buildbot/buildarea/3.x.cstratak-CentOS9-x86_64.lto/build/Lib/test/test_unicode.py", line 2817, in test_from_format self.assertRegex(p_format1, p_format_regex) AssertionError: Regex didn't match: '^0x[a-zA-Z0-9]{8,}$' not found in '0x8362a0'
Test report
Failed tests:
- test_unicode
Failed subtests:
- test_from_format - test.test_unicode.CAPITest.test_from_format
Sincerely, -The BuildbotThe Buildbot has detected a new failure on builder aarch64 CentOS9 LTO + PGO 3.x while building python/cpython. Full details are available at: https://buildbot.python.org/all/#builders/847/builds/1884
Buildbot URL: https://buildbot.python.org/all/
Worker for this Build: cstratak-CentOS9-aarch64
Build Reason: <unknown> Blamelist: Nikita Sobolev <mail@sobolevn.me>
BUILD FAILED: failed test (failure)
Summary of the results of the build (if available):
== Tests result: FAILURE then FAILURE ==
420 tests OK.
10 slowest tests:
- test_concurrent_futures: 2 min 35 sec
- test_multiprocessing_spawn: 2 min 26 sec
- test_asyncio: 2 min 15 sec
- test_multiprocessing_forkserver: 1 min 26 sec
- test_multiprocessing_fork: 1 min 12 sec
- test_nntplib: 1 min 6 sec
- test_tokenize: 1 min 3 sec
- test_signal: 53.7 sec
- test_socket: 48.6 sec
- test_io: 45.6 sec
1 test failed: test_unicode
16 tests skipped: test_devpoll test_gdb test_ioctl test_kqueue test_launcher test_msilib test_nis test_startfile test_tix test_tkinter test_ttk test_winconsoleio test_winreg test_winsound test_wmi test_zipfile64
1 re-run test: test_unicode
Total duration: 2 min 49 sec
Captured traceback
Traceback (most recent call last): File "/home/buildbot/buildarea/3.x.cstratak-CentOS9-aarch64.lto-pgo/build/Lib/test/test_unicode.py", line 2817, in test_from_format self.assertRegex(p_format1, p_format_regex) AssertionError: Regex didn't match: '^0x[a-zA-Z0-9]{8,}$' not found in '0x81d720'
Test report
Failed tests:
- test_unicode
Failed subtests:
- test_from_format - test.test_unicode.CAPITest.test_from_format
Sincerely, -The BuildbotThe Buildbot has detected a new failure on builder AMD64 FreeBSD Non-Debug 3.x while building python/cpython. Full details are available at: https://buildbot.python.org/all/#builders/172/builds/2913
Buildbot URL: https://buildbot.python.org/all/
Worker for this Build: koobs-freebsd-9e36
Build Reason: <unknown> Blamelist: Nikita Sobolev <mail@sobolevn.me>
BUILD FAILED: failed test (failure)
Summary of the results of the build (if available):
== Tests result: FAILURE then FAILURE ==
415 tests OK.
10 slowest tests:
- test_multiprocessing_spawn: 4 min 3 sec
- test_tokenize: 3 min 40 sec
- test_asyncio: 3 min 18 sec
- test_concurrent_futures: 3 min 9 sec
- test_multiprocessing_forkserver: 2 min 19 sec
- test_unparse: 2 min 10 sec
- test_lib2to3: 2 min 3 sec
- test_unicodedata: 1 min 48 sec
- test_subprocess: 1 min 37 sec
- test_multiprocessing_fork: 1 min 36 sec
1 test failed: test_unicode
21 tests skipped: test_dbm_gnu test_devpoll test_epoll test_idle test_ioctl test_launcher test_msilib test_perf_profiler test_spwd test_startfile test_tcl test_tix test_tkinter test_ttk test_ttk_textonly test_turtle test_winconsoleio test_winreg test_winsound test_wmi test_zipfile64
1 re-run test: test_unicode
Total duration: 17 min
Captured traceback
Traceback (most recent call last): File "/usr/home/buildbot/python/3.x.koobs-freebsd-9e36.nondebug/build/Lib/test/test_unicode.py", line 2817, in test_from_format self.assertRegex(p_format1, p_format_regex) AssertionError: Regex didn't match: '^0x[a-zA-Z0-9]{8,}$' not found in '0x612bd0'
Test report
Failed tests:
- test_unicode
Failed subtests:
- test_from_format - test.test_unicode.CAPITest.test_from_format
Sincerely, -The BuildbotThe Buildbot has detected a new failure on builder AMD64 CentOS9 LTO + PGO 3.x while building python/cpython. Full details are available at: https://buildbot.python.org/all/#builders/864/builds/1649
Buildbot URL: https://buildbot.python.org/all/
Worker for this Build: cstratak-CentOS9-x86_64
Build Reason: <unknown> Blamelist: Nikita Sobolev <mail@sobolevn.me>
BUILD FAILED: failed test (failure)
Summary of the results of the build (if available):
== Tests result: FAILURE then FAILURE ==
420 tests OK.
10 slowest tests:
- test_concurrent_futures: 2 min 21 sec
- test_multiprocessing_spawn: 1 min 26 sec
- test_asyncio: 1 min 15 sec
- test_multiprocessing_forkserver: 1 min 9 sec
- test_multiprocessing_fork: 1 min 2 sec
- test_signal: 1 min 1 sec
- test_io: 48.3 sec
- test_socket: 33.0 sec
- test_xmlrpc: 27.5 sec
- test_shelve: 27.4 sec
1 test failed: test_unicode
16 tests skipped: test_devpoll test_gdb test_ioctl test_kqueue test_launcher test_msilib test_nis test_startfile test_tix test_tkinter test_ttk test_winconsoleio test_winreg test_winsound test_wmi test_zipfile64
1 re-run test: test_unicode
Total duration: 4 min 33 sec
Captured traceback
Traceback (most recent call last): File "/home/buildbot/buildarea/3.x.cstratak-CentOS9-x86_64.lto-pgo/build/Lib/test/test_unicode.py", line 2817, in test_from_format self.assertRegex(p_format1, p_format_regex) AssertionError: Regex didn't match: '^0x[a-zA-Z0-9]{8,}$' not found in '0x7d72a0'
Test report
Failed tests:
- test_unicode
Failed subtests:
- test_from_format - test.test_unicode.CAPITest.test_from_format
Sincerely, -The BuildbotThe Buildbot has detected a new failure on builder AMD64 Fedora Rawhide LTO + PGO 3.x while building python/cpython. Full details are available at: https://buildbot.python.org/all/#builders/79/builds/3084
Buildbot URL: https://buildbot.python.org/all/
Worker for this Build: cstratak-fedora-rawhide-x86_64
Build Reason: <unknown> Blamelist: Nikita Sobolev <mail@sobolevn.me>
BUILD FAILED: failed test (failure)
Summary of the results of the build (if available):
== Tests result: FAILURE then FAILURE ==
421 tests OK.
10 slowest tests:
- test_concurrent_futures: 2 min 32 sec
- test_multiprocessing_spawn: 2 min 12 sec
- test_asyncio: 1 min 36 sec
- test_multiprocessing_forkserver: 1 min 36 sec
- test_multiprocessing_fork: 1 min 27 sec
- test_largefile: 1 min 13 sec
- test_nntplib: 1 min 7 sec
- test_socket: 49.4 sec
- test_signal: 49.2 sec
- test_io: 40.7 sec
1 test failed: test_unicode
15 tests skipped: test_devpoll test_gdb test_ioctl test_kqueue test_launcher test_msilib test_startfile test_tix test_tkinter test_ttk test_winconsoleio test_winreg test_winsound test_wmi test_zipfile64
1 re-run test: test_unicode
Total duration: 4 min 33 sec
Captured traceback
Traceback (most recent call last): File "/home/buildbot/buildarea/3.x.cstratak-fedora-rawhide-x86_64.lto-pgo/build/Lib/test/test_unicode.py", line 2817, in test_from_format self.assertRegex(p_format1, p_format_regex) AssertionError: Regex didn't match: '^0x[a-zA-Z0-9]{8,}$' not found in '0x7d42a0'
Test report
Failed tests:
- test_unicode
Failed subtests:
- test_from_format - test.test_unicode.CAPITest.test_from_format
Sincerely, -The BuildbotThe Buildbot has detected a new failure on builder s390x SLES 3.x while building python/cpython. Full details are available at: https://buildbot.python.org/all/#builders/540/builds/3747
Buildbot URL: https://buildbot.python.org/all/
Worker for this Build: edelsohn-sles-z
Build Reason: <unknown> Blamelist: Nikita Sobolev <mail@sobolevn.me>
BUILD FAILED: failed test (failure)
Summary of the results of the build (if available):
== Tests result: FAILURE then FAILURE ==
420 tests OK.
10 slowest tests:
- test_concurrent_futures: 2 min 51 sec
- test_tools: 2 min 34 sec
- test_multiprocessing_spawn: 1 min 51 sec
- test_asyncio: 1 min 17 sec
- test_multiprocessing_forkserver: 1 min 14 sec
- test_signal: 1 min 10 sec
- test_multiprocessing_fork: 1 min 8 sec
- test_nntplib: 1 min 5 sec
- test_capi: 52.3 sec
- test_tokenize: 48.6 sec
1 test failed: test_unicode
16 tests skipped: test_devpoll test_ioctl test_kqueue test_launcher test_msilib test_nis test_perf_profiler test_startfile test_tix test_tkinter test_ttk test_winconsoleio test_winreg test_winsound test_wmi test_zipfile64
1 re-run test: test_unicode
Total duration: 5 min 53 sec
Captured traceback
Traceback (most recent call last): File "/home/dje/cpython-buildarea/3.x.edelsohn-sles-z/build/Lib/test/test_unicode.py", line 2817, in test_from_format self.assertRegex(p_format1, p_format_regex) AssertionError: Regex didn't match: '^0x[a-zA-Z0-9]{8,}$' not found in '0x153b8c0'
Test report
Failed tests:
- test_unicode
Failed subtests:
- test_from_format - test.test_unicode.CAPITest.test_from_format
Sincerely, -The BuildbotThe Buildbot has detected a new failure on builder s390x Fedora Rawhide 3.x while building python/cpython. Full details are available at: https://buildbot.python.org/all/#builders/538/builds/1718
Buildbot URL: https://buildbot.python.org/all/
Worker for this Build: edelsohn-fedora-rawhide-z
Build Reason: <unknown> Blamelist: Nikita Sobolev <mail@sobolevn.me>
BUILD FAILED: failed test (failure)
Summary of the results of the build (if available):
== Tests result: FAILURE then FAILURE ==
419 tests OK.
10 slowest tests:
- test_tools: 8 min 31 sec
- test_multiprocessing_spawn: 3 min 45 sec
- test_concurrent_futures: 3 min 4 sec
- test_multiprocessing_forkserver: 2 min 8 sec
- test_asyncio: 1 min 54 sec
- test_zipfile: 1 min 34 sec
- test_multiprocessing_fork: 1 min 31 sec
- test_tokenize: 1 min 18 sec
- test_capi: 1 min 18 sec
- test_nntplib: 1 min 6 sec
1 test failed: test_unicode
17 tests skipped: test_devpoll test_gdb test_ioctl test_kqueue test_launcher test_msilib test_nis test_perf_profiler test_startfile test_tix test_tkinter test_ttk test_winconsoleio test_winreg test_winsound test_wmi test_zipfile64
1 re-run test: test_unicode
Total duration: 10 min 32 sec
Captured traceback
Traceback (most recent call last): File "/home/dje/cpython-buildarea/3.x.edelsohn-fedora-rawhide-z/build/Lib/test/test_unicode.py", line 2817, in test_from_format self.assertRegex(p_format1, p_format_regex) AssertionError: Regex didn't match: '^0x[a-zA-Z0-9]{8,}$' not found in '0x14d3da8'
Test report
Failed tests:
- test_unicode
Failed subtests:
- test_from_format - test.test_unicode.CAPITest.test_from_format
Sincerely, -The Buildbot
participants (1)
-
buildbot@python.org