☠ Buildbot (Python): python/cpython - failed test (failure) (3.14)
The Buildbot has detected a new failure on builder ARM64 macOS 3.14 while building python/cpython. Full details are available at: https://buildbot.python.org/#/builders/1772/builds/707
Buildbot URL: https://buildbot.python.org/
Worker for this Build: pablogsal-macos-m1
Build Reason: <unknown> Blamelist: Miss Islington (bot) <31488909+miss-islington@users.noreply.github.com>
BUILD FAILED: failed test (failure)
Summary of the results of the build (if available):
==
Captured traceback
Traceback (most recent call last): File "/Users/buildbot/buildarea/3.14.pablogsal-macos-m1.macos-with-brew/build/Lib/test/support/__init__.py", line 847, in gc_collect gc.collect() ResourceWarning: unclosed <socket.socket fd=6, family=2, type=1, proto=6, laddr=('192.168.0.101', 60536), raddr=('68.183.26.59', 21)> Warning -- Unraisable exception Exception ignored while finalizing socket <socket.socket fd=8, family=2, type=1, proto=6, laddr=('192.168.0.101', 60542), raddr=('68.183.26.59', 21)>: Traceback (most recent call last): File "/Users/buildbot/buildarea/3.14.pablogsal-macos-m1.macos-with-brew/build/Lib/test/support/__init__.py", line 847, in gc_collect gc.collect() ResourceWarning: unclosed <socket.socket fd=8, family=2, type=1, proto=6, laddr=('192.168.0.101', 60542), raddr=('68.183.26.59', 21)> Warning -- Unraisable exception Exception ignored while finalizing socket <socket.socket fd=9, family=2, type=1, proto=6, laddr=('192.168.0.101', 60548), raddr=('68.183.26.59', 21)>: Traceback (most recent call last): File "/Users/buildbot/buildarea/3.14.pablogsal-macos-m1.macos-with-brew/build/Lib/test/support/__init__.py", line 847, in gc_collect gc.collect() ResourceWarning: unclosed <socket.socket fd=9, family=2, type=1, proto=6, laddr=('192.168.0.101', 60548), raddr=('68.183.26.59', 21)> Warning -- Unraisable exception Exception ignored while finalizing socket <socket.socket fd=10, family=2, type=1, proto=6, laddr=('192.168.0.101', 60556), raddr=('68.183.26.59', 21)>: Traceback (most recent call last): File "/Users/buildbot/buildarea/3.14.pablogsal-macos-m1.macos-with-brew/build/Lib/test/support/__init__.py", line 847, in gc_collect gc.collect() ResourceWarning: unclosed <socket.socket fd=10, family=2, type=1, proto=6, laddr=('192.168.0.101', 60556), raddr=('68.183.26.59', 21)>
Traceback (most recent call last): File "/Users/buildbot/buildarea/3.14.pablogsal-macos-m1.macos-with-brew/build/Lib/test/support/__init__.py", line 847, in gc_collect gc.collect() ResourceWarning: unclosed <socket.socket fd=7, family=2, type=1, proto=6, laddr=('192.168.0.101', 60584), raddr=('68.183.26.59', 21)> Warning -- Unraisable exception Exception ignored while finalizing socket <socket.socket fd=8, family=2, type=1, proto=6, laddr=('192.168.0.101', 60590), raddr=('68.183.26.59', 21)>: Traceback (most recent call last): File "/Users/buildbot/buildarea/3.14.pablogsal-macos-m1.macos-with-brew/build/Lib/test/support/__init__.py", line 847, in gc_collect gc.collect() ResourceWarning: unclosed <socket.socket fd=8, family=2, type=1, proto=6, laddr=('192.168.0.101', 60590), raddr=('68.183.26.59', 21)> Warning -- Unraisable exception Exception ignored while finalizing socket <socket.socket fd=9, family=2, type=1, proto=6, laddr=('192.168.0.101', 60597), raddr=('68.183.26.59', 21)>: Traceback (most recent call last): File "/Users/buildbot/buildarea/3.14.pablogsal-macos-m1.macos-with-brew/build/Lib/test/support/__init__.py", line 847, in gc_collect gc.collect() ResourceWarning: unclosed <socket.socket fd=9, family=2, type=1, proto=6, laddr=('192.168.0.101', 60597), raddr=('68.183.26.59', 21)> Warning -- Unraisable exception Exception ignored while finalizing socket <socket.socket fd=10, family=2, type=1, proto=6, laddr=('192.168.0.101', 60603), raddr=('68.183.26.59', 21)>: Traceback (most recent call last): File "/Users/buildbot/buildarea/3.14.pablogsal-macos-m1.macos-with-brew/build/Lib/test/support/__init__.py", line 847, in gc_collect gc.collect() ResourceWarning: unclosed <socket.socket fd=10, family=2, type=1, proto=6, laddr=('192.168.0.101', 60603), raddr=('68.183.26.59', 21)>
Traceback (most recent call last): File "/Users/buildbot/buildarea/3.14.pablogsal-macos-m1.macos-with-brew/build/Lib/test/test_urllib2net.py", line 22, in _retry_thrice last_exc = e ResourceWarning: unclosed <socket.socket fd=7, family=2, type=1, proto=6, laddr=('192.168.0.101', 60580), raddr=('68.183.26.59', 21)> Warning -- Unraisable exception Exception ignored while finalizing socket <socket.socket fd=8, family=2, type=1, proto=6, laddr=('192.168.0.101', 60582), raddr=('68.183.26.59', 21)>: Traceback (most recent call last): File "/Users/buildbot/buildarea/3.14.pablogsal-macos-m1.macos-with-brew/build/Lib/test/test_urllib2net.py", line 22, in _retry_thrice last_exc = e ResourceWarning: unclosed <socket.socket fd=8, family=2, type=1, proto=6, laddr=('192.168.0.101', 60582), raddr=('68.183.26.59', 21)> skipped "Resource 'ftp://www.pythontest.net/' is not available"
Traceback (most recent call last): File "/Users/buildbot/buildarea/3.14.pablogsal-macos-m1.macos-with-brew/build/Lib/test/test_urllib2net.py", line 22, in _retry_thrice last_exc = e ResourceWarning: unclosed <socket.socket fd=9, family=2, type=1, proto=6, laddr=('192.168.0.101', 60592), raddr=('68.183.26.59', 21)> Warning -- Unraisable exception Exception ignored while finalizing socket <socket.socket fd=10, family=2, type=1, proto=6, laddr=('192.168.0.101', 60595), raddr=('68.183.26.59', 21)>: Traceback (most recent call last): File "/Users/buildbot/buildarea/3.14.pablogsal-macos-m1.macos-with-brew/build/Lib/test/test_urllib2net.py", line 22, in _retry_thrice last_exc = e ResourceWarning: unclosed <socket.socket fd=10, family=2, type=1, proto=6, laddr=('192.168.0.101', 60595), raddr=('68.183.26.59', 21)> skipped "Resource 'ftp://www.pythontest.net/' is not available"
Traceback (most recent call last): File "/Users/buildbot/buildarea/3.14.pablogsal-macos-m1.macos-with-brew/build/Lib/test/test_urllib2net.py", line 22, in _retry_thrice last_exc = e ResourceWarning: unclosed <socket.socket fd=10, family=2, type=1, proto=6, laddr=('192.168.0.101', 60599), raddr=('68.183.26.59', 21)> Warning -- Unraisable exception Exception ignored while finalizing socket <socket.socket fd=11, family=2, type=1, proto=6, laddr=('192.168.0.101', 60601), raddr=('68.183.26.59', 21)>: Traceback (most recent call last): File "/Users/buildbot/buildarea/3.14.pablogsal-macos-m1.macos-with-brew/build/Lib/test/test_urllib2net.py", line 22, in _retry_thrice last_exc = e ResourceWarning: unclosed <socket.socket fd=11, family=2, type=1, proto=6, laddr=('192.168.0.101', 60601), raddr=('68.183.26.59', 21)> skipped "Resource 'ftp://www.pythontest.net/' is not available"
Traceback (most recent call last): File "/Users/buildbot/buildarea/3.14.pablogsal-macos-m1.macos-with-brew/build/Lib/test/test_urllib2net.py", line 22, in _retry_thrice last_exc = e ResourceWarning: unclosed <socket.socket fd=6, family=2, type=1, proto=6, laddr=('192.168.0.101', 60532), raddr=('68.183.26.59', 21)> Warning -- Unraisable exception Exception ignored while finalizing socket <socket.socket fd=8, family=2, type=1, proto=6, laddr=('192.168.0.101', 60534), raddr=('68.183.26.59', 21)>: Traceback (most recent call last): File "/Users/buildbot/buildarea/3.14.pablogsal-macos-m1.macos-with-brew/build/Lib/test/test_urllib2net.py", line 22, in _retry_thrice last_exc = e ResourceWarning: unclosed <socket.socket fd=8, family=2, type=1, proto=6, laddr=('192.168.0.101', 60534), raddr=('68.183.26.59', 21)> skipped "Resource 'ftp://www.pythontest.net/' is not available"
Traceback (most recent call last): File "/Users/buildbot/buildarea/3.14.pablogsal-macos-m1.macos-with-brew/build/Lib/test/test_urllib2net.py", line 22, in _retry_thrice last_exc = e ResourceWarning: unclosed <socket.socket fd=10, family=2, type=1, proto=6, laddr=('192.168.0.101', 60550), raddr=('68.183.26.59', 21)> Warning -- Unraisable exception Exception ignored while finalizing socket <socket.socket fd=11, family=2, type=1, proto=6, laddr=('192.168.0.101', 60554), raddr=('68.183.26.59', 21)>: Traceback (most recent call last): File "/Users/buildbot/buildarea/3.14.pablogsal-macos-m1.macos-with-brew/build/Lib/test/test_urllib2net.py", line 22, in _retry_thrice last_exc = e ResourceWarning: unclosed <socket.socket fd=11, family=2, type=1, proto=6, laddr=('192.168.0.101', 60554), raddr=('68.183.26.59', 21)> skipped "Resource 'ftp://www.pythontest.net/' is not available"
Traceback (most recent call last): File "/Users/buildbot/buildarea/3.14.pablogsal-macos-m1.macos-with-brew/build/Lib/test/test_urllib2net.py", line 22, in _retry_thrice last_exc = e ResourceWarning: unclosed <socket.socket fd=8, family=2, type=1, proto=6, laddr=('192.168.0.101', 60538), raddr=('68.183.26.59', 21)> Warning -- Unraisable exception Exception ignored while finalizing socket <socket.socket fd=9, family=2, type=1, proto=6, laddr=('192.168.0.101', 60540), raddr=('68.183.26.59', 21)>: Traceback (most recent call last): File "/Users/buildbot/buildarea/3.14.pablogsal-macos-m1.macos-with-brew/build/Lib/test/test_urllib2net.py", line 22, in _retry_thrice last_exc = e ResourceWarning: unclosed <socket.socket fd=9, family=2, type=1, proto=6, laddr=('192.168.0.101', 60540), raddr=('68.183.26.59', 21)> skipped "Resource 'ftp://www.pythontest.net/' is not available"
Traceback (most recent call last): File "/Users/buildbot/buildarea/3.14.pablogsal-macos-m1.macos-with-brew/build/Lib/test/test_urllib2net.py", line 22, in _retry_thrice last_exc = e ResourceWarning: unclosed <socket.socket fd=8, family=2, type=1, proto=6, laddr=('192.168.0.101', 60586), raddr=('68.183.26.59', 21)> Warning -- Unraisable exception Exception ignored while finalizing socket <socket.socket fd=9, family=2, type=1, proto=6, laddr=('192.168.0.101', 60588), raddr=('68.183.26.59', 21)>: Traceback (most recent call last): File "/Users/buildbot/buildarea/3.14.pablogsal-macos-m1.macos-with-brew/build/Lib/test/test_urllib2net.py", line 22, in _retry_thrice last_exc = e ResourceWarning: unclosed <socket.socket fd=9, family=2, type=1, proto=6, laddr=('192.168.0.101', 60588), raddr=('68.183.26.59', 21)> skipped "Resource 'ftp://www.pythontest.net/' is not available"
Traceback (most recent call last): File "/Users/buildbot/buildarea/3.14.pablogsal-macos-m1.macos-with-brew/build/Lib/test/test_urllib2net.py", line 22, in _retry_thrice last_exc = e ResourceWarning: unclosed <socket.socket fd=9, family=2, type=1, proto=6, laddr=('192.168.0.101', 60544), raddr=('68.183.26.59', 21)> Warning -- Unraisable exception Exception ignored while finalizing socket <socket.socket fd=10, family=2, type=1, proto=6, laddr=('192.168.0.101', 60546), raddr=('68.183.26.59', 21)>: Traceback (most recent call last): File "/Users/buildbot/buildarea/3.14.pablogsal-macos-m1.macos-with-brew/build/Lib/test/test_urllib2net.py", line 22, in _retry_thrice last_exc = e ResourceWarning: unclosed <socket.socket fd=10, family=2, type=1, proto=6, laddr=('192.168.0.101', 60546), raddr=('68.183.26.59', 21)> skipped "Resource 'ftp://www.pythontest.net/' is not available"
Test report
Sincerely, -The Buildbot
participants (1)
-
buildbot@python.org