☠ Buildbot (Python): python/cpython - failed test (failure) (main)
The Buildbot has detected a new failure on builder AMD64 Fedora Rawhide LTO 3.x while building python/cpython. Full details are available at: https://buildbot.python.org/all/#builders/375/builds/2695
Buildbot URL: https://buildbot.python.org/all/
Worker for this Build: cstratak-fedora-rawhide-x86_64
Build Reason: <unknown> Blamelist: Nikita Sobolev <mail@sobolevn.me>, andrei kulakov <andrei.avk@gmail.com>
BUILD FAILED: failed test (failure)
Summary of the results of the build (if available):
== Tests result: FAILURE then FAILURE ==
422 tests OK.
10 slowest tests:
- test_gdb: 3 min 46 sec
- test_concurrent_futures: 2 min 36 sec
- test_multiprocessing_spawn: 2 min 8 sec
- test_asyncio: 1 min 36 sec
- test_multiprocessing_forkserver: 1 min 35 sec
- test_multiprocessing_fork: 1 min 27 sec
- test_largefile: 1 min 11 sec
- test_socket: 49.9 sec
- test_signal: 49.2 sec
- test_io: 39.2 sec
1 test failed: test_unicode
14 tests skipped: test_devpoll test_ioctl test_kqueue test_launcher test_msilib test_startfile test_tix test_tkinter test_ttk test_winconsoleio test_winreg test_winsound test_wmi test_zipfile64
1 re-run test: test_unicode
Total duration: 6 min 7 sec
Captured traceback
Traceback (most recent call last): File "/home/buildbot/buildarea/3.x.cstratak-fedora-rawhide-x86_64.lto/build/Lib/test/test_unicode.py", line 2817, in test_from_format self.assertRegex(p_format1, p_format_regex) AssertionError: Regex didn't match: '^0x[a-zA-Z0-9]{8,}$' not found in '0x833280'
Test report
Failed tests:
- test_unicode
Failed subtests:
- test_from_format - test.test_unicode.CAPITest.test_from_format
Sincerely, -The Buildbot
participants (1)
-
buildbot@python.org