Buildbot failure in Python on AMD64 RHEL7 3.8
The Buildbot has detected a failed build on builder AMD64 RHEL7 3.8 while building python/cpython. Full details are available at: https://buildbot.python.org/all/#builders/147/builds/119
Buildbot URL: https://buildbot.python.org/all/
Worker for this Build: cstratak-RHEL7-x86_64
Build Reason: <unknown> Blamelist: Miss Islington (bot) <31488909+miss-islington@users.noreply.github.com>
BUILD FAILED: failed test (failure) uploading test-results.xml (failure)
Summary of the results of the build (if available):
==
Captured traceback
remote: Enumerating objects: 8, done.
remote: Counting objects: 12% (1/8)
remote: Counting objects: 25% (2/8)
remote: Counting objects: 37% (3/8)
remote: Counting objects: 50% (4/8)
remote: Counting objects: 62% (5/8)
remote: Counting objects: 75% (6/8)
remote: Counting objects: 87% (7/8)
remote: Counting objects: 100% (8/8)
remote: Counting objects: 100% (8/8), done.
remote: Total 10 (delta 7), reused 7 (delta 7), pack-reused 2
From https://github.com/python/cpython
- branch 3.8 -> FETCH_HEAD Reset branch '3.8'
/home/buildbot/buildarea/3.8.cstratak-RHEL7-x86_64/build/Modules/_testcapimodule.c: In function ‘PyInit__testcapi’: /home/buildbot/buildarea/3.8.cstratak-RHEL7-x86_64/build/Modules/_testcapimodule.c:6216:5: warning: ‘tp_print’ is deprecated (declared at ./Include/cpython/object.h:260) [-Wdeprecated-declarations] MyList_Type.tp_print = 0; ^
test_ossaudiodev skipped -- [Errno 2] No such file or directory: '/dev/dsp' test_msilib skipped -- No module named '_msi' test_devpoll skipped -- test works only on Solaris OS family test_ioctl skipped -- Unable to open /dev/tty test_startfile skipped -- object <module 'os' from '/home/buildbot/buildarea/3.8.cstratak-RHEL7-x86_64/build/Lib/os.py'> has no attribute 'startfile' test_tk skipped -- Tk unavailable due to TclError: no display name and no $DISPLAY environment variab [...] test_winconsoleio skipped -- test only relevant on win32 test_ttk_guionly skipped -- Tk unavailable due to TclError: no display name and no $DISPLAY environment variab [...] test_tix skipped -- Tk unavailable due to TclError: no display name and no $DISPLAY environment variab [...] test_kqueue skipped -- test works only on BSD stty: standard input: Inappropriate ioctl for device test_winsound skipped -- No module named 'winsound' test_winreg skipped -- No module named 'winreg' test_zipfile64 skipped -- test requires loads of disk-space bytes and a long time to run test_flock (__main__.FNTLEINTRTest) ... ok test_lockf (__main__.FNTLEINTRTest) ... ok test_read (__main__.OSEINTRTest) ... ok test_wait (__main__.OSEINTRTest) ... ok test_wait3 (__main__.OSEINTRTest) ... ok test_wait4 (__main__.OSEINTRTest) ... ok test_waitpid (__main__.OSEINTRTest) ... ok test_write (__main__.OSEINTRTest) ... ok test_devpoll (__main__.SelectEINTRTest) ... skipped 'need select.devpoll' test_epoll (__main__.SelectEINTRTest) ... ok test_kqueue (__main__.SelectEINTRTest) ... skipped 'need select.kqueue' test_poll (__main__.SelectEINTRTest) ... ok test_select (__main__.SelectEINTRTest) ... ok test_sigtimedwait (__main__.SignalEINTRTest) ... ok test_sigwaitinfo (__main__.SignalEINTRTest) ... ok test_accept (__main__.SocketEINTRTest) ... ok test_open (__main__.SocketEINTRTest) ... ok test_os_open (__main__.SocketEINTRTest) ... ok test_recv (__main__.SocketEINTRTest) ... ok test_recvmsg (__main__.SocketEINTRTest) ... ok test_send (__main__.SocketEINTRTest) ... ok test_sendall (__main__.SocketEINTRTest) ... ok test_sendmsg (__main__.SocketEINTRTest) ... ok test_sleep (__main__.TimeEINTRTest) ... ok
Ran 24 tests in 7.067s
OK (skipped=2) test_gdb skipped -- Couldn't find gdb on the path Timeout (0:15:00)! Thread 0x00007f12fda76740 (most recent call first): File "/home/buildbot/buildarea/3.8.cstratak-RHEL7-x86_64/build/Lib/selectors.py", line 468 in select File "/home/buildbot/buildarea/3.8.cstratak-RHEL7-x86_64/build/Lib/asyncio/base_events.py", line 1823 in _run_once File "/home/buildbot/buildarea/3.8.cstratak-RHEL7-x86_64/build/Lib/asyncio/base_events.py", line 570 in run_forever File "/home/buildbot/buildarea/3.8.cstratak-RHEL7-x86_64/build/Lib/asyncio/base_events.py", line 603 in run_until_complete File "/home/buildbot/buildarea/3.8.cstratak-RHEL7-x86_64/build/Lib/test/test_asyncio/test_subprocess.py", line 440 in test_cancel_make_subprocess_transport_exec File "/home/buildbot/buildarea/3.8.cstratak-RHEL7-x86_64/build/Lib/unittest/case.py", line 633 in _callTestMethod File "/home/buildbot/buildarea/3.8.cstratak-RHEL7-x86_64/build/Lib/unittest/case.py", line 676 in run File "/home/buildbot/buildarea/3.8.cstratak-RHEL7-x86_64/build/Lib/unittest/case.py", line 736 in __call__ File "/home/buildbot/buildarea/3.8.cstratak-RHEL7-x86_64/build/Lib/unittest/suite.py", line 122 in run File "/home/buildbot/buildarea/3.8.cstratak-RHEL7-x86_64/build/Lib/unittest/suite.py", line 84 in __call__ File "/home/buildbot/buildarea/3.8.cstratak-RHEL7-x86_64/build/Lib/unittest/suite.py", line 122 in run File "/home/buildbot/buildarea/3.8.cstratak-RHEL7-x86_64/build/Lib/unittest/suite.py", line 84 in __call__ File "/home/buildbot/buildarea/3.8.cstratak-RHEL7-x86_64/build/Lib/unittest/suite.py", line 122 in run File "/home/buildbot/buildarea/3.8.cstratak-RHEL7-x86_64/build/Lib/unittest/suite.py", line 84 in __call__ File "/home/buildbot/buildarea/3.8.cstratak-RHEL7-x86_64/build/Lib/unittest/suite.py", line 122 in run File "/home/buildbot/buildarea/3.8.cstratak-RHEL7-x86_64/build/Lib/unittest/suite.py", line 84 in __call__ File "/home/buildbot/buildarea/3.8.cstratak-RHEL7-x86_64/build/Lib/unittest/suite.py", line 122 in run File "/home/buildbot/buildarea/3.8.cstratak-RHEL7-x86_64/build/Lib/unittest/suite.py", line 84 in __call__ File "/home/buildbot/buildarea/3.8.cstratak-RHEL7-x86_64/build/Lib/unittest/runner.py", line 176 in run File "/home/buildbot/buildarea/3.8.cstratak-RHEL7-x86_64/build/Lib/test/support/__init__.py", line 2030 in _run_suite File "/home/buildbot/buildarea/3.8.cstratak-RHEL7-x86_64/build/Lib/test/support/__init__.py", line 2126 in run_unittest File "/home/buildbot/buildarea/3.8.cstratak-RHEL7-x86_64/build/Lib/test/libregrtest/runtest.py", line 209 in _test_module File "/home/buildbot/buildarea/3.8.cstratak-RHEL7-x86_64/build/Lib/test/libregrtest/runtest.py", line 234 in _runtest_inner2 File "/home/buildbot/buildarea/3.8.cstratak-RHEL7-x86_64/build/Lib/test/libregrtest/runtest.py", line 270 in _runtest_inner File "/home/buildbot/buildarea/3.8.cstratak-RHEL7-x86_64/build/Lib/test/libregrtest/runtest.py", line 140 in _runtest File "/home/buildbot/buildarea/3.8.cstratak-RHEL7-x86_64/build/Lib/test/libregrtest/runtest.py", line 193 in runtest File "/home/buildbot/buildarea/3.8.cstratak-RHEL7-x86_64/build/Lib/test/libregrtest/runtest_mp.py", line 73 in run_tests_worker File "/home/buildbot/buildarea/3.8.cstratak-RHEL7-x86_64/build/Lib/test/libregrtest/main.py", line 654 in _main File "/home/buildbot/buildarea/3.8.cstratak-RHEL7-x86_64/build/Lib/test/libregrtest/main.py", line 634 in main File "/home/buildbot/buildarea/3.8.cstratak-RHEL7-x86_64/build/Lib/test/libregrtest/main.py", line 712 in main File "/home/buildbot/buildarea/3.8.cstratak-RHEL7-x86_64/build/Lib/test/regrtest.py", line 46 in _main File "/home/buildbot/buildarea/3.8.cstratak-RHEL7-x86_64/build/Lib/test/regrtest.py", line 50 in <module> File "/home/buildbot/buildarea/3.8.cstratak-RHEL7-x86_64/build/Lib/runpy.py", line 86 in _run_code File "/home/buildbot/buildarea/3.8.cstratak-RHEL7-x86_64/build/Lib/runpy.py", line 193 in _run_module_as_main Timeout (0:15:00)! Thread 0x00007fad16312740 (most recent call first): File "/home/buildbot/buildarea/3.8.cstratak-RHEL7-x86_64/build/Lib/selectors.py", line 468 in select File "/home/buildbot/buildarea/3.8.cstratak-RHEL7-x86_64/build/Lib/asyncio/base_events.py", line 1823 in _run_once File "/home/buildbot/buildarea/3.8.cstratak-RHEL7-x86_64/build/Lib/asyncio/base_events.py", line 570 in run_forever File "/home/buildbot/buildarea/3.8.cstratak-RHEL7-x86_64/build/Lib/asyncio/base_events.py", line 603 in run_until_complete File "/home/buildbot/buildarea/3.8.cstratak-RHEL7-x86_64/build/Lib/test/test_asyncio/test_subprocess.py", line 484 in test_close_kill_running File "/home/buildbot/buildarea/3.8.cstratak-RHEL7-x86_64/build/Lib/unittest/case.py", line 633 in _callTestMethod File "/home/buildbot/buildarea/3.8.cstratak-RHEL7-x86_64/build/Lib/unittest/case.py", line 676 in run File "/home/buildbot/buildarea/3.8.cstratak-RHEL7-x86_64/build/Lib/unittest/case.py", line 736 in __call__ File "/home/buildbot/buildarea/3.8.cstratak-RHEL7-x86_64/build/Lib/unittest/suite.py", line 122 in run File "/home/buildbot/buildarea/3.8.cstratak-RHEL7-x86_64/build/Lib/unittest/suite.py", line 84 in __call__ File "/home/buildbot/buildarea/3.8.cstratak-RHEL7-x86_64/build/Lib/unittest/suite.py", line 122 in run File "/home/buildbot/buildarea/3.8.cstratak-RHEL7-x86_64/build/Lib/unittest/suite.py", line 84 in __call__ File "/home/buildbot/buildarea/3.8.cstratak-RHEL7-x86_64/build/Lib/unittest/suite.py", line 122 in run File "/home/buildbot/buildarea/3.8.cstratak-RHEL7-x86_64/build/Lib/unittest/suite.py", line 84 in __call__ File "/home/buildbot/buildarea/3.8.cstratak-RHEL7-x86_64/build/Lib/unittest/suite.py", line 122 in run File "/home/buildbot/buildarea/3.8.cstratak-RHEL7-x86_64/build/Lib/unittest/suite.py", line 84 in __call__ File "/home/buildbot/buildarea/3.8.cstratak-RHEL7-x86_64/build/Lib/unittest/suite.py", line 122 in run File "/home/buildbot/buildarea/3.8.cstratak-RHEL7-x86_64/build/Lib/unittest/suite.py", line 84 in __call__ File "/home/buildbot/buildarea/3.8.cstratak-RHEL7-x86_64/build/Lib/unittest/runner.py", line 176 in run File "/home/buildbot/buildarea/3.8.cstratak-RHEL7-x86_64/build/Lib/test/support/__init__.py", line 2030 in _run_suite File "/home/buildbot/buildarea/3.8.cstratak-RHEL7-x86_64/build/Lib/test/support/__init__.py", line 2126 in run_unittest File "/home/buildbot/buildarea/3.8.cstratak-RHEL7-x86_64/build/Lib/test/libregrtest/runtest.py", line 209 in _test_module File "/home/buildbot/buildarea/3.8.cstratak-RHEL7-x86_64/build/Lib/test/libregrtest/runtest.py", line 234 in _runtest_inner2 File "/home/buildbot/buildarea/3.8.cstratak-RHEL7-x86_64/build/Lib/test/libregrtest/runtest.py", line 270 in _runtest_inner File "/home/buildbot/buildarea/3.8.cstratak-RHEL7-x86_64/build/Lib/test/libregrtest/runtest.py", line 153 in _runtest File "/home/buildbot/buildarea/3.8.cstratak-RHEL7-x86_64/build/Lib/test/libregrtest/runtest.py", line 193 in runtest File "/home/buildbot/buildarea/3.8.cstratak-RHEL7-x86_64/build/Lib/test/libregrtest/main.py", line 318 in rerun_failed_tests File "/home/buildbot/buildarea/3.8.cstratak-RHEL7-x86_64/build/Lib/test/libregrtest/main.py", line 691 in _main File "/home/buildbot/buildarea/3.8.cstratak-RHEL7-x86_64/build/Lib/test/libregrtest/main.py", line 634 in main File "/home/buildbot/buildarea/3.8.cstratak-RHEL7-x86_64/build/Lib/test/libregrtest/main.py", line 712 in main File "/home/buildbot/buildarea/3.8.cstratak-RHEL7-x86_64/build/Lib/test/__main__.py", line 2 in <module> File "/home/buildbot/buildarea/3.8.cstratak-RHEL7-x86_64/build/Lib/runpy.py", line 86 in _run_code File "/home/buildbot/buildarea/3.8.cstratak-RHEL7-x86_64/build/Lib/runpy.py", line 193 in _run_module_as_main make: *** [buildbottest] Error 1
Test report
Failed tests:
- test_asyncio
Sincerely, -The Buildbot
https://bugs.python.org/issue38276 (CLOSED)
File "/home/buildbot/buildarea/3.8.cstratak-RHEL7-x86_64/build/Lib/test/test_asyncio/test_subprocess.py", line 440 in test_cancel_make_subprocess_transport_exec
Le mer. 12 févr. 2020 à 14:59, <buildbot@python.org> a écrit :
The Buildbot has detected a failed build on builder AMD64 RHEL7 3.8 while building python/cpython. Full details are available at: https://buildbot.python.org/all/#builders/147/builds/119
Buildbot URL: https://buildbot.python.org/all/
Worker for this Build: cstratak-RHEL7-x86_64
Build Reason: <unknown> Blamelist: Miss Islington (bot) <31488909+miss-islington@users.noreply.github.com>
BUILD FAILED: failed test (failure) uploading test-results.xml (failure)
Summary of the results of the build (if available):
==
Captured traceback
remote: Enumerating objects: 8, done. remote: Counting objects: 12% (1/8) remote: Counting objects: 25% (2/8) remote: Counting objects: 37% (3/8) remote: Counting objects: 50% (4/8) remote: Counting objects: 62% (5/8) remote: Counting objects: 75% (6/8) remote: Counting objects: 87% (7/8) remote: Counting objects: 100% (8/8) remote: Counting objects: 100% (8/8), done. remote: Total 10 (delta 7), reused 7 (delta 7), pack-reused 2 From https://github.com/python/cpython
- branch 3.8 -> FETCH_HEAD Reset branch '3.8'
/home/buildbot/buildarea/3.8.cstratak-RHEL7-x86_64/build/Modules/_testcapimodule.c: In function ‘PyInit__testcapi’: /home/buildbot/buildarea/3.8.cstratak-RHEL7-x86_64/build/Modules/_testcapimodule.c:6216:5: warning: ‘tp_print’ is deprecated (declared at ./Include/cpython/object.h:260) [-Wdeprecated-declarations] MyList_Type.tp_print = 0; ^
test_ossaudiodev skipped -- [Errno 2] No such file or directory: '/dev/dsp' test_msilib skipped -- No module named '_msi' test_devpoll skipped -- test works only on Solaris OS family test_ioctl skipped -- Unable to open /dev/tty test_startfile skipped -- object <module 'os' from '/home/buildbot/buildarea/3.8.cstratak-RHEL7-x86_64/build/Lib/os.py'> has no attribute 'startfile' test_tk skipped -- Tk unavailable due to TclError: no display name and no $DISPLAY environment variab [...] test_winconsoleio skipped -- test only relevant on win32 test_ttk_guionly skipped -- Tk unavailable due to TclError: no display name and no $DISPLAY environment variab [...] test_tix skipped -- Tk unavailable due to TclError: no display name and no $DISPLAY environment variab [...] test_kqueue skipped -- test works only on BSD stty: standard input: Inappropriate ioctl for device test_winsound skipped -- No module named 'winsound' test_winreg skipped -- No module named 'winreg' test_zipfile64 skipped -- test requires loads of disk-space bytes and a long time to run test_flock (__main__.FNTLEINTRTest) ... ok test_lockf (__main__.FNTLEINTRTest) ... ok test_read (__main__.OSEINTRTest) ... ok test_wait (__main__.OSEINTRTest) ... ok test_wait3 (__main__.OSEINTRTest) ... ok test_wait4 (__main__.OSEINTRTest) ... ok test_waitpid (__main__.OSEINTRTest) ... ok test_write (__main__.OSEINTRTest) ... ok test_devpoll (__main__.SelectEINTRTest) ... skipped 'need select.devpoll' test_epoll (__main__.SelectEINTRTest) ... ok test_kqueue (__main__.SelectEINTRTest) ... skipped 'need select.kqueue' test_poll (__main__.SelectEINTRTest) ... ok test_select (__main__.SelectEINTRTest) ... ok test_sigtimedwait (__main__.SignalEINTRTest) ... ok test_sigwaitinfo (__main__.SignalEINTRTest) ... ok test_accept (__main__.SocketEINTRTest) ... ok test_open (__main__.SocketEINTRTest) ... ok test_os_open (__main__.SocketEINTRTest) ... ok test_recv (__main__.SocketEINTRTest) ... ok test_recvmsg (__main__.SocketEINTRTest) ... ok test_send (__main__.SocketEINTRTest) ... ok test_sendall (__main__.SocketEINTRTest) ... ok test_sendmsg (__main__.SocketEINTRTest) ... ok test_sleep (__main__.TimeEINTRTest) ... ok
Ran 24 tests in 7.067s
OK (skipped=2) test_gdb skipped -- Couldn't find gdb on the path Timeout (0:15:00)! Thread 0x00007f12fda76740 (most recent call first): File "/home/buildbot/buildarea/3.8.cstratak-RHEL7-x86_64/build/Lib/selectors.py", line 468 in select File "/home/buildbot/buildarea/3.8.cstratak-RHEL7-x86_64/build/Lib/asyncio/base_events.py", line 1823 in _run_once File "/home/buildbot/buildarea/3.8.cstratak-RHEL7-x86_64/build/Lib/asyncio/base_events.py", line 570 in run_forever File "/home/buildbot/buildarea/3.8.cstratak-RHEL7-x86_64/build/Lib/asyncio/base_events.py", line 603 in run_until_complete File "/home/buildbot/buildarea/3.8.cstratak-RHEL7-x86_64/build/Lib/test/test_asyncio/test_subprocess.py", line 440 in test_cancel_make_subprocess_transport_exec File "/home/buildbot/buildarea/3.8.cstratak-RHEL7-x86_64/build/Lib/unittest/case.py", line 633 in _callTestMethod File "/home/buildbot/buildarea/3.8.cstratak-RHEL7-x86_64/build/Lib/unittest/case.py", line 676 in run File "/home/buildbot/buildarea/3.8.cstratak-RHEL7-x86_64/build/Lib/unittest/case.py", line 736 in __call__ File "/home/buildbot/buildarea/3.8.cstratak-RHEL7-x86_64/build/Lib/unittest/suite.py", line 122 in run File "/home/buildbot/buildarea/3.8.cstratak-RHEL7-x86_64/build/Lib/unittest/suite.py", line 84 in __call__ File "/home/buildbot/buildarea/3.8.cstratak-RHEL7-x86_64/build/Lib/unittest/suite.py", line 122 in run File "/home/buildbot/buildarea/3.8.cstratak-RHEL7-x86_64/build/Lib/unittest/suite.py", line 84 in __call__ File "/home/buildbot/buildarea/3.8.cstratak-RHEL7-x86_64/build/Lib/unittest/suite.py", line 122 in run File "/home/buildbot/buildarea/3.8.cstratak-RHEL7-x86_64/build/Lib/unittest/suite.py", line 84 in __call__ File "/home/buildbot/buildarea/3.8.cstratak-RHEL7-x86_64/build/Lib/unittest/suite.py", line 122 in run File "/home/buildbot/buildarea/3.8.cstratak-RHEL7-x86_64/build/Lib/unittest/suite.py", line 84 in __call__ File "/home/buildbot/buildarea/3.8.cstratak-RHEL7-x86_64/build/Lib/unittest/suite.py", line 122 in run File "/home/buildbot/buildarea/3.8.cstratak-RHEL7-x86_64/build/Lib/unittest/suite.py", line 84 in __call__ File "/home/buildbot/buildarea/3.8.cstratak-RHEL7-x86_64/build/Lib/unittest/runner.py", line 176 in run File "/home/buildbot/buildarea/3.8.cstratak-RHEL7-x86_64/build/Lib/test/support/__init__.py", line 2030 in _run_suite File "/home/buildbot/buildarea/3.8.cstratak-RHEL7-x86_64/build/Lib/test/support/__init__.py", line 2126 in run_unittest File "/home/buildbot/buildarea/3.8.cstratak-RHEL7-x86_64/build/Lib/test/libregrtest/runtest.py", line 209 in _test_module File "/home/buildbot/buildarea/3.8.cstratak-RHEL7-x86_64/build/Lib/test/libregrtest/runtest.py", line 234 in _runtest_inner2 File "/home/buildbot/buildarea/3.8.cstratak-RHEL7-x86_64/build/Lib/test/libregrtest/runtest.py", line 270 in _runtest_inner File "/home/buildbot/buildarea/3.8.cstratak-RHEL7-x86_64/build/Lib/test/libregrtest/runtest.py", line 140 in _runtest File "/home/buildbot/buildarea/3.8.cstratak-RHEL7-x86_64/build/Lib/test/libregrtest/runtest.py", line 193 in runtest File "/home/buildbot/buildarea/3.8.cstratak-RHEL7-x86_64/build/Lib/test/libregrtest/runtest_mp.py", line 73 in run_tests_worker File "/home/buildbot/buildarea/3.8.cstratak-RHEL7-x86_64/build/Lib/test/libregrtest/main.py", line 654 in _main File "/home/buildbot/buildarea/3.8.cstratak-RHEL7-x86_64/build/Lib/test/libregrtest/main.py", line 634 in main File "/home/buildbot/buildarea/3.8.cstratak-RHEL7-x86_64/build/Lib/test/libregrtest/main.py", line 712 in main File "/home/buildbot/buildarea/3.8.cstratak-RHEL7-x86_64/build/Lib/test/regrtest.py", line 46 in _main File "/home/buildbot/buildarea/3.8.cstratak-RHEL7-x86_64/build/Lib/test/regrtest.py", line 50 in <module> File "/home/buildbot/buildarea/3.8.cstratak-RHEL7-x86_64/build/Lib/runpy.py", line 86 in _run_code File "/home/buildbot/buildarea/3.8.cstratak-RHEL7-x86_64/build/Lib/runpy.py", line 193 in _run_module_as_main Timeout (0:15:00)! Thread 0x00007fad16312740 (most recent call first): File "/home/buildbot/buildarea/3.8.cstratak-RHEL7-x86_64/build/Lib/selectors.py", line 468 in select File "/home/buildbot/buildarea/3.8.cstratak-RHEL7-x86_64/build/Lib/asyncio/base_events.py", line 1823 in _run_once File "/home/buildbot/buildarea/3.8.cstratak-RHEL7-x86_64/build/Lib/asyncio/base_events.py", line 570 in run_forever File "/home/buildbot/buildarea/3.8.cstratak-RHEL7-x86_64/build/Lib/asyncio/base_events.py", line 603 in run_until_complete File "/home/buildbot/buildarea/3.8.cstratak-RHEL7-x86_64/build/Lib/test/test_asyncio/test_subprocess.py", line 484 in test_close_kill_running File "/home/buildbot/buildarea/3.8.cstratak-RHEL7-x86_64/build/Lib/unittest/case.py", line 633 in _callTestMethod File "/home/buildbot/buildarea/3.8.cstratak-RHEL7-x86_64/build/Lib/unittest/case.py", line 676 in run File "/home/buildbot/buildarea/3.8.cstratak-RHEL7-x86_64/build/Lib/unittest/case.py", line 736 in __call__ File "/home/buildbot/buildarea/3.8.cstratak-RHEL7-x86_64/build/Lib/unittest/suite.py", line 122 in run File "/home/buildbot/buildarea/3.8.cstratak-RHEL7-x86_64/build/Lib/unittest/suite.py", line 84 in __call__ File "/home/buildbot/buildarea/3.8.cstratak-RHEL7-x86_64/build/Lib/unittest/suite.py", line 122 in run File "/home/buildbot/buildarea/3.8.cstratak-RHEL7-x86_64/build/Lib/unittest/suite.py", line 84 in __call__ File "/home/buildbot/buildarea/3.8.cstratak-RHEL7-x86_64/build/Lib/unittest/suite.py", line 122 in run File "/home/buildbot/buildarea/3.8.cstratak-RHEL7-x86_64/build/Lib/unittest/suite.py", line 84 in __call__ File "/home/buildbot/buildarea/3.8.cstratak-RHEL7-x86_64/build/Lib/unittest/suite.py", line 122 in run File "/home/buildbot/buildarea/3.8.cstratak-RHEL7-x86_64/build/Lib/unittest/suite.py", line 84 in __call__ File "/home/buildbot/buildarea/3.8.cstratak-RHEL7-x86_64/build/Lib/unittest/suite.py", line 122 in run File "/home/buildbot/buildarea/3.8.cstratak-RHEL7-x86_64/build/Lib/unittest/suite.py", line 84 in __call__ File "/home/buildbot/buildarea/3.8.cstratak-RHEL7-x86_64/build/Lib/unittest/runner.py", line 176 in run File "/home/buildbot/buildarea/3.8.cstratak-RHEL7-x86_64/build/Lib/test/support/__init__.py", line 2030 in _run_suite File "/home/buildbot/buildarea/3.8.cstratak-RHEL7-x86_64/build/Lib/test/support/__init__.py", line 2126 in run_unittest File "/home/buildbot/buildarea/3.8.cstratak-RHEL7-x86_64/build/Lib/test/libregrtest/runtest.py", line 209 in _test_module File "/home/buildbot/buildarea/3.8.cstratak-RHEL7-x86_64/build/Lib/test/libregrtest/runtest.py", line 234 in _runtest_inner2 File "/home/buildbot/buildarea/3.8.cstratak-RHEL7-x86_64/build/Lib/test/libregrtest/runtest.py", line 270 in _runtest_inner File "/home/buildbot/buildarea/3.8.cstratak-RHEL7-x86_64/build/Lib/test/libregrtest/runtest.py", line 153 in _runtest File "/home/buildbot/buildarea/3.8.cstratak-RHEL7-x86_64/build/Lib/test/libregrtest/runtest.py", line 193 in runtest File "/home/buildbot/buildarea/3.8.cstratak-RHEL7-x86_64/build/Lib/test/libregrtest/main.py", line 318 in rerun_failed_tests File "/home/buildbot/buildarea/3.8.cstratak-RHEL7-x86_64/build/Lib/test/libregrtest/main.py", line 691 in _main File "/home/buildbot/buildarea/3.8.cstratak-RHEL7-x86_64/build/Lib/test/libregrtest/main.py", line 634 in main File "/home/buildbot/buildarea/3.8.cstratak-RHEL7-x86_64/build/Lib/test/libregrtest/main.py", line 712 in main File "/home/buildbot/buildarea/3.8.cstratak-RHEL7-x86_64/build/Lib/test/__main__.py", line 2 in <module> File "/home/buildbot/buildarea/3.8.cstratak-RHEL7-x86_64/build/Lib/runpy.py", line 86 in _run_code File "/home/buildbot/buildarea/3.8.cstratak-RHEL7-x86_64/build/Lib/runpy.py", line 193 in _run_module_as_main make: *** [buildbottest] Error 1
Test report
Failed tests:
- test_asyncio
Sincerely, -The Buildbot
Buildbot-status mailing list -- buildbot-status@python.org To unsubscribe send an email to buildbot-status-leave@python.org https://mail.python.org/mailman3/lists/buildbot-status.python.org/
-- Night gathers, and now my watch begins. It shall not end until my death.
participants (2)
-
buildbot@python.org -
Victor Stinner