☠ Buildbot (Python): python/cpython - failed test (failure) (main)
The Buildbot has detected a new failure on builder x86 Debian Non-Debug with X 3.x while building python/cpython. Full details are available at: https://buildbot.python.org/#/builders/1245/builds/6825
Buildbot URL: https://buildbot.python.org/
Worker for this Build: ware-debian-x86
Build Reason: <unknown> Blamelist: yihong <zouzou0208@gmail.com>
BUILD FAILED: failed test (failure)
Summary of the results of the build (if available):
==
Captured traceback
Traceback (most recent call last): File [35m"/buildbot/buildarea/3.x.ware-debian-x86.nondebug/build/Lib/test/test_annotationlib.py"[0m, line [35m160[0m, in [35mtest_nonexistent_attribute[0m [31mself.assertEqual[0m[1;31m(epsilon_anno, support.EqualToForwardRef("some | {obj, module}", owner=f))[0m [31m~~~~~~~~~~~~~~~~[0m[1;31m^^^^^^^^^^^^^^^^^^^^^^^^^^^^^^^^^^^^^^^^^^^^^^^^^^^^^^^^^^^^^^^^^^^^^^^^^^[0m [1;35mAssertionError[0m: [35mForwardRef('some | {module, obj}', owner=[79 chars]5a8>) != EqualToForwardRef('some | {obj, module}',[86 chars]5a8>)[0m
Traceback (most recent call last): File [35m"/buildbot/buildarea/3.x.ware-debian-x86.nondebug/build/Lib/test/test_annotationlib.py"[0m, line [35m160[0m, in [35mtest_nonexistent_attribute[0m [31mself.assertEqual[0m[1;31m(epsilon_anno, support.EqualToForwardRef("some | {obj, module}", owner=f))[0m [31m~~~~~~~~~~~~~~~~[0m[1;31m^^^^^^^^^^^^^^^^^^^^^^^^^^^^^^^^^^^^^^^^^^^^^^^^^^^^^^^^^^^^^^^^^^^^^^^^^^[0m [1;35mAssertionError[0m: [35mForwardRef('some | {module, obj}', owner=[79 chars]ce0>) != EqualToForwardRef('some | {obj, module}',[86 chars]ce0>)[0m
Test report
Sincerely, -The Buildbot
participants (1)
-
buildbot@python.org