☠ Buildbot (Python): python/cpython - failed test (failure) (main)
The Buildbot has detected a new failure on builder PPC64LE RHEL8 3.x while building python/cpython. Full details are available at: https://buildbot.python.org/all/#builders/559/builds/3095
Buildbot URL: https://buildbot.python.org/all/
Worker for this Build: cstratak-RHEL8-ppc64le
Build Reason: <unknown> Blamelist: Dong-hee Na <donghee.na@python.org>, Filipe Laíns <lains@riseup.net>, Jason R. Coombs <jaraco@jaraco.com>, Tim Hatch <tim@timhatch.com>
BUILD FAILED: failed test (failure)
Summary of the results of the build (if available):
== Tests result: FAILURE then FAILURE ==
416 tests OK.
10 slowest tests:
- test_gdb: 13 min 27 sec
- test_math: 5 min 5 sec
- test_multiprocessing_spawn: 4 min 43 sec
- test_concurrent_futures: 3 min 11 sec
- test_capi: 2 min 48 sec
- test_tokenize: 2 min 44 sec
- test_asyncio: 2 min 41 sec
- test_unparse: 2 min 27 sec
- test_lib2to3: 2 min 14 sec
- test_multiprocessing_forkserver: 2 min 5 sec
1 test failed: test_zipfile
17 tests skipped: test_check_c_globals test_devpoll test_ioctl test_kqueue test_launcher test_msilib test_peg_generator test_perf_profiler test_startfile test_tix test_tkinter test_ttk test_winconsoleio test_winreg test_winsound test_wmi test_zipfile64
1 re-run test: test_zipfile
Total duration: 13 min 35 sec
Captured traceback
Traceback (most recent call last): File "/home/buildbot/buildarea/3.x.cstratak-RHEL8-ppc64le/build/Lib/contextlib.py", line 80, in inner with self._recreate_cm(): File "/home/buildbot/buildarea/3.x.cstratak-RHEL8-ppc64le/build/Lib/test/test_zipfile/_context.py", line 30, in __exit__ raise DeadlineExceeded(duration, self.max_duration)
Test report
Failed tests:
- test_zipfile
Failed subtests:
- test_implied_dirs_performance - test.test_zipfile.test_path.TestPath.test_implied_dirs_performance
Sincerely, -The BuildbotThe Buildbot has detected a new failure on builder PPC64LE Fedora Stable 3.x while building python/cpython. Full details are available at: https://buildbot.python.org/all/#builders/90/builds/2853
Buildbot URL: https://buildbot.python.org/all/
Worker for this Build: cstratak-fedora-stable-ppc64le
Build Reason: <unknown> Blamelist: Filipe Laíns <lains@riseup.net>, Jason R. Coombs <jaraco@jaraco.com>
BUILD FAILED: failed test (failure)
Summary of the results of the build (if available):
== Tests result: FAILURE then FAILURE ==
416 tests OK.
10 slowest tests:
- test_math: 7 min 31 sec
- test_multiprocessing_spawn: 6 min 38 sec
- test_gdb: 5 min 49 sec
- test_tokenize: 4 min 28 sec
- test_multiprocessing_forkserver: 3 min 47 sec
- test_concurrent_futures: 3 min
- test_unparse: 2 min 40 sec
- test_lib2to3: 2 min 31 sec
- test_capi: 2 min 27 sec
- test_asyncio: 2 min 27 sec
1 test failed: test_zipfile
17 tests skipped: test_check_c_globals test_devpoll test_ioctl test_kqueue test_launcher test_msilib test_peg_generator test_perf_profiler test_startfile test_tix test_tkinter test_ttk test_winconsoleio test_winreg test_winsound test_wmi test_zipfile64
1 re-run test: test_zipfile
Total duration: 14 min 12 sec
Captured traceback
Traceback (most recent call last): File "/home/buildbot/buildarea/3.x.cstratak-fedora-stable-ppc64le/build/Lib/contextlib.py", line 80, in inner with self._recreate_cm(): File "/home/buildbot/buildarea/3.x.cstratak-fedora-stable-ppc64le/build/Lib/test/test_zipfile/_context.py", line 30, in __exit__ raise DeadlineExceeded(duration, self.max_duration)
Test report
Failed tests:
- test_zipfile
Failed subtests:
- test_implied_dirs_performance - test.test_zipfile.test_path.TestPath.test_implied_dirs_performance
Sincerely, -The Buildbot
participants (1)
-
buildbot@python.org