☠ Buildbot (Python): python/cpython - failed test (failure) (3.14)
The Buildbot has detected a new failure on builder AMD64 Windows11 Refleaks 3.14 while building python/cpython. Full details are available at: https://buildbot.python.org/#/builders/1682/builds/289
Buildbot URL: https://buildbot.python.org/
Worker for this Build: ware-win11
Build Reason: <unknown> Blamelist: Miss Islington (bot) <31488909+miss-islington@users.noreply.github.com>
BUILD FAILED: failed test (failure)
Summary of the results of the build (if available):
==
Captured traceback
Traceback (most recent call last): File "b:\uildarea\3.14.ware-win11.refleak\build\Lib\test\test_concurrent_futures\test_interpreter_pool.py", line 443, in test_idle_thread_reuse self.assertEqual(len(executor._threads), 1) ~~~~~~~~~~~~~~~~^^^^^^^^^^^^^^^^^^^^^^^^^^^ AssertionError: 2 != 1
Traceback (most recent call last): File "b:\uildarea\3.14.ware-win11.refleak\build\Lib\test\test_annotationlib.py", line 1800, in test_evaluate_with_type_params with self.assertRaises(NameError): ~~~~~~~~~~~~~~~~~^^^^^^^^^^^ AssertionError: NameError not raised
Traceback (most recent call last): File "b:\uildarea\3.14.ware-win11.refleak\build\Lib\test\test_annotationlib.py", line 1885, in test_evaluate_undefined_generic generic = get_annotations(C, format=Format.FORWARDREF)["x"].evaluate( ^^^^^^^^^^^^^^^^^^^^^^^^^^^^^^^^^^^^^^^^^^^^^^^^^^^^^^^^^^ AttributeError: type object 'list' has no attribute 'evaluate'
Traceback (most recent call last): File "b:\uildarea\3.14.ware-win11.refleak\build\Lib\test\test_annotationlib.py", line 1919, in test_re_evaluate_generics evaluated = get_annotations(C, format=Format.FORWARDREF)["x"].evaluate(format=Format.FORWARDREF) ^^^^^^^^^^^^^^^^^^^^^^^^^^^^^^^^^^^^^^^^^^^^^^^^^^^^^^^^^^ AttributeError: type object 'list' has no attribute 'evaluate'
Test report
Failed tests:
- test.test_concurrent_futures.test_interpreter_pool
- test_annotationlib
Failed subtests:
- test_evaluate_undefined_generic - test.test_annotationlib.TestForwardRefClass.test_evaluate_undefined_generic
- test_re_evaluate_generics - test.test_annotationlib.TestForwardRefClass.test_re_evaluate_generics
- test_idle_thread_reuse - test.test_concurrent_futures.test_interpreter_pool.InterpreterPoolExecutorTest.test_idle_thread_reuse
- test_evaluate_with_type_params - test.test_annotationlib.TestForwardRefClass.test_evaluate_with_type_params
Test leaking resources:
- test_interpreter_pool: memory blocks
Sincerely, -The Buildbot
participants (1)
-
buildbot@python.org