☠ Buildbot (Python): python/cpython - failed test (failure) uploading test-results.xml (failure) (3.12)
The Buildbot has detected a new failure on builder wasm32-wasi 3.12 while building python/cpython. Full details are available at: https://buildbot.python.org/all/#/builders/1124/builds/464
Buildbot URL: https://buildbot.python.org/all/
Worker for this Build: bcannon-wasi
Build Reason: <unknown> Blamelist: Eric Snow <ericsnowcurrently@gmail.com>, Miss Islington (bot) <31488909+miss-islington@users.noreply.github.com>
BUILD FAILED: failed test (failure) uploading test-results.xml (failure)
Summary of the results of the build (if available):
==
Captured traceback
Traceback (most recent call last): File "/Lib/test/libregrtest/single.py", line 182, in _runtest_env_changed_exc _load_run_test(result, runtests) File "/Lib/test/libregrtest/single.py", line 129, in _load_run_test test_mod = importlib.import_module(module_name) ^^^^^^^^^^^^^^^^^^^^^^^^^^^^^^^^^^^^ File "/Lib/importlib/__init__.py", line 90, in import_module return _bootstrap._gcd_import(name[level:], package, level) ^^^^^^^^^^^^^^^^^^^^^^^^^^^^^^^^^^^^^^^^^^^^^^^^^^^^ File "<frozen importlib._bootstrap>", line 1387, in _gcd_import File "<frozen importlib._bootstrap>", line 1360, in _find_and_load File "<frozen importlib._bootstrap>", line 1331, in _find_and_load_unlocked File "<frozen importlib._bootstrap>", line 935, in _load_unlocked File "<frozen importlib._bootstrap_external>", line 994, in exec_module File "<frozen importlib._bootstrap>", line 488, in _call_with_frames_removed File "/Lib/test/test_sys.py", line 18, in <module> from test.support import interpreters File "/Lib/test/support/interpreters.py", line 4, in <module> import _xxsubinterpreters as _interpreters ModuleNotFoundError: No module named '_xxsubinterpreters'
Test report
Failed tests:
- test_sys
Sincerely, -The BuildbotThe Buildbot has detected a new failure on builder wasm32 WASI 8Core 3.12 while building python/cpython. Full details are available at: https://buildbot.python.org/all/#/builders/1345/builds/21
Buildbot URL: https://buildbot.python.org/all/
Worker for this Build: kushaldas-wasi
Build Reason: <unknown> Blamelist: Eric Snow <ericsnowcurrently@gmail.com>, Miss Islington (bot) <31488909+miss-islington@users.noreply.github.com>
BUILD FAILED: failed test (failure) uploading test-results.xml (failure)
Summary of the results of the build (if available):
==
Captured traceback
Traceback (most recent call last): File "/Lib/test/libregrtest/single.py", line 182, in _runtest_env_changed_exc _load_run_test(result, runtests) File "/Lib/test/libregrtest/single.py", line 129, in _load_run_test test_mod = importlib.import_module(module_name) ^^^^^^^^^^^^^^^^^^^^^^^^^^^^^^^^^^^^ File "/Lib/importlib/__init__.py", line 90, in import_module return _bootstrap._gcd_import(name[level:], package, level) ^^^^^^^^^^^^^^^^^^^^^^^^^^^^^^^^^^^^^^^^^^^^^^^^^^^^ File "<frozen importlib._bootstrap>", line 1387, in _gcd_import File "<frozen importlib._bootstrap>", line 1360, in _find_and_load File "<frozen importlib._bootstrap>", line 1331, in _find_and_load_unlocked File "<frozen importlib._bootstrap>", line 935, in _load_unlocked File "<frozen importlib._bootstrap_external>", line 994, in exec_module File "<frozen importlib._bootstrap>", line 488, in _call_with_frames_removed File "/Lib/test/test_sys.py", line 18, in <module> from test.support import interpreters File "/Lib/test/support/interpreters.py", line 4, in <module> import _xxsubinterpreters as _interpreters ModuleNotFoundError: No module named '_xxsubinterpreters'
Test report
Failed tests:
- test_sys
Sincerely, -The Buildbot
participants (1)
-
buildbot@python.org