☠ Buildbot (Python): python/cpython - failed test (failure) uploading test-results.xml (failure) (main)
The Buildbot has detected a new failure on builder s390x RHEL8 LTO + PGO 3.x while building python/cpython. Full details are available at: https://buildbot.python.org/all/#/builders/442/builds/4736
Buildbot URL: https://buildbot.python.org/all/
Worker for this Build: edelsohn-rhel8-z
Build Reason: <unknown> Blamelist: Adam Turner <9087854+AA-Turner@users.noreply.github.com>, Alex Waygood <Alex.Waygood@Gmail.com>, Alexandru Mărășteanu <alexei@users.noreply.github.com>, Anders Kaseorg <andersk@mit.edu>, Barney Gale <barney.gale@gmail.com>, Brandt Bucher <brandtbucher@microsoft.com>, Charlie Zhao <zhaoyu_hit@qq.com>, Christopher Chavez <chrischavez@gmx.us>, Daniele Procida <daniele@vurt.org>, Dong-hee Na <donghee.na@python.org>, Eric Snow <ericsnowcurrently@gmail.com>, Erlend E. Aasland <erlend@python.org>, Felipe A. Hernandez <ergoithz@gmail.com>, Furkan Onder <furkanonder@protonmail.com>, Georg Brandl <georg@python.org>, Gertjan van Zwieten <git@gjvz.nl>, Guido van Rossum <guido@python.org>, Hugo van Kemenade <hugovk@users.noreply.github.com>, Illia Volochii <illia.volochii@gmail.com>, Inada Naoki <songofacandy@gmail.com>, Irit Katriel <1055913+iritkatriel@users.noreply.github.com>, Ivin Lee <62840497+rdrf2838@users.noreply.github.com>, Jacob Walls <jacobtylerwalls@gmail.com>, James C ave <jcave137@gmail.com>, James Hilton-Balfe <gobot1234yt@gmail.com>, Kamil Turek <kamil.turek@hotmail.com>, Konstantin <kpp.live+github@gmail.com>, Kumar Aditya <kumaraditya@python.org>, Mark Shannon <mark@hotpy.org>, Michael The <michael-the1@users.noreply.github.com>, Ned Deily <nad@python.org>, Nikita Sobolev <mail@sobolevn.me>, Pablo Galindo Salgado <Pablogsal@gmail.com>, Pieter Eendebak <pieter.eendebak@gmail.com>, Rakesh Sabale <102187286+ghubrakesh@users.noreply.github.com>, Serhiy Storchaka <storchaka@gmail.com>, Terry Jan Reedy <tjreedy@udel.edu>, Tian Gao <gaogaotiantian@hotmail.com>, Tom Niget <zippedfire@free.fr>, Tomas R <tomas.roun8@gmail.com>, Victor Stinner <vstinner@python.org>, cocoatomo <cocoatomo77@gmail.com>, da-woods <dw-git@d-woods.co.uk>, justdan6 <134341009+justdan6@users.noreply.github.com>, opavliuk <40970635+opavlyuk@users.noreply.github.com>, shailshouryya <42100758+shailshouryya@users.noreply.github.com>
BUILD FAILED: failed test (failure) uploading test-results.xml (failure)
Summary of the results of the build (if available):
==
Captured traceback
Traceback (most recent call last): File "/home/dje/cpython-buildarea/3.x.edelsohn-rhel8-z.lto-pgo/build/Lib/multiprocessing/resource_tracker.py", line 209, in main cache[rtype].remove(name) KeyError: '/psm_c3b35b68'
Traceback (most recent call last):
File "/home/dje/cpython-buildarea/3.x.edelsohn-rhel8-z.lto-pgo/build/Lib/test/test_tools/test_freeze.py", line 27, in test_freeze_simple_script
outdir, scriptfile, python = helper.prepare(script, outdir)
^^^^^^^^^^^^^^^^^^^^^^^^^^^^^^
File "/home/dje/cpython-buildarea/3.x.edelsohn-rhel8-z.lto-pgo/build/Tools/freeze/test/freeze.py", line 146, in prepare
copy_source_tree(srcdir, SRCDIR)
File "/home/dje/cpython-buildarea/3.x.edelsohn-rhel8-z.lto-pgo/build/Tools/freeze/test/freeze.py", line 95, in copy_source_tree
shutil.copytree(oldroot, newroot, ignore=ignore_non_src)
File "/home/dje/cpython-buildarea/3.x.edelsohn-rhel8-z.lto-pgo/build/Lib/shutil.py", line 588, in copytree
return _copytree(entries=entries, src=src, dst=dst, symlinks=symlinks,
^^^^^^^^^^^^^^^^^^^^^^^^^^^^^^^^^^^^^^^^^^^^^^^^^^^^^^^^^^^^^^^
File "/home/dje/cpython-buildarea/3.x.edelsohn-rhel8-z.lto-pgo/build/Lib/shutil.py", line 542, in _copytree
raise Error(errors)
shutil.Error: [('/home/dje/cpython-buildarea/3.x.edelsohn-rhel8-z.lto-pgo/build/build/test_python_2158826æ/test_python_worker_2180532æ/@test_2180532_tmpæ-tardir/extractall_ctrl/ustar/fifotype', '/tmp/test_python__grlcj_1/tmp71fugc0g/cpython/build/test_python_2158826æ/test_python_worker_2180532æ/@test_2180532_tmpæ-tardir/extractall_ctrl/ustar/fifotype', '/home/dje/cpython-buildarea/3.x.edelsohn-rhel8-z.lto-pgo/build/build/test_python_2158826æ/test_python_worker_2180532æ/@test_2180532_tmpæ-tardir/extractall_ctrl/ustar/fifotype is a named pipe'), ('/home/dje/cpython-buildarea/3.x.edelsohn-rhel8-z.lto-pgo/build/build/test_python_2158826æ/test_python_worker_2180532æ/@test_2180532_tmpæ-tardir/extractall_none/ustar/fifotype', '/tmp/test_python__grlcj_1/tmp71fugc0g/cpython/build/test_python_2158826æ/test_python_worker_2180532æ/@test_2180532_tmpæ-tardir/extractall_none/ustar/fifotype', '/home/dje/cpython-buildarea/3.x.edelsohn-rhel8-z.lto-pgo/build/build/test_python_2158826� �/test_python_worker_2180532æ/@test_2180532_tmpæ-tardir/extractall_none/ustar/fifotype is a named pipe'), ('/home/dje/cpython-buildarea/3.x.edelsohn-rhel8-z.lto-pgo/build/build/test_python_2158826æ/test_python_worker_2180826æ', '/tmp/test_python__grlcj_1/tmp71fugc0g/cpython/build/test_python_2158826æ/test_python_worker_2180826æ', "[Errno 2] No such file or directory: '/home/dje/cpython-buildarea/3.x.edelsohn-rhel8-z.lto-pgo/build/build/test_python_2158826æ/test_python_worker_2180826æ'")]
Test report
Failed tests:
- test_tools
Failed subtests:
- test_freeze_simple_script - test.test_tools.test_freeze.TestFreeze.test_freeze_simple_script
Sincerely, -The Buildbot
participants (1)
-
buildbot@python.org