Buildbot failure in Python on s390x RHEL7 LTO 3.x
The Buildbot has detected a new failure on builder s390x RHEL7 LTO 3.x while building python/cpython. Full details are available at: https://buildbot.python.org/all/#builders/402/builds/271
Buildbot URL: https://buildbot.python.org/all/
Worker for this Build: edelsohn-rhel-z
Build Reason: <unknown> Blamelist: Alexey Izbyshev <izbyshev@ispras.ru>, Lysandros Nikolaou <lisandrosnik@gmail.com>, kj <28750310+Fidget-Spinner@users.noreply.github.com>
BUILD FAILED: failed test (failure)
Summary of the results of the build (if available):
== Tests result: FAILURE then FAILURE ==
410 tests OK.
10 slowest tests:
- test_concurrent_futures: 3 min 8 sec
- test_peg_generator: 2 min 26 sec
- test_tokenize: 1 min 37 sec
- test_multiprocessing_spawn: 1 min 27 sec
- test_unparse: 1 min 21 sec
- test_multiprocessing_forkserver: 1 min 11 sec
- test_asyncio: 1 min 6 sec
- test_nntplib: 1 min 5 sec
- test_lib2to3: 1 min 2 sec
- test_multiprocessing_fork: 58.1 sec
1 test failed: test_zipimport
13 tests skipped: test_devpoll test_ioctl test_kqueue test_msilib test_ossaudiodev test_startfile test_tix test_tk test_ttk_guionly test_winconsoleio test_winreg test_winsound test_zipfile64
1 re-run test: test_zipimport
Total duration: 6 min 16 sec
Captured traceback
Traceback (test.test_zipimport.CompressedZipImportTestCase) ... ok
Traceback (most recent call last): File "/home/dje/cpython-buildarea/3.x.edelsohn-rhel-z.lto/build/Lib/test/test_zipimport.py", line 594, in testGetCompiledSource self.doTest(pyc_ext, files, TESTMOD, call=self.assertModuleSource) File "/home/dje/cpython-buildarea/3.x.edelsohn-rhel-z.lto/build/Lib/test/test_zipimport.py", line 148, in doTest self.assertEqual(file, os.path.join(TEMP_ZIP, AssertionError: '/hom[48 chars]build/build/test_python_24792æ/junk95142.zip/ziptestmodule.py' != '/hom[48 chars]build/build/test_python_24792æ/junk95142.zip/ziptestmodule.pyc'
- /home/dje/cpython-buildarea/3.x.edelsohn-rhel-z.lto/build/build/test_python_24792æ/junk95142.zip/ziptestmodule.py
- /home/dje/cpython-buildarea/3.x.edelsohn-rhel-z.lto/build/build/test_python_24792æ/junk95142.zip/ziptestmodule.pyc ? +
Traceback (test.test_zipimport.UncompressedZipImportTestCase) ... ok
Traceback (most recent call last): File "/home/dje/cpython-buildarea/3.x.edelsohn-rhel-z.lto/build/Lib/test/test_zipimport.py", line 194, in testBoth self.doTest(pyc_ext, files, TESTMOD) File "/home/dje/cpython-buildarea/3.x.edelsohn-rhel-z.lto/build/Lib/test/test_zipimport.py", line 148, in doTest self.assertEqual(file, os.path.join(TEMP_ZIP, AssertionError: '/hom[48 chars]build/build/test_python_24792æ/junk95142.zip/ziptestmodule.py' != '/hom[48 chars]build/build/test_python_24792æ/junk95142.zip/ziptestmodule.pyc'
- /home/dje/cpython-buildarea/3.x.edelsohn-rhel-z.lto/build/build/test_python_24792æ/junk95142.zip/ziptestmodule.py
- /home/dje/cpython-buildarea/3.x.edelsohn-rhel-z.lto/build/build/test_python_24792æ/junk95142.zip/ziptestmodule.pyc ? +
Traceback (most recent call last): File "/home/dje/cpython-buildarea/3.x.edelsohn-rhel-z.lto/build/Lib/test/test_zipimport.py", line 194, in testBoth self.doTest(pyc_ext, files, TESTMOD) File "/home/dje/cpython-buildarea/3.x.edelsohn-rhel-z.lto/build/Lib/test/test_zipimport.py", line 148, in doTest self.assertEqual(file, os.path.join(TEMP_ZIP, AssertionError: '/hom[74 chars]792æ/test_python_worker_35756æ/junk95142.zip/ziptestmodule.py' != '/hom[74 chars]792æ/test_python_worker_35756æ/junk95142.zip/ziptestmodule.pyc'
- /home/dje/cpython-buildarea/3.x.edelsohn-rhel-z.lto/build/build/test_python_24792æ/test_python_worker_35756æ/junk95142.zip/ziptestmodule.py
- /home/dje/cpython-buildarea/3.x.edelsohn-rhel-z.lto/build/build/test_python_24792æ/test_python_worker_35756æ/junk95142.zip/ziptestmodule.pyc ? +
Traceback (most recent call last): File "/home/dje/cpython-buildarea/3.x.edelsohn-rhel-z.lto/build/Lib/test/test_zipimport.py", line 594, in testGetCompiledSource self.doTest(pyc_ext, files, TESTMOD, call=self.assertModuleSource) File "/home/dje/cpython-buildarea/3.x.edelsohn-rhel-z.lto/build/Lib/test/test_zipimport.py", line 148, in doTest self.assertEqual(file, os.path.join(TEMP_ZIP, AssertionError: '/hom[74 chars]792æ/test_python_worker_35756æ/junk95142.zip/ziptestmodule.py' != '/hom[74 chars]792æ/test_python_worker_35756æ/junk95142.zip/ziptestmodule.pyc'
- /home/dje/cpython-buildarea/3.x.edelsohn-rhel-z.lto/build/build/test_python_24792æ/test_python_worker_35756æ/junk95142.zip/ziptestmodule.py
- /home/dje/cpython-buildarea/3.x.edelsohn-rhel-z.lto/build/build/test_python_24792æ/test_python_worker_35756æ/junk95142.zip/ziptestmodule.pyc ? +
Test report
Failed tests:
- test_zipimport
Failed subtests:
- testBoth - test.test_zipimport.UncompressedZipImportTestCase
- testGetCompiledSource - test.test_zipimport.UncompressedZipImportTestCase
- testBoth - test.test_zipimport.CompressedZipImportTestCase
- testGetCompiledSource - test.test_zipimport.CompressedZipImportTestCase
Sincerely, -The Buildbot
participants (1)
-
buildbot@python.org