☠ Buildbot (Python): python/cpython - failed test (failure) (main)
The Buildbot has detected a new failure on builder PPC64LE RHEL8 3.x while building python/cpython. Full details are available at: https://buildbot.python.org/all/#builders/559/builds/3098
Buildbot URL: https://buildbot.python.org/all/
Worker for this Build: cstratak-RHEL8-ppc64le
Build Reason: <unknown> Blamelist: Dong-hee Na <donghee.na@python.org>, Erlend E. Aasland <erlend.aasland@protonmail.com>, Filipe Laíns <lains@riseup.net>, Gihwan Kim <ghkim3221@gmail.com>, Irit Katriel <1055913+iritkatriel@users.noreply.github.com>, Jason R. Coombs <jaraco@jaraco.com>, Owain Davies <116417456+OTheDev@users.noreply.github.com>, Tim Hatch <tim@timhatch.com>
BUILD FAILED: failed test (failure)
Summary of the results of the build (if available):
== Tests result: FAILURE then FAILURE ==
416 tests OK.
10 slowest tests:
- test_gdb: 14 min 36 sec
- test_math: 5 min 38 sec
- test_multiprocessing_spawn: 4 min 10 sec
- test_tokenize: 3 min 26 sec
- test_concurrent_futures: 3 min 24 sec
- test_capi: 2 min 17 sec
- test_asyncio: 2 min 16 sec
- test_multiprocessing_forkserver: 2 min
- test_lib2to3: 1 min 58 sec
- test_unicodedata: 1 min 47 sec
1 test failed: test_zipfile
17 tests skipped: test_check_c_globals test_devpoll test_ioctl test_kqueue test_launcher test_msilib test_peg_generator test_perf_profiler test_startfile test_tix test_tkinter test_ttk test_winconsoleio test_winreg test_winsound test_wmi test_zipfile64
1 re-run test: test_zipfile
Total duration: 16 min 51 sec
Captured traceback
Traceback (most recent call last): File "/home/buildbot/buildarea/3.x.cstratak-RHEL8-ppc64le/build/Lib/contextlib.py", line 80, in inner with self._recreate_cm(): File "/home/buildbot/buildarea/3.x.cstratak-RHEL8-ppc64le/build/Lib/test/test_zipfile/_context.py", line 30, in __exit__ raise DeadlineExceeded(duration, self.max_duration)
Test report
Failed tests:
- test_zipfile
Failed subtests:
- test_implied_dirs_performance - test.test_zipfile.test_path.TestPath.test_implied_dirs_performance
Sincerely, -The BuildbotThe Buildbot has detected a new failure on builder PPC64LE Fedora Rawhide 3.x while building python/cpython. Full details are available at: https://buildbot.python.org/all/#builders/455/builds/3335
Buildbot URL: https://buildbot.python.org/all/
Worker for this Build: cstratak-fedora-rawhide-ppc64le
Build Reason: <unknown> Blamelist: Erlend E. Aasland <erlend.aasland@protonmail.com>, Filipe Laíns <lains@riseup.net>, Gihwan Kim <ghkim3221@gmail.com>, Irit Katriel <1055913+iritkatriel@users.noreply.github.com>, Jason R. Coombs <jaraco@jaraco.com>, Owain Davies <116417456+OTheDev@users.noreply.github.com>
BUILD FAILED: failed test (failure)
Summary of the results of the build (if available):
== Tests result: FAILURE then FAILURE ==
416 tests OK.
10 slowest tests:
- test_gdb: 5 min 34 sec
- test_math: 5 min 4 sec
- test_multiprocessing_spawn: 3 min 53 sec
- test_tokenize: 3 min 8 sec
- test_concurrent_futures: 3 min 4 sec
- test_asyncio: 2 min 22 sec
- test_unicodedata: 1 min 54 sec
- test_lib2to3: 1 min 52 sec
- test_capi: 1 min 50 sec
- test_multiprocessing_forkserver: 1 min 49 sec
1 test failed: test_zipfile
17 tests skipped: test_check_c_globals test_devpoll test_ioctl test_kqueue test_launcher test_msilib test_peg_generator test_perf_profiler test_startfile test_tix test_tkinter test_ttk test_winconsoleio test_winreg test_winsound test_wmi test_zipfile64
1 re-run test: test_zipfile
Total duration: 9 min 23 sec
Captured traceback
Traceback (most recent call last): File "/home/buildbot/buildarea/3.x.cstratak-fedora-rawhide-ppc64le/build/Lib/contextlib.py", line 80, in inner with self._recreate_cm(): File "/home/buildbot/buildarea/3.x.cstratak-fedora-rawhide-ppc64le/build/Lib/test/test_zipfile/_context.py", line 30, in __exit__ raise DeadlineExceeded(duration, self.max_duration)
Test report
Failed tests:
- test_zipfile
Failed subtests:
- test_implied_dirs_performance - test.test_zipfile.test_path.TestPath.test_implied_dirs_performance
Sincerely, -The BuildbotThe Buildbot has detected a new failure on builder PPC64LE Fedora Stable 3.x while building python/cpython. Full details are available at: https://buildbot.python.org/all/#builders/90/builds/2856
Buildbot URL: https://buildbot.python.org/all/
Worker for this Build: cstratak-fedora-stable-ppc64le
Build Reason: <unknown> Blamelist: Erlend E. Aasland <erlend.aasland@protonmail.com>, Filipe Laíns <lains@riseup.net>, Gihwan Kim <ghkim3221@gmail.com>, Irit Katriel <1055913+iritkatriel@users.noreply.github.com>, Jason R. Coombs <jaraco@jaraco.com>, Owain Davies <116417456+OTheDev@users.noreply.github.com>
BUILD FAILED: failed test (failure)
Summary of the results of the build (if available):
== Tests result: FAILURE then FAILURE ==
416 tests OK.
10 slowest tests:
- test_math: 6 min 5 sec
- test_multiprocessing_spawn: 5 min 33 sec
- test_gdb: 5 min 25 sec
- test_concurrent_futures: 3 min 37 sec
- test_tokenize: 3 min 27 sec
- test_asyncio: 3 min 8 sec
- test_multiprocessing_forkserver: 2 min 56 sec
- test_unparse: 2 min 21 sec
- test_lib2to3: 2 min 6 sec
- test_capi: 2 min 4 sec
1 test failed: test_zipfile
17 tests skipped: test_check_c_globals test_devpoll test_ioctl test_kqueue test_launcher test_msilib test_peg_generator test_perf_profiler test_startfile test_tix test_tkinter test_ttk test_winconsoleio test_winreg test_winsound test_wmi test_zipfile64
2 re-run tests: test_multiprocessing_spawn test_zipfile
Total duration: 11 min 47 sec
Captured traceback
Traceback (most recent call last): File "/home/buildbot/buildarea/3.x.cstratak-fedora-stable-ppc64le/build/Lib/test/_test_multiprocessing.py", line 5751, in test_value self.run_worker(self._test_value, o) File "/home/buildbot/buildarea/3.x.cstratak-fedora-stable-ppc64le/build/Lib/test/_test_multiprocessing.py", line 5606, in run_worker self.wait_proc_exit() File "/home/buildbot/buildarea/3.x.cstratak-fedora-stable-ppc64le/build/Lib/test/_test_multiprocessing.py", line 5588, in wait_proc_exit join_process(self.proc) File "/home/buildbot/buildarea/3.x.cstratak-fedora-stable-ppc64le/build/Lib/test/_test_multiprocessing.py", line 97, in join_process threading_helper.join_thread(process) File "/home/buildbot/buildarea/3.x.cstratak-fedora-stable-ppc64le/build/Lib/test/support/threading_helper.py", line 113, in join_thread raise AssertionError(msg) AssertionError: failed to join the thread in 30.0 seconds
Traceback (most recent call last): File "/home/buildbot/buildarea/3.x.cstratak-fedora-stable-ppc64le/build/Lib/contextlib.py", line 80, in inner with self._recreate_cm(): File "/home/buildbot/buildarea/3.x.cstratak-fedora-stable-ppc64le/build/Lib/test/test_zipfile/_context.py", line 30, in __exit__ raise DeadlineExceeded(duration, self.max_duration)
Test report
Failed tests:
- test_zipfile
- test_multiprocessing_spawn
Failed subtests:
- test_value - test.test_multiprocessing_spawn.TestSyncManagerTypes.test_value
- test_implied_dirs_performance - test.test_zipfile.test_path.TestPath.test_implied_dirs_performance
Sincerely, -The Buildbot
participants (1)
-
buildbot@python.org