☠ Buildbot (Python): python/cpython - failed test (failure) uploading test-results.xml (failure) (main)
The Buildbot has detected a new failure on builder wasm32-wasi 3.x while building python/cpython. Full details are available at: https://buildbot.python.org/all/#/builders/1046/builds/3456
Buildbot URL: https://buildbot.python.org/all/
Worker for this Build: bcannon-wasm
Build Reason: <unknown> Blamelist: Sam Gross <colesbury@gmail.com>
BUILD FAILED: failed test (failure) uploading test-results.xml (failure)
Summary of the results of the build (if available):
==
Captured traceback
remote: Enumerating objects: 33, done.
remote: Counting objects: 3% (1/27)
remote: Counting objects: 7% (2/27)
remote: Counting objects: 11% (3/27)
remote: Counting objects: 14% (4/27)
remote: Counting objects: 18% (5/27)
remote: Counting objects: 22% (6/27)
remote: Counting objects: 25% (7/27)
remote: Counting objects: 29% (8/27)
remote: Counting objects: 33% (9/27)
remote: Counting objects: 37% (10/27)
remote: Counting objects: 40% (11/27)
remote: Counting objects: 44% (12/27)
remote: Counting objects: 48% (13/27)
remote: Counting objects: 51% (14/27)
remote: Counting objects: 55% (15/27)
remote: Counting objects: 59% (16/27)
remote: Counting objects: 62% (17/27)
remote: Counting objects: 66% (18/27)
remote: Counting objects: 70% (19/27)
remote: Counting objects: 74% (20/27)
remote: Counting objects: 77% (21/27)
remote: Counting objects: 81% (22/27)
remote: Counting objects: 85% (23/27)
remote: Counting objects: 88% (24/27)
remote: Counting objects: 92% (25/27)
remote: Counting objects: 96% (26/27)
remote: Counting objects: 100% (27/27)
remote: Counting objects: 100% (27/27), done.
remote: Compressing objects: 10% (1/10)
remote: Compressing objects: 20% (2/10)
remote: Compressing objects: 30% (3/10)
remote: Compressing objects: 40% (4/10)
remote: Compressing objects: 50% (5/10)
remote: Compressing objects: 60% (6/10)
remote: Compressing objects: 70% (7/10)
remote: Compressing objects: 80% (8/10)
remote: Compressing objects: 90% (9/10)
remote: Compressing objects: 100% (10/10)
remote: Compressing objects: 100% (10/10), done.
remote: Total 33 (delta 17), reused 18 (delta 17), pack-reused 6
From https://github.com/python/cpython
- branch main -> FETCH_HEAD Note: switching to '31c90d5838e8d6e4c47d98500a34810ccb33a6d4'.
You are in 'detached HEAD' state. You can look around, make experimental changes and commit them, and you can discard any commits you make in this state without impacting any branches by switching back to a branch.
If you want to create a new branch to retain commits you create, you may do so (now or later) by using -c with the switch command. Example:
git switch -c <new-branch-name>
Or undo this operation with:
git switch -
Turn off this advice by setting config variable advice.detachedHead to false
HEAD is now at 31c90d5838 gh-111569: Implement Python critical section API (gh-111571) Switched to and reset branch 'main'
configure: WARNING: using cross tools not prefixed with host triplet
../../Python/ceval_gil.c:429:1: warning: unused function 'current_thread_holds_gil' [-Wunused-function]
current_thread_holds_gil(struct _gil_runtime_state *gil, PyThreadState *tstate)
^
1 warning generated.
In file included from ../../Modules/md5module.c:51:
In file included from ../../Modules/_hacl/Hacl_Hash_MD5.h:34:
In file included from ../../Modules/_hacl/include/krml/types.h:12:
../../Modules/_hacl/include/krml/lowstar_endianness.h:130:11: warning: 'htole32' macro redefined [-Wmacro-redefined]
# define htole32(x) (x)
^
/opt/wasi-sdk/bin/../share/wasi-sysroot/include/endian.h:43:9: note: previous definition is here
#define htole32(x) (uint32_t)(x)
^
In file included from ../../Modules/md5module.c:51:
In file included from ../../Modules/_hacl/Hacl_Hash_MD5.h:34:
In file included from ../../Modules/_hacl/include/krml/types.h:12:
../../Modules/_hacl/include/krml/lowstar_endianness.h:131:11: warning: 'le32toh' macro redefined [-Wmacro-redefined]
# define le32toh(x) (x)
^
/opt/wasi-sdk/bin/../share/wasi-sysroot/include/endian.h:44:9: note: previous definition is here
#define le32toh(x) (uint32_t)(x)
^
In file included from ../../Modules/md5module.c:51:
In file included from ../../Modules/_hacl/Hacl_Hash_MD5.h:34:
In file included from ../../Modules/_hacl/include/krml/types.h:12:
../../Modules/_hacl/include/krml/lowstar_endianness.h:132:11: warning: 'htobe32' macro redefined [-Wmacro-redefined]
# define htobe32(x)
^
/opt/wasi-sdk/bin/../share/wasi-sysroot/include/endian.h:37:9: note: previous definition is here
#define htobe32(x) __bswap32(x)
^
In file included from ../../Modules/md5module.c:51:
In file included from ../../Modules/_hacl/Hacl_Hash_MD5.h:34:
In file included from ../../Modules/_hacl/include/krml/types.h:12:
../../Modules/_hacl/include/krml/lowstar_endianness.h:138:11: warning: 'be32toh' macro redefined [-Wmacro-redefined]
# define be32toh(x) (htobe32((x)))
^
/opt/wasi-sdk/bin/../share/wasi-sysroot/include/endian.h:38:9: note: previous definition is here
#define be32toh(x) __bswap32(x)
^
In file included from ../../Modules/md5module.c:51:
In file included from ../../Modules/_hacl/Hacl_Hash_MD5.h:34:
In file included from ../../Modules/_hacl/include/krml/types.h:12:
../../Modules/_hacl/include/krml/lowstar_endianness.h:140:11: warning: 'htole64' macro redefined [-Wmacro-redefined]
# define htole64(x) (x)
^
/opt/wasi-sdk/bin/../share/wasi-sysroot/include/endian.h:45:9: note: previous definition is here
#define htole64(x) (uint64_t)(x)
^
In file included from ../../Modules/md5module.c:51:
In file included from ../../Modules/_hacl/Hacl_Hash_MD5.h:34:
In file included from ../../Modules/_hacl/include/krml/types.h:12:
../../Modules/_hacl/include/krml/lowstar_endianness.h:141:11: warning: 'le64toh' macro redefined [-Wmacro-redefined]
# define le64toh(x) (x)
^
/opt/wasi-sdk/bin/../share/wasi-sysroot/include/endian.h:46:9: note: previous definition is here
#define le64toh(x) (uint64_t)(x)
^
In file included from ../../Modules/md5module.c:51:
In file included from ../../Modules/_hacl/Hacl_Hash_MD5.h:34:
In file included from ../../Modules/_hacl/include/krml/types.h:12:
../../Modules/_hacl/include/krml/lowstar_endianness.h:142:11: warning: 'htobe64' macro redefined [-Wmacro-redefined]
# define htobe64(x)
^
/opt/wasi-sdk/bin/../share/wasi-sysroot/include/endian.h:39:9: note: previous definition is here
#define htobe64(x) __bswap64(x)
^
In file included from ../../Modules/md5module.c:51:
In file included from ../../Modules/_hacl/Hacl_Hash_MD5.h:34:
In file included from ../../Modules/_hacl/include/krml/types.h:12:
../../Modules/_hacl/include/krml/lowstar_endianness.h:149:11: warning: 'be64toh' macro redefined [-Wmacro-redefined]
# define be64toh(x) (htobe64((x)))
^
/opt/wasi-sdk/bin/../share/wasi-sysroot/include/endian.h:40:9: note: previous definition is here
#define be64toh(x) __bswap64(x)
^
8 warnings generated.
In file included from ../../Modules/sha1module.c:47:
In file included from ../../Modules/_hacl/Hacl_Hash_SHA1.h:34:
In file included from ../../Modules/_hacl/include/krml/types.h:12:
../../Modules/_hacl/include/krml/lowstar_endianness.h:130:11: warning: 'htole32' macro redefined [-Wmacro-redefined]
# define htole32(x) (x)
^
/opt/wasi-sdk/bin/../share/wasi-sysroot/include/endian.h:43:9: note: previous definition is here
#define htole32(x) (uint32_t)(x)
^
In file included from ../../Modules/sha1module.c:47:
In file included from ../../Modules/_hacl/Hacl_Hash_SHA1.h:34:
In file included from ../../Modules/_hacl/include/krml/types.h:12:
../../Modules/_hacl/include/krml/lowstar_endianness.h:131:11: warning: 'le32toh' macro redefined [-Wmacro-redefined]
# define le32toh(x) (x)
^
/opt/wasi-sdk/bin/../share/wasi-sysroot/include/endian.h:44:9: note: previous definition is here
#define le32toh(x) (uint32_t)(x)
^
In file included from ../../Modules/sha1module.c:47:
In file included from ../../Modules/_hacl/Hacl_Hash_SHA1.h:34:
In file included from ../../Modules/_hacl/include/krml/types.h:12:
../../Modules/_hacl/include/krml/lowstar_endianness.h:132:11: warning: 'htobe32' macro redefined [-Wmacro-redefined]
# define htobe32(x)
^
/opt/wasi-sdk/bin/../share/wasi-sysroot/include/endian.h:37:9: note: previous definition is here
#define htobe32(x) __bswap32(x)
^
In file included from ../../Modules/sha1module.c:47:
In file included from ../../Modules/_hacl/Hacl_Hash_SHA1.h:34:
In file included from ../../Modules/_hacl/include/krml/types.h:12:
../../Modules/_hacl/include/krml/lowstar_endianness.h:138:11: warning: 'be32toh' macro redefined [-Wmacro-redefined]
# define be32toh(x) (htobe32((x)))
^
/opt/wasi-sdk/bin/../share/wasi-sysroot/include/endian.h:38:9: note: previous definition is here
#define be32toh(x) __bswap32(x)
^
In file included from ../../Modules/sha1module.c:47:
In file included from ../../Modules/_hacl/Hacl_Hash_SHA1.h:34:
In file included from ../../Modules/_hacl/include/krml/types.h:12:
../../Modules/_hacl/include/krml/lowstar_endianness.h:140:11: warning: 'htole64' macro redefined [-Wmacro-redefined]
# define htole64(x) (x)
^
/opt/wasi-sdk/bin/../share/wasi-sysroot/include/endian.h:45:9: note: previous definition is here
#define htole64(x) (uint64_t)(x)
^
In file included from ../../Modules/sha1module.c:47:
In file included from ../../Modules/_hacl/Hacl_Hash_SHA1.h:34:
In file included from ../../Modules/_hacl/include/krml/types.h:12:
../../Modules/_hacl/include/krml/lowstar_endianness.h:141:11: warning: 'le64toh' macro redefined [-Wmacro-redefined]
# define le64toh(x) (x)
^
/opt/wasi-sdk/bin/../share/wasi-sysroot/include/endian.h:46:9: note: previous definition is here
#define le64toh(x) (uint64_t)(x)
^
In file included from ../../Modules/sha1module.c:47:
In file included from ../../Modules/_hacl/Hacl_Hash_SHA1.h:34:
In file included from ../../Modules/_hacl/include/krml/types.h:12:
../../Modules/_hacl/include/krml/lowstar_endianness.h:142:11: warning: 'htobe64' macro redefined [-Wmacro-redefined]
# define htobe64(x)
^
/opt/wasi-sdk/bin/../share/wasi-sysroot/include/endian.h:39:9: note: previous definition is here
#define htobe64(x) __bswap64(x)
^
In file included from ../../Modules/sha1module.c:47:
In file included from ../../Modules/_hacl/Hacl_Hash_SHA1.h:34:
In file included from ../../Modules/_hacl/include/krml/types.h:12:
../../Modules/_hacl/include/krml/lowstar_endianness.h:149:11: warning: 'be64toh' macro redefined [-Wmacro-redefined]
# define be64toh(x) (htobe64((x)))
^
/opt/wasi-sdk/bin/../share/wasi-sysroot/include/endian.h:40:9: note: previous definition is here
#define be64toh(x) __bswap64(x)
^
8 warnings generated.
In file included from ../../Modules/sha3module.c:59:
In file included from ../../Modules/_hacl/Hacl_Hash_SHA3.h:34:
In file included from ../../Modules/_hacl/include/krml/types.h:12:
../../Modules/_hacl/include/krml/lowstar_endianness.h:130:11: warning: 'htole32' macro redefined [-Wmacro-redefined]
# define htole32(x) (x)
^
/opt/wasi-sdk/bin/../share/wasi-sysroot/include/endian.h:43:9: note: previous definition is here
#define htole32(x) (uint32_t)(x)
^
In file included from ../../Modules/sha3module.c:59:
In file included from ../../Modules/_hacl/Hacl_Hash_SHA3.h:34:
In file included from ../../Modules/_hacl/include/krml/types.h:12:
../../Modules/_hacl/include/krml/lowstar_endianness.h:131:11: warning: 'le32toh' macro redefined [-Wmacro-redefined]
# define le32toh(x) (x)
^
/opt/wasi-sdk/bin/../share/wasi-sysroot/include/endian.h:44:9: note: previous definition is here
#define le32toh(x) (uint32_t)(x)
^
In file included from ../../Modules/sha3module.c:59:
In file included from ../../Modules/_hacl/Hacl_Hash_SHA3.h:34:
In file included from ../../Modules/_hacl/include/krml/types.h:12:
../../Modules/_hacl/include/krml/lowstar_endianness.h:132:11: warning: 'htobe32' macro redefined [-Wmacro-redefined]
# define htobe32(x)
^
/opt/wasi-sdk/bin/../share/wasi-sysroot/include/endian.h:37:9: note: previous definition is here
#define htobe32(x) __bswap32(x)
^
In file included from ../../Modules/sha3module.c:59:
In file included from ../../Modules/_hacl/Hacl_Hash_SHA3.h:34:
In file included from ../../Modules/_hacl/include/krml/types.h:12:
../../Modules/_hacl/include/krml/lowstar_endianness.h:138:11: warning: 'be32toh' macro redefined [-Wmacro-redefined]
# define be32toh(x) (htobe32((x)))
^
/opt/wasi-sdk/bin/../share/wasi-sysroot/include/endian.h:38:9: note: previous definition is here
#define be32toh(x) __bswap32(x)
^
In file included from ../../Modules/sha3module.c:59:
In file included from ../../Modules/_hacl/Hacl_Hash_SHA3.h:34:
In file included from ../../Modules/_hacl/include/krml/types.h:12:
../../Modules/_hacl/include/krml/lowstar_endianness.h:140:11: warning: 'htole64' macro redefined [-Wmacro-redefined]
# define htole64(x) (x)
^
/opt/wasi-sdk/bin/../share/wasi-sysroot/include/endian.h:45:9: note: previous definition is here
#define htole64(x) (uint64_t)(x)
^
In file included from ../../Modules/sha3module.c:59:
In file included from ../../Modules/_hacl/Hacl_Hash_SHA3.h:34:
In file included from ../../Modules/_hacl/include/krml/types.h:12:
../../Modules/_hacl/include/krml/lowstar_endianness.h:141:11: warning: 'le64toh' macro redefined [-Wmacro-redefined]
# define le64toh(x) (x)
^
/opt/wasi-sdk/bin/../share/wasi-sysroot/include/endian.h:46:9: note: previous definition is here
#define le64toh(x) (uint64_t)(x)
^
In file included from ../../Modules/sha3module.c:59:
In file included from ../../Modules/_hacl/Hacl_Hash_SHA3.h:34:
In file included from ../../Modules/_hacl/include/krml/types.h:12:
../../Modules/_hacl/include/krml/lowstar_endianness.h:142:11: warning: 'htobe64' macro redefined [-Wmacro-redefined]
# define htobe64(x)
^
/opt/wasi-sdk/bin/../share/wasi-sysroot/include/endian.h:39:9: note: previous definition is here
#define htobe64(x) __bswap64(x)
^
In file included from ../../Modules/sha3module.c:59:
In file included from ../../Modules/_hacl/Hacl_Hash_SHA3.h:34:
In file included from ../../Modules/_hacl/include/krml/types.h:12:
../../Modules/_hacl/include/krml/lowstar_endianness.h:149:11: warning: 'be64toh' macro redefined [-Wmacro-redefined]
# define be64toh(x) (htobe64((x)))
^
/opt/wasi-sdk/bin/../share/wasi-sysroot/include/endian.h:40:9: note: previous definition is here
#define be64toh(x) __bswap64(x)
^
8 warnings generated.
../../Modules/expat/xmlparse.c:3116:9: warning: code will never be executed [-Wunreachable-code]
parser->m_characterDataHandler(parser->m_handlerArg, parser->m_dataBuf,
^~~~~~
../../Modules/expat/xmlparse.c:3115:16: note: silence by adding parentheses to mark code as explicitly dead
else if (0 && parser->m_characterDataHandler)
^
/* DISABLES CODE */ ( )
../../Modules/expat/xmlparse.c:4059:9: warning: code will never be executed [-Wunreachable-code]
parser->m_characterDataHandler(parser->m_handlerArg, parser->m_dataBuf,
^~~~~~
../../Modules/expat/xmlparse.c:4058:16: note: silence by adding parentheses to mark code as explicitly dead
else if (0 && parser->m_characterDataHandler)
^
/* DISABLES CODE */ ( )
../../Modules/expat/xmlparse.c:7703:11: warning: format specifies type 'int' but the argument has type 'ptrdiff_t' (aka 'long') [-Wformat]
bytesMore, (account == XML_ACCOUNT_DIRECT) ? "DIR" : "EXP",
^~~~~~~~~
3 warnings generated.
../../Modules/posixmodule.c:7596:13: warning: unused function 'warn_about_fork_with_threads' [-Wunused-function]
static void warn_about_fork_with_threads(const char* name) {
^
1 warning generated.
cat: pybuilddir.txt: No such file or directory
In file included from ../../Modules/sha2module.c:48:
In file included from ../../Modules/_hacl/Hacl_Hash_SHA2.h:35:
In file included from ../../Modules/_hacl/include/krml/types.h:12:
../../Modules/_hacl/include/krml/lowstar_endianness.h:130:11: warning: 'htole32' macro redefined [-Wmacro-redefined]
# define htole32(x) (x)
^
/opt/wasi-sdk/bin/../share/wasi-sysroot/include/endian.h:43:9: note: previous definition is here
#define htole32(x) (uint32_t)(x)
^
In file included from ../../Modules/sha2module.c:48:
In file included from ../../Modules/_hacl/Hacl_Hash_SHA2.h:35:
In file included from ../../Modules/_hacl/include/krml/types.h:12:
../../Modules/_hacl/include/krml/lowstar_endianness.h:131:11: warning: 'le32toh' macro redefined [-Wmacro-redefined]
# define le32toh(x) (x)
^
/opt/wasi-sdk/bin/../share/wasi-sysroot/include/endian.h:44:9: note: previous definition is here
#define le32toh(x) (uint32_t)(x)
^
In file included from ../../Modules/sha2module.c:48:
In file included from ../../Modules/_hacl/Hacl_Hash_SHA2.h:35:
In file included from ../../Modules/_hacl/include/krml/types.h:12:
../../Modules/_hacl/include/krml/lowstar_endianness.h:132:11: warning: 'htobe32' macro redefined [-Wmacro-redefined]
# define htobe32(x)
^
/opt/wasi-sdk/bin/../share/wasi-sysroot/include/endian.h:37:9: note: previous definition is here
#define htobe32(x) __bswap32(x)
^
In file included from ../../Modules/sha2module.c:48:
In file included from ../../Modules/_hacl/Hacl_Hash_SHA2.h:35:
In file included from ../../Modules/_hacl/include/krml/types.h:12:
../../Modules/_hacl/include/krml/lowstar_endianness.h:138:11: warning: 'be32toh' macro redefined [-Wmacro-redefined]
# define be32toh(x) (htobe32((x)))
^
/opt/wasi-sdk/bin/../share/wasi-sysroot/include/endian.h:38:9: note: previous definition is here
#define be32toh(x) __bswap32(x)
^
In file included from ../../Modules/sha2module.c:48:
In file included from ../../Modules/_hacl/Hacl_Hash_SHA2.h:35:
In file included from ../../Modules/_hacl/include/krml/types.h:12:
../../Modules/_hacl/include/krml/lowstar_endianness.h:140:11: warning: 'htole64' macro redefined [-Wmacro-redefined]
# define htole64(x) (x)
^
/opt/wasi-sdk/bin/../share/wasi-sysroot/include/endian.h:45:9: note: previous definition is here
#define htole64(x) (uint64_t)(x)
^
In file included from ../../Modules/sha2module.c:48:
In file included from ../../Modules/_hacl/Hacl_Hash_SHA2.h:35:
In file included from ../../Modules/_hacl/include/krml/types.h:12:
../../Modules/_hacl/include/krml/lowstar_endianness.h:141:11: warning: 'le64toh' macro redefined [-Wmacro-redefined]
# define le64toh(x) (x)
^
/opt/wasi-sdk/bin/../share/wasi-sysroot/include/endian.h:46:9: note: previous definition is here
#define le64toh(x) (uint64_t)(x)
^
In file included from ../../Modules/sha2module.c:48:
In file included from ../../Modules/_hacl/Hacl_Hash_SHA2.h:35:
In file included from ../../Modules/_hacl/include/krml/types.h:12:
../../Modules/_hacl/include/krml/lowstar_endianness.h:142:11: warning: 'htobe64' macro redefined [-Wmacro-redefined]
# define htobe64(x)
^
/opt/wasi-sdk/bin/../share/wasi-sysroot/include/endian.h:39:9: note: previous definition is here
#define htobe64(x) __bswap64(x)
^
In file included from ../../Modules/sha2module.c:48:
In file included from ../../Modules/_hacl/Hacl_Hash_SHA2.h:35:
In file included from ../../Modules/_hacl/include/krml/types.h:12:
../../Modules/_hacl/include/krml/lowstar_endianness.h:149:11: warning: 'be64toh' macro redefined [-Wmacro-redefined]
# define be64toh(x) (htobe64((x)))
^
/opt/wasi-sdk/bin/../share/wasi-sysroot/include/endian.h:40:9: note: previous definition is here
#define be64toh(x) __bswap64(x)
^
8 warnings generated.
Kill <WorkerThread #2 running test=test_capi pid=581307 time=25 min> process group make: *** [Makefile:2041: buildbottest] Error 2
Cannot open file '/opt/buildbot/bcannon-wasm/3.x.bcannon-wasm.wasi/build/build/build_oot/host/test-results.xml' for upload
Test report
Failed tests:
- test_capi
Sincerely, -The BuildbotThe Buildbot has detected a new failure on builder wasm32-emscripten node (dynamic linking) 3.x while building python/cpython. Full details are available at: https://buildbot.python.org/all/#/builders/1056/builds/3542
Buildbot URL: https://buildbot.python.org/all/
Worker for this Build: bcannon-wasm
Build Reason: <unknown> Blamelist: Sam Gross <colesbury@gmail.com>
BUILD FAILED: failed test (failure) uploading test-results.xml (failure)
Summary of the results of the build (if available):
==
Captured traceback
Note: switching to '31c90d5838e8d6e4c47d98500a34810ccb33a6d4'.
You are in 'detached HEAD' state. You can look around, make experimental changes and commit them, and you can discard any commits you make in this state without impacting any branches by switching back to a branch.
If you want to create a new branch to retain commits you create, you may do so (now or later) by using -c with the switch command. Example:
git switch -c <new-branch-name>
Or undo this operation with:
git switch -
Turn off this advice by setting config variable advice.detachedHead to false
HEAD is now at 31c90d5838 gh-111569: Implement Python critical section API (gh-111571) Switched to and reset branch 'main'
configure: ../../configure --prefix $(PWD)/target/host --with-pydebug --without-pydebug --with-emscripten-target=node --enable-wasm-dynamic-linking --disable-wasm-pthreads --build=x86_64-pc-linux-gnu --host=wasm32-unknown-emscripten --with-build-python=../build/python configure: WARNING: using cross tools not prefixed with host triplet mcc: error: no input files
make: make -j2 all
../../Python/ceval_gil.c:429:1: warning: unused function 'current_thread_holds_gil' [-Wunused-function]
current_thread_holds_gil(struct _gil_runtime_state *gil, PyThreadState *tstate)
^
1 warning generated.
../../Python/initconfig.c:2374:27: warning: format specifies type 'wint_t' (aka 'int') but the argument has type 'wint_t' (aka 'unsigned int') [-Wformat]
printf(usage_envvars, (wint_t)DELIM, (wint_t)DELIM, PYTHONHOMEHELP);
~~~~~~~~~~~~~ ^~~~~~~~~~~~~
../../Python/initconfig.c:258:18: note: format string is defined here
"PYTHONPATH : '%lc'-separated list of directories prefixed to the\n"
^~~
%c
../../Python/initconfig.c:2374:42: warning: format specifies type 'wint_t' (aka 'int') but the argument has type 'wint_t' (aka 'unsigned int') [-Wformat]
printf(usage_envvars, (wint_t)DELIM, (wint_t)DELIM, PYTHONHOMEHELP);
~~~~~~~~~~~~~ ^~~~~~~~~~~~~
../../Python/initconfig.c:260:58: note: format string is defined here
"PYTHONHOME : alternate <prefix> directory (or <prefix>%lc<exec_prefix>).\n"
^~~
%c
2 warnings generated.
../../Python/optimizer.c:414:9: warning: variable 'reserved' set but not used [-Wunused-but-set-variable]
int reserved = 0;
^
1 warning generated.
In file included from ../../Modules/md5module.c:51:
In file included from ../../Modules/_hacl/Hacl_Hash_MD5.h:34:
In file included from ../../Modules/_hacl/include/krml/types.h:12:
../../Modules/_hacl/include/krml/lowstar_endianness.h:83:11: warning: 'htobe16' macro redefined [-Wmacro-redefined]
# define htobe16(x) __builtin_bswap16(x)
^
/opt/buildbot/.emscripten_cache/sysroot/include/endian.h:35:9: note: previous definition is here
#define htobe16(x) __bswap16(x)
^
In file included from ../../Modules/md5module.c:51:
In file included from ../../Modules/_hacl/Hacl_Hash_MD5.h:34:
In file included from ../../Modules/_hacl/include/krml/types.h:12:
../../Modules/_hacl/include/krml/lowstar_endianness.h:84:11: warning: 'htole16' macro redefined [-Wmacro-redefined]
# define htole16(x) (x)
^
/opt/buildbot/.emscripten_cache/sysroot/include/endian.h:41:9: note: previous definition is here
#define htole16(x) (uint16_t)(x)
^
In file included from ../../Modules/md5module.c:51:
In file included from ../../Modules/_hacl/Hacl_Hash_MD5.h:34:
In file included from ../../Modules/_hacl/include/krml/types.h:12:
../../Modules/_hacl/include/krml/lowstar_endianness.h:85:11: warning: 'be16toh' macro redefined [-Wmacro-redefined]
# define be16toh(x) __builtin_bswap16(x)
^
/opt/buildbot/.emscripten_cache/sysroot/include/endian.h:36:9: note: previous definition is here
#define be16toh(x) __bswap16(x)
^
In file included from ../../Modules/md5module.c:51:
In file included from ../../Modules/_hacl/Hacl_Hash_MD5.h:34:
In file included from ../../Modules/_hacl/include/krml/types.h:12:
../../Modules/_hacl/include/krml/lowstar_endianness.h:86:11: warning: 'le16toh' macro redefined [-Wmacro-redefined]
# define le16toh(x) (x)
^
/opt/buildbot/.emscripten_cache/sysroot/include/endian.h:42:9: note: previous definition is here
#define le16toh(x) (uint16_t)(x)
^
In file included from ../../Modules/md5module.c:51:
In file included from ../../Modules/_hacl/Hacl_Hash_MD5.h:34:
In file included from ../../Modules/_hacl/include/krml/types.h:12:
../../Modules/_hacl/include/krml/lowstar_endianness.h:88:11: warning: 'htobe32' macro redefined [-Wmacro-redefined]
# define htobe32(x) __builtin_bswap32(x)
^
/opt/buildbot/.emscripten_cache/sysroot/include/endian.h:37:9: note: previous definition is here
#define htobe32(x) __bswap32(x)
^
In file included from ../../Modules/md5module.c:51:
In file included from ../../Modules/_hacl/Hacl_Hash_MD5.h:34:
In file included from ../../Modules/_hacl/include/krml/types.h:12:
../../Modules/_hacl/include/krml/lowstar_endianness.h:89:11: warning: 'htole32' macro redefined [-Wmacro-redefined]
# define htole32(x) (x)
^
/opt/buildbot/.emscripten_cache/sysroot/include/endian.h:43:9: note: previous definition is here
#define htole32(x) (uint32_t)(x)
^
In file included from ../../Modules/md5module.c:51:
In file included from ../../Modules/_hacl/Hacl_Hash_MD5.h:34:
In file included from ../../Modules/_hacl/include/krml/types.h:12:
../../Modules/_hacl/include/krml/lowstar_endianness.h:90:11: warning: 'be32toh' macro redefined [-Wmacro-redefined]
# define be32toh(x) __builtin_bswap32(x)
^
/opt/buildbot/.emscripten_cache/sysroot/include/endian.h:38:9: note: previous definition is here
#define be32toh(x) __bswap32(x)
^
In file included from ../../Modules/md5module.c:51:
In file included from ../../Modules/_hacl/Hacl_Hash_MD5.h:34:
In file included from ../../Modules/_hacl/include/krml/types.h:12:
../../Modules/_hacl/include/krml/lowstar_endianness.h:91:11: warning: 'le32toh' macro redefined [-Wmacro-redefined]
# define le32toh(x) (x)
^
/opt/buildbot/.emscripten_cache/sysroot/include/endian.h:44:9: note: previous definition is here
#define le32toh(x) (uint32_t)(x)
^
In file included from ../../Modules/md5module.c:51:
In file included from ../../Modules/_hacl/Hacl_Hash_MD5.h:34:
In file included from ../../Modules/_hacl/include/krml/types.h:12:
../../Modules/_hacl/include/krml/lowstar_endianness.h:93:11: warning: 'htobe64' macro redefined [-Wmacro-redefined]
# define htobe64(x) __builtin_bswap64(x)
^
/opt/buildbot/.emscripten_cache/sysroot/include/endian.h:39:9: note: previous definition is here
#define htobe64(x) __bswap64(x)
^
In file included from ../../Modules/md5module.c:51:
In file included from ../../Modules/_hacl/Hacl_Hash_MD5.h:34:
In file included from ../../Modules/_hacl/include/krml/types.h:12:
../../Modules/_hacl/include/krml/lowstar_endianness.h:94:11: warning: 'htole64' macro redefined [-Wmacro-redefined]
# define htole64(x) (x)
^
/opt/buildbot/.emscripten_cache/sysroot/include/endian.h:45:9: note: previous definition is here
#define htole64(x) (uint64_t)(x)
^
In file included from ../../Modules/md5module.c:51:
In file included from ../../Modules/_hacl/Hacl_Hash_MD5.h:34:
In file included from ../../Modules/_hacl/include/krml/types.h:12:
../../Modules/_hacl/include/krml/lowstar_endianness.h:95:11: warning: 'be64toh' macro redefined [-Wmacro-redefined]
# define be64toh(x) __builtin_bswap64(x)
^
/opt/buildbot/.emscripten_cache/sysroot/include/endian.h:40:9: note: previous definition is here
#define be64toh(x) __bswap64(x)
^
In file included from ../../Modules/md5module.c:51:
In file included from ../../Modules/_hacl/Hacl_Hash_MD5.h:34:
In file included from ../../Modules/_hacl/include/krml/types.h:12:
../../Modules/_hacl/include/krml/lowstar_endianness.h:96:11: warning: 'le64toh' macro redefined [-Wmacro-redefined]
# define le64toh(x) (x)
^
/opt/buildbot/.emscripten_cache/sysroot/include/endian.h:46:9: note: previous definition is here
#define le64toh(x) (uint64_t)(x)
^
12 warnings generated.
In file included from ../../Modules/sha1module.c:47:
In file included from ../../Modules/_hacl/Hacl_Hash_SHA1.h:34:
In file included from ../../Modules/_hacl/include/krml/types.h:12:
../../Modules/_hacl/include/krml/lowstar_endianness.h:83:11: warning: 'htobe16' macro redefined [-Wmacro-redefined]
# define htobe16(x) __builtin_bswap16(x)
^
/opt/buildbot/.emscripten_cache/sysroot/include/endian.h:35:9: note: previous definition is here
#define htobe16(x) __bswap16(x)
^
In file included from ../../Modules/sha1module.c:47:
In file included from ../../Modules/_hacl/Hacl_Hash_SHA1.h:34:
In file included from ../../Modules/_hacl/include/krml/types.h:12:
../../Modules/_hacl/include/krml/lowstar_endianness.h:84:11: warning: 'htole16' macro redefined [-Wmacro-redefined]
# define htole16(x) (x)
^
/opt/buildbot/.emscripten_cache/sysroot/include/endian.h:41:9: note: previous definition is here
#define htole16(x) (uint16_t)(x)
^
In file included from ../../Modules/sha1module.c:47:
In file included from ../../Modules/_hacl/Hacl_Hash_SHA1.h:34:
In file included from ../../Modules/_hacl/include/krml/types.h:12:
../../Modules/_hacl/include/krml/lowstar_endianness.h:85:11: warning: 'be16toh' macro redefined [-Wmacro-redefined]
# define be16toh(x) __builtin_bswap16(x)
^
/opt/buildbot/.emscripten_cache/sysroot/include/endian.h:36:9: note: previous definition is here
#define be16toh(x) __bswap16(x)
^
In file included from ../../Modules/sha1module.c:47:
In file included from ../../Modules/_hacl/Hacl_Hash_SHA1.h:34:
In file included from ../../Modules/_hacl/include/krml/types.h:12:
../../Modules/_hacl/include/krml/lowstar_endianness.h:86:11: warning: 'le16toh' macro redefined [-Wmacro-redefined]
# define le16toh(x) (x)
^
/opt/buildbot/.emscripten_cache/sysroot/include/endian.h:42:9: note: previous definition is here
#define le16toh(x) (uint16_t)(x)
^
In file included from ../../Modules/sha1module.c:47:
In file included from ../../Modules/_hacl/Hacl_Hash_SHA1.h:34:
In file included from ../../Modules/_hacl/include/krml/types.h:12:
../../Modules/_hacl/include/krml/lowstar_endianness.h:88:11: warning: 'htobe32' macro redefined [-Wmacro-redefined]
# define htobe32(x) __builtin_bswap32(x)
^
/opt/buildbot/.emscripten_cache/sysroot/include/endian.h:37:9: note: previous definition is here
#define htobe32(x) __bswap32(x)
^
In file included from ../../Modules/sha1module.c:47:
In file included from ../../Modules/_hacl/Hacl_Hash_SHA1.h:34:
In file included from ../../Modules/_hacl/include/krml/types.h:12:
../../Modules/_hacl/include/krml/lowstar_endianness.h:89:11: warning: 'htole32' macro redefined [-Wmacro-redefined]
# define htole32(x) (x)
^
/opt/buildbot/.emscripten_cache/sysroot/include/endian.h:43:9: note: previous definition is here
#define htole32(x) (uint32_t)(x)
^
In file included from ../../Modules/sha1module.c:47:
In file included from ../../Modules/_hacl/Hacl_Hash_SHA1.h:34:
In file included from ../../Modules/_hacl/include/krml/types.h:12:
../../Modules/_hacl/include/krml/lowstar_endianness.h:90:11: warning: 'be32toh' macro redefined [-Wmacro-redefined]
# define be32toh(x) __builtin_bswap32(x)
^
/opt/buildbot/.emscripten_cache/sysroot/include/endian.h:38:9: note: previous definition is here
#define be32toh(x) __bswap32(x)
^
In file included from ../../Modules/sha1module.c:47:
In file included from ../../Modules/_hacl/Hacl_Hash_SHA1.h:34:
In file included from ../../Modules/_hacl/include/krml/types.h:12:
../../Modules/_hacl/include/krml/lowstar_endianness.h:91:11: warning: 'le32toh' macro redefined [-Wmacro-redefined]
# define le32toh(x) (x)
^
/opt/buildbot/.emscripten_cache/sysroot/include/endian.h:44:9: note: previous definition is here
#define le32toh(x) (uint32_t)(x)
^
In file included from ../../Modules/sha1module.c:47:
In file included from ../../Modules/_hacl/Hacl_Hash_SHA1.h:34:
In file included from ../../Modules/_hacl/include/krml/types.h:12:
../../Modules/_hacl/include/krml/lowstar_endianness.h:93:11: warning: 'htobe64' macro redefined [-Wmacro-redefined]
# define htobe64(x) __builtin_bswap64(x)
^
/opt/buildbot/.emscripten_cache/sysroot/include/endian.h:39:9: note: previous definition is here
#define htobe64(x) __bswap64(x)
^
In file included from ../../Modules/sha1module.c:47:
In file included from ../../Modules/_hacl/Hacl_Hash_SHA1.h:34:
In file included from ../../Modules/_hacl/include/krml/types.h:12:
../../Modules/_hacl/include/krml/lowstar_endianness.h:94:11: warning: 'htole64' macro redefined [-Wmacro-redefined]
# define htole64(x) (x)
^
/opt/buildbot/.emscripten_cache/sysroot/include/endian.h:45:9: note: previous definition is here
#define htole64(x) (uint64_t)(x)
^
In file included from ../../Modules/sha1module.c:47:
In file included from ../../Modules/_hacl/Hacl_Hash_SHA1.h:34:
In file included from ../../Modules/_hacl/include/krml/types.h:12:
../../Modules/_hacl/include/krml/lowstar_endianness.h:95:11: warning: 'be64toh' macro redefined [-Wmacro-redefined]
# define be64toh(x) __builtin_bswap64(x)
^
/opt/buildbot/.emscripten_cache/sysroot/include/endian.h:40:9: note: previous definition is here
#define be64toh(x) __bswap64(x)
^
In file included from ../../Modules/sha1module.c:47:
In file included from ../../Modules/_hacl/Hacl_Hash_SHA1.h:34:
In file included from ../../Modules/_hacl/include/krml/types.h:12:
../../Modules/_hacl/include/krml/lowstar_endianness.h:96:11: warning: 'le64toh' macro redefined [-Wmacro-redefined]
# define le64toh(x) (x)
^
/opt/buildbot/.emscripten_cache/sysroot/include/endian.h:46:9: note: previous definition is here
#define le64toh(x) (uint64_t)(x)
^
12 warnings generated.
In file included from ../../Modules/sha3module.c:59:
In file included from ../../Modules/_hacl/Hacl_Hash_SHA3.h:34:
In file included from ../../Modules/_hacl/include/krml/types.h:12:
../../Modules/_hacl/include/krml/lowstar_endianness.h:83:11: warning: 'htobe16' macro redefined [-Wmacro-redefined]
# define htobe16(x) __builtin_bswap16(x)
^
/opt/buildbot/.emscripten_cache/sysroot/include/endian.h:35:9: note: previous definition is here
#define htobe16(x) __bswap16(x)
^
In file included from ../../Modules/sha3module.c:59:
In file included from ../../Modules/_hacl/Hacl_Hash_SHA3.h:34:
In file included from ../../Modules/_hacl/include/krml/types.h:12:
../../Modules/_hacl/include/krml/lowstar_endianness.h:84:11: warning: 'htole16' macro redefined [-Wmacro-redefined]
# define htole16(x) (x)
^
/opt/buildbot/.emscripten_cache/sysroot/include/endian.h:41:9: note: previous definition is here
#define htole16(x) (uint16_t)(x)
^
In file included from ../../Modules/sha3module.c:59:
In file included from ../../Modules/_hacl/Hacl_Hash_SHA3.h:34:
In file included from ../../Modules/_hacl/include/krml/types.h:12:
../../Modules/_hacl/include/krml/lowstar_endianness.h:85:11: warning: 'be16toh' macro redefined [-Wmacro-redefined]
# define be16toh(x) __builtin_bswap16(x)
^
/opt/buildbot/.emscripten_cache/sysroot/include/endian.h:36:9: note: previous definition is here
#define be16toh(x) __bswap16(x)
^
In file included from ../../Modules/sha3module.c:59:
In file included from ../../Modules/_hacl/Hacl_Hash_SHA3.h:34:
In file included from ../../Modules/_hacl/include/krml/types.h:12:
../../Modules/_hacl/include/krml/lowstar_endianness.h:86:11: warning: 'le16toh' macro redefined [-Wmacro-redefined]
# define le16toh(x) (x)
^
/opt/buildbot/.emscripten_cache/sysroot/include/endian.h:42:9: note: previous definition is here
#define le16toh(x) (uint16_t)(x)
^
In file included from ../../Modules/sha3module.c:59:
In file included from ../../Modules/_hacl/Hacl_Hash_SHA3.h:34:
In file included from ../../Modules/_hacl/include/krml/types.h:12:
../../Modules/_hacl/include/krml/lowstar_endianness.h:88:11: warning: 'htobe32' macro redefined [-Wmacro-redefined]
# define htobe32(x) __builtin_bswap32(x)
^
/opt/buildbot/.emscripten_cache/sysroot/include/endian.h:37:9: note: previous definition is here
#define htobe32(x) __bswap32(x)
^
In file included from ../../Modules/sha3module.c:59:
In file included from ../../Modules/_hacl/Hacl_Hash_SHA3.h:34:
In file included from ../../Modules/_hacl/include/krml/types.h:12:
../../Modules/_hacl/include/krml/lowstar_endianness.h:89:11: warning: 'htole32' macro redefined [-Wmacro-redefined]
# define htole32(x) (x)
^
/opt/buildbot/.emscripten_cache/sysroot/include/endian.h:43:9: note: previous definition is here
#define htole32(x) (uint32_t)(x)
^
In file included from ../../Modules/sha3module.c:59:
In file included from ../../Modules/_hacl/Hacl_Hash_SHA3.h:34:
In file included from ../../Modules/_hacl/include/krml/types.h:12:
../../Modules/_hacl/include/krml/lowstar_endianness.h:90:11: warning: 'be32toh' macro redefined [-Wmacro-redefined]
# define be32toh(x) __builtin_bswap32(x)
^
/opt/buildbot/.emscripten_cache/sysroot/include/endian.h:38:9: note: previous definition is here
#define be32toh(x) __bswap32(x)
^
In file included from ../../Modules/sha3module.c:59:
In file included from ../../Modules/_hacl/Hacl_Hash_SHA3.h:34:
In file included from ../../Modules/_hacl/include/krml/types.h:12:
../../Modules/_hacl/include/krml/lowstar_endianness.h:91:11: warning: 'le32toh' macro redefined [-Wmacro-redefined]
# define le32toh(x) (x)
^
/opt/buildbot/.emscripten_cache/sysroot/include/endian.h:44:9: note: previous definition is here
#define le32toh(x) (uint32_t)(x)
^
In file included from ../../Modules/sha3module.c:59:
In file included from ../../Modules/_hacl/Hacl_Hash_SHA3.h:34:
In file included from ../../Modules/_hacl/include/krml/types.h:12:
../../Modules/_hacl/include/krml/lowstar_endianness.h:93:11: warning: 'htobe64' macro redefined [-Wmacro-redefined]
# define htobe64(x) __builtin_bswap64(x)
^
/opt/buildbot/.emscripten_cache/sysroot/include/endian.h:39:9: note: previous definition is here
#define htobe64(x) __bswap64(x)
^
In file included from ../../Modules/sha3module.c:59:
In file included from ../../Modules/_hacl/Hacl_Hash_SHA3.h:34:
In file included from ../../Modules/_hacl/include/krml/types.h:12:
../../Modules/_hacl/include/krml/lowstar_endianness.h:94:11: warning: 'htole64' macro redefined [-Wmacro-redefined]
# define htole64(x) (x)
^
/opt/buildbot/.emscripten_cache/sysroot/include/endian.h:45:9: note: previous definition is here
#define htole64(x) (uint64_t)(x)
^
In file included from ../../Modules/sha3module.c:59:
In file included from ../../Modules/_hacl/Hacl_Hash_SHA3.h:34:
In file included from ../../Modules/_hacl/include/krml/types.h:12:
../../Modules/_hacl/include/krml/lowstar_endianness.h:95:11: warning: 'be64toh' macro redefined [-Wmacro-redefined]
# define be64toh(x) __builtin_bswap64(x)
^
/opt/buildbot/.emscripten_cache/sysroot/include/endian.h:40:9: note: previous definition is here
#define be64toh(x) __bswap64(x)
^
In file included from ../../Modules/sha3module.c:59:
In file included from ../../Modules/_hacl/Hacl_Hash_SHA3.h:34:
In file included from ../../Modules/_hacl/include/krml/types.h:12:
../../Modules/_hacl/include/krml/lowstar_endianness.h:96:11: warning: 'le64toh' macro redefined [-Wmacro-redefined]
# define le64toh(x) (x)
^
/opt/buildbot/.emscripten_cache/sysroot/include/endian.h:46:9: note: previous definition is here
#define le64toh(x) (uint64_t)(x)
^
12 warnings generated.
../../Modules/expat/xmlparse.c:3116:9: warning: code will never be executed [-Wunreachable-code]
parser->m_characterDataHandler(parser->m_handlerArg, parser->m_dataBuf,
^~~~~~
../../Modules/expat/xmlparse.c:3115:16: note: silence by adding parentheses to mark code as explicitly dead
else if (0 && parser->m_characterDataHandler)
^
/* DISABLES CODE */ ( )
../../Modules/expat/xmlparse.c:4059:9: warning: code will never be executed [-Wunreachable-code]
parser->m_characterDataHandler(parser->m_handlerArg, parser->m_dataBuf,
^~~~~~
../../Modules/expat/xmlparse.c:4058:16: note: silence by adding parentheses to mark code as explicitly dead
else if (0 && parser->m_characterDataHandler)
^
/* DISABLES CODE */ ( )
../../Modules/expat/xmlparse.c:7703:11: warning: format specifies type 'int' but the argument has type 'ptrdiff_t' (aka 'long') [-Wformat]
bytesMore, (account == XML_ACCOUNT_DIRECT) ? "DIR" : "EXP",
^~~~~~~~~
3 warnings generated.
../../Modules/socketmodule.c:4081:33: warning: comparison of integers of different signs: 'unsigned long' and 'long' [-Wsign-compare]
cmsgh != NULL; cmsgh = CMSG_NXTHDR(&msg, cmsgh)) {
^~~~~~~~~~~~~~~~~~~~~~~~
/opt/buildbot/.emscripten_cache/sysroot/include/sys/socket.h:356:44: note: expanded from macro 'CMSG_NXTHDR'
__CMSG_LEN(cmsg) + sizeof(struct cmsghdr) >= __MHDR_END(mhdr) - (unsigned char *)(cmsg)
~~~~~~~~~~~~~~~~~~~~~~~~~~~~~~~~~~~~~~~~~ ^ ~~~~~~~~~~~~~~~~~~~~~~~~~~~~~~~~~~~~~~~~~~
../../Modules/socketmodule.c:4134:33: warning: comparison of integers of different signs: 'unsigned long' and 'long' [-Wsign-compare]
cmsgh != NULL; cmsgh = CMSG_NXTHDR(&msg, cmsgh)) {
^~~~~~~~~~~~~~~~~~~~~~~~
/opt/buildbot/.emscripten_cache/sysroot/include/sys/socket.h:356:44: note: expanded from macro 'CMSG_NXTHDR'
__CMSG_LEN(cmsg) + sizeof(struct cmsghdr) >= __MHDR_END(mhdr) - (unsigned char *)(cmsg)
~~~~~~~~~~~~~~~~~~~~~~~~~~~~~~~~~~~~~~~~~ ^ ~~~~~~~~~~~~~~~~~~~~~~~~~~~~~~~~~~~~~~~~~~
../../Modules/socketmodule.c:4758:54: warning: comparison of integers of different signs: 'unsigned long' and 'long' [-Wsign-compare]
cmsgh = (i == 0) ? CMSG_FIRSTHDR(&msg) : CMSG_NXTHDR(&msg, cmsgh);
^~~~~~~~~~~~~~~~~~~~~~~~
/opt/buildbot/.emscripten_cache/sysroot/include/sys/socket.h:356:44: note: expanded from macro 'CMSG_NXTHDR'
__CMSG_LEN(cmsg) + sizeof(struct cmsghdr) >= __MHDR_END(mhdr) - (unsigned char *)(cmsg)
~~~~~~~~~~~~~~~~~~~~~~~~~~~~~~~~~~~~~~~~~ ^ ~~~~~~~~~~~~~~~~~~~~~~~~~~~~~~~~~~~~~~~~~~
3 warnings generated.
../../Modules/_sqlite/connection.c:2261:19: warning: result of comparison of constant 9223372036854775807 with expression of type 'Py_ssize_t' (aka 'long') is always false [-Wtautological-constant-out-of-range-compare]
if (data->len > 9223372036854775807) { // (1 << 63) - 1
~~~~~~~~~ ^ ~~~~~~~~~~~~~~~~~~~
1 warning generated.
In file included from ../../Modules/sha2module.c:48:
In file included from ../../Modules/_hacl/Hacl_Hash_SHA2.h:35:
In file included from ../../Modules/_hacl/include/krml/types.h:12:
../../Modules/_hacl/include/krml/lowstar_endianness.h:83:11: warning: 'htobe16' macro redefined [-Wmacro-redefined]
# define htobe16(x) __builtin_bswap16(x)
^
/opt/buildbot/.emscripten_cache/sysroot/include/endian.h:35:9: note: previous definition is here
#define htobe16(x) __bswap16(x)
^
In file included from ../../Modules/sha2module.c:48:
In file included from ../../Modules/_hacl/Hacl_Hash_SHA2.h:35:
In file included from ../../Modules/_hacl/include/krml/types.h:12:
../../Modules/_hacl/include/krml/lowstar_endianness.h:84:11: warning: 'htole16' macro redefined [-Wmacro-redefined]
# define htole16(x) (x)
^
/opt/buildbot/.emscripten_cache/sysroot/include/endian.h:41:9: note: previous definition is here
#define htole16(x) (uint16_t)(x)
^
In file included from ../../Modules/sha2module.c:48:
In file included from ../../Modules/_hacl/Hacl_Hash_SHA2.h:35:
In file included from ../../Modules/_hacl/include/krml/types.h:12:
../../Modules/_hacl/include/krml/lowstar_endianness.h:85:11: warning: 'be16toh' macro redefined [-Wmacro-redefined]
# define be16toh(x) __builtin_bswap16(x)
^
/opt/buildbot/.emscripten_cache/sysroot/include/endian.h:36:9: note: previous definition is here
#define be16toh(x) __bswap16(x)
^
In file included from ../../Modules/sha2module.c:48:
In file included from ../../Modules/_hacl/Hacl_Hash_SHA2.h:35:
In file included from ../../Modules/_hacl/include/krml/types.h:12:
../../Modules/_hacl/include/krml/lowstar_endianness.h:86:11: warning: 'le16toh' macro redefined [-Wmacro-redefined]
# define le16toh(x) (x)
^
/opt/buildbot/.emscripten_cache/sysroot/include/endian.h:42:9: note: previous definition is here
#define le16toh(x) (uint16_t)(x)
^
In file included from ../../Modules/sha2module.c:48:
In file included from ../../Modules/_hacl/Hacl_Hash_SHA2.h:35:
In file included from ../../Modules/_hacl/include/krml/types.h:12:
../../Modules/_hacl/include/krml/lowstar_endianness.h:88:11: warning: 'htobe32' macro redefined [-Wmacro-redefined]
# define htobe32(x) __builtin_bswap32(x)
^
/opt/buildbot/.emscripten_cache/sysroot/include/endian.h:37:9: note: previous definition is here
#define htobe32(x) __bswap32(x)
^
In file included from ../../Modules/sha2module.c:48:
In file included from ../../Modules/_hacl/Hacl_Hash_SHA2.h:35:
In file included from ../../Modules/_hacl/include/krml/types.h:12:
../../Modules/_hacl/include/krml/lowstar_endianness.h:89:11: warning: 'htole32' macro redefined [-Wmacro-redefined]
# define htole32(x) (x)
^
/opt/buildbot/.emscripten_cache/sysroot/include/endian.h:43:9: note: previous definition is here
#define htole32(x) (uint32_t)(x)
^
In file included from ../../Modules/sha2module.c:48:
In file included from ../../Modules/_hacl/Hacl_Hash_SHA2.h:35:
In file included from ../../Modules/_hacl/include/krml/types.h:12:
../../Modules/_hacl/include/krml/lowstar_endianness.h:90:11: warning: 'be32toh' macro redefined [-Wmacro-redefined]
# define be32toh(x) __builtin_bswap32(x)
^
/opt/buildbot/.emscripten_cache/sysroot/include/endian.h:38:9: note: previous definition is here
#define be32toh(x) __bswap32(x)
^
In file included from ../../Modules/sha2module.c:48:
In file included from ../../Modules/_hacl/Hacl_Hash_SHA2.h:35:
In file included from ../../Modules/_hacl/include/krml/types.h:12:
../../Modules/_hacl/include/krml/lowstar_endianness.h:91:11: warning: 'le32toh' macro redefined [-Wmacro-redefined]
# define le32toh(x) (x)
^
/opt/buildbot/.emscripten_cache/sysroot/include/endian.h:44:9: note: previous definition is here
#define le32toh(x) (uint32_t)(x)
^
In file included from ../../Modules/sha2module.c:48:
In file included from ../../Modules/_hacl/Hacl_Hash_SHA2.h:35:
In file included from ../../Modules/_hacl/include/krml/types.h:12:
../../Modules/_hacl/include/krml/lowstar_endianness.h:93:11: warning: 'htobe64' macro redefined [-Wmacro-redefined]
# define htobe64(x) __builtin_bswap64(x)
^
/opt/buildbot/.emscripten_cache/sysroot/include/endian.h:39:9: note: previous definition is here
#define htobe64(x) __bswap64(x)
^
In file included from ../../Modules/sha2module.c:48:
In file included from ../../Modules/_hacl/Hacl_Hash_SHA2.h:35:
In file included from ../../Modules/_hacl/include/krml/types.h:12:
../../Modules/_hacl/include/krml/lowstar_endianness.h:94:11: warning: 'htole64' macro redefined [-Wmacro-redefined]
# define htole64(x) (x)
^
/opt/buildbot/.emscripten_cache/sysroot/include/endian.h:45:9: note: previous definition is here
#define htole64(x) (uint64_t)(x)
^
In file included from ../../Modules/sha2module.c:48:
In file included from ../../Modules/_hacl/Hacl_Hash_SHA2.h:35:
In file included from ../../Modules/_hacl/include/krml/types.h:12:
../../Modules/_hacl/include/krml/lowstar_endianness.h:95:11: warning: 'be64toh' macro redefined [-Wmacro-redefined]
# define be64toh(x) __builtin_bswap64(x)
^
/opt/buildbot/.emscripten_cache/sysroot/include/endian.h:40:9: note: previous definition is here
#define be64toh(x) __bswap64(x)
^
In file included from ../../Modules/sha2module.c:48:
In file included from ../../Modules/_hacl/Hacl_Hash_SHA2.h:35:
In file included from ../../Modules/_hacl/include/krml/types.h:12:
../../Modules/_hacl/include/krml/lowstar_endianness.h:96:11: warning: 'le64toh' macro redefined [-Wmacro-redefined]
# define le64toh(x) (x)
^
/opt/buildbot/.emscripten_cache/sysroot/include/endian.h:46:9: note: previous definition is here
#define le64toh(x) (uint64_t)(x)
^
12 warnings generated.
Kill <WorkerThread #2 running test=test_capi pid=552477 time=25 min> process group make: *** [Makefile:2048: buildbottest] Error 2
Cannot open file '/opt/buildbot/bcannon-wasm/3.x.bcannon-wasm.emscripten-node-dl/build/build/build_oot/host/test-results.xml' for upload
Test report
Failed tests:
- test_capi
Sincerely, -The Buildbot
participants (1)
-
buildbot@python.org