Buildbot failure in Python on aarch64 Fedora Rawhide Clang 3.x
The Buildbot has detected a failed build on builder aarch64 Fedora Rawhide Clang 3.x while building python/cpython. Full details are available at: https://buildbot.python.org/all/#builders/594/builds/718
Buildbot URL: https://buildbot.python.org/all/
Worker for this Build: cstratak-fedora-rawhide-aarch64
Build Reason: <unknown> Blamelist: Raymond Hettinger <rhettinger@users.noreply.github.com>
BUILD FAILED: failed test (failure)
Summary of the results of the build (if available):
== Tests result: FAILURE then FAILURE ==
409 tests OK.
10 slowest tests:
- test_peg_generator: 6 min 50 sec
- test_concurrent_futures: 3 min 41 sec
- test_multiprocessing_spawn: 2 min 23 sec
- test_asyncio: 2 min 8 sec
- test_multiprocessing_forkserver: 1 min 41 sec
- test_tokenize: 1 min 32 sec
- test_unparse: 1 min 26 sec
- test_subprocess: 1 min 19 sec
- test_multiprocessing_fork: 1 min 13 sec
- test_lib2to3: 1 min 6 sec
1 test failed: test_gdb
13 tests skipped: test_devpoll test_ioctl test_kqueue test_msilib test_ossaudiodev test_startfile test_tix test_tk test_ttk_guionly test_winconsoleio test_winreg test_winsound test_zipfile64
1 re-run test: test_gdb
Total duration: 7 min 50 sec
Captured traceback
Traceback (most recent call last): File "/home/buildbot/buildarea/3.x.cstratak-fedora-rawhide-aarch64.clang/build/Lib/test/test_gdb.py", line 458, in test_modern_class gdb_repr, gdb_output = self.get_gdb_repr(''' File "/home/buildbot/buildarea/3.x.cstratak-fedora-rawhide-aarch64.clang/build/Lib/test/test_gdb.py", line 284, in get_gdb_repr self.fail('Unexpected gdb output: %r\n%s' % (gdb_output, gdb_output)) AssertionError: Unexpected gdb output: 'Breakpoint 1 at 0x5a9ef8: file Python/bltinmodule.c, line 1174.\n[Thread debugging using libthread_db enabled]\nUsing host libthread_db library "/lib64/libthread_db.so.1".\n' Breakpoint 1 at 0x5a9ef8: file Python/bltinmodule.c, line 1174. [Thread debugging using libthread_db enabled] Using host libthread_db library "/lib64/libthread_db.so.1".
Traceback (most recent call last): File "/home/buildbot/buildarea/3.x.cstratak-fedora-rawhide-aarch64.clang/build/Lib/test/test_gdb.py", line 303, in test_getting_backtrace self.assertTrue(BREAKPOINT_FN in gdb_output) AssertionError: False is not true
Test report
Failed tests:
- test_gdb
Failed subtests:
- test_modern_class - test.test_gdb.PrettyPrintTests
- test_getting_backtrace - test.test_gdb.PrettyPrintTests
Sincerely, -The Buildbot
participants (1)
-
buildbot@python.org