Buildbot failure in Python on whole buildset
The Buildbot has detected a new failure on builder AMD64 Windows8.1 Refleaks 3.x while building Python. Full details are available at: https://buildbot.python.org/all/#builders/511/builds/167
Buildbot URL: https://buildbot.python.org/all/
Worker for this Build: ware-win81-release
Build Reason: <unknown> Blamelist:
BUILD FAILED: failed test (failure)
Summary of the results of the build (if available):
== Tests result: FAILURE then FAILURE ==
397 tests OK.
10 slowest tests:
- test_pydoc: 30 min 15 sec
- test_multiprocessing_spawn: 29 min 9 sec
- test_asyncio: 26 min 16 sec
- test_venv: 24 min 42 sec
- test_peg_generator: 21 min 45 sec
- test_concurrent_futures: 16 min 31 sec
- test_mmap: 15 min 31 sec
- test_largefile: 14 min 38 sec
- test_tarfile: 12 min 29 sec
- test_io: 12 min 7 sec
1 test failed: test_ttk_guionly
31 tests skipped: test_curses test_dbm_gnu test_dbm_ndbm test_devpoll test_epoll test_fcntl test_fork1 test_gdb test_grp test_ioctl test_kqueue test_multiprocessing_fork test_multiprocessing_forkserver test_nis test_openpty test_ossaudiodev test_pipes test_poll test_posix test_pty test_pwd test_readline test_resource test_spwd test_syslog test_threadsignals test_wait3 test_wait4 test_xxlimited test_xxtestfuzz test_zipfile64
4 re-run tests: test__xxsubinterpreters test_regrtest test_threading test_ttk_guionly
1 test run no tests: test__xxsubinterpreters
Total duration: 2 hour 5 min
Captured traceback
Traceback (most recent call last): File "D:\buildarea\3.x.ware-win81-release.refleak\build\lib\test\lock_tests.py", line 49, in task Warning -- Unraisable exception Exception ignored in thread started by: <function Bunch.__init__.<locals>.task at 0x000000FB9A37D4F0> Traceback (most recent call last): File "D:\buildarea\3.x.ware-win81-release.refleak\build\lib\test\lock_tests.py", line 49, in task f() ^^^ File "D:\buildarea\3.x.ware-win81-release.refleak\build\lib\test\lock_tests.py", line 1021, in f i = barrier.wait() ^^^^^^^^^^^^^^ File "D:\buildarea\3.x.ware-win81-release.refleak\build\lib\threading.py", line 683, in wait self._wait(timeout) ^^^^^^^^^^^^^^^^^^^ File "D:\buildarea\3.x.ware-win81-release.refleak\build\lib\threading.py", line 723, in _wait raise BrokenBarrierError ^^^^^^^^^^^^^^^^^^^^^^^^ threading.BrokenBarrierError: f() ^^^ File "D:\buildarea\3.x.ware-win81-release.refleak\build\lib\test\lock_tests.py", line 1021, in f i = barrier.wait() ^^^^^^^^^^^^^^ File "D:\buildarea\3.x.ware-win81-release.refleak\build\lib\threading.py", line 674, in wait self._enter() # Block while the barrier drains. ^^^^^^^^^^^^^ File "D:\buildarea\3.x.ware-win81-release.refleak\build\lib\threading.py", line 698, in _enter raise BrokenBarrierError ^^^^^^^^^^^^^^^^^^^^^^^^ threading.BrokenBarrierError: f() ^^^ File "D:\buildarea\3.x.ware-win81-release.refleak\build\lib\test\lock_tests.py", line 1021, in f i = barrier.wait() ^^^^^^^^^^^^^^ File "D:\buildarea\3.x.ware-win81-release.refleak\build\lib\threading.py", line 683, in wait self._wait(timeout) f() ^^^^^ ^ File "D:\buildarea\3.x.ware-win81-release.refleak\build\lib\test\lock_tests.py", line 1021, in f ^^^^^^^^^ ^^^i = barrier.wait() ^ ^ ^^ File "D:\buildarea\3.x.ware-win81-release.refleak\build\lib\threading.py", line 723, in _wait ^^^^^ ^^raise BrokenBarrierError^ ^ ^^^ ^^ ^^^ File "D:\buildarea\3.x.ware-win81-release.refleak\build\lib\threading.py", line 683, in wait ^^^^^^^ ^^self._wait(timeout)^ ^^^ ^^^^^^^^^^^^^^ ^^^threading.BrokenBarrierError^^^: ^^^^^^^ File "D:\buildarea\3.x.ware-win81-release.refleak\build\lib\threading.py", line 723, in _wait raise BrokenBarrierError ^^^^^^^^^^^^^^^^^^^^^^^^ threading.BrokenBarrierError:
Traceback (most recent call last): File "D:\buildarea\3.x.ware-win81-release.refleak\build\lib\test\test_regrtest.py", line 1236, in test_multiprocessing_timeout self.assertRegex(output, ^^^^^^^^^^^^^^^^^^^^^^^^ AssertionError: Regex didn't match: 'test_regrtest_noop214 timed out' not found in '0:00:00 Run tests in parallel using 2 child processes (timeout: 1.0 sec, worker timeout: 1.5 sec)\n0:00:01 [1/1/1] test_regrtest_noop214 crashed (Exit code 1)\nTimeout (0:00:01)!\nThread 0x0000157c (most recent call first):\n File "<frozen importlib._bootstrap_external>", line 196 in _write_atomic\n File "<frozen importlib._bootstrap_external>", line 1136 in set_data\n File "<frozen importlib._bootstrap_external>", line 1111 in _cache_bytecode\n File "<frozen importlib._bootstrap_external>", line 1043 in get_code\n File "<frozen importlib._bootstrap_external>", line 893 in exec_module\n File "<frozen importlib._bootstrap>", line 690 in _load_unlocked\n File "<frozen importlib._bootstrap>", line 1149 in _find_and_load_unlocked\n File "<frozen importlib._bootstrap>", line 1178 in _find_and_load\n File "<frozen importlib._bootstrap>", line 1206 in _gcd_import\n File "D:\\buildarea\\3.x.ware-win 81-release.refleak\\build\\lib\\importlib\\__init__.py", line 126 in import_module\n File "D:\\buildarea\\3.x.ware-win81-release.refleak\\build\\lib\\test\\libregrtest\\runtest.py", line 292 in _runtest_inner2\n File "D:\\buildarea\\3.x.ware-win81-release.refleak\\build\\lib\\test\\libregrtest\\runtest.py", line 352 in _runtest_inner\n File "D:\\buildarea\\3.x.ware-win81-release.refleak\\build\\lib\\test\\libregrtest\\runtest.py", line 227 in _runtest\n File "D:\\buildarea\\3.x.ware-win81-release.refleak\\build\\lib\\test\\libregrtest\\runtest.py", line 257 in runtest\n File "D:\\buildarea\\3.x.ware-win81-release.refleak\\build\\lib\\test\\libregrtest\\runtest_mp.py", line 84 in run_tests_worker\n File "D:\\buildarea\\3.x.ware-win81-release.refleak\\build\\lib\\test\\libregrtest\\main.py", line 678 in _main\n File "D:\\buildarea\\3.x.ware-win81-release.refleak\\build\\lib\\test\\libregrtest\\main.py", line 658 in main\n File "D:\\buildarea\\3.x.ware-win81-release.refleak\\bu ild\\lib\\test\\libregrtest\\main.py", line 736 in main\n File "D:\\buildarea\\3.x.ware-win81-release.refleak\\build\\lib\\test\\regrtest.py", line 43 in _main\n File "D:\\buildarea\\3.x.ware-win81-release.refleak\\build\\lib\\test\\regrtest.py", line 47 in <module>\n File "D:\\buildarea\\3.x.ware-win81-release.refleak\\build\\lib\\runpy.py", line 86 in _run_code\n File "D:\\buildarea\\3.x.ware-win81-release.refleak\\build\\lib\\runpy.py", line 196 in _run_module_as_main\n\n== Tests result: FAILURE ==\n\n1 test failed:\n test_regrtest_noop214\n\nTotal duration: 1.6 sec\nTests result: FAILURE\n'
Traceback (most recent call last): File "D:\buildarea\3.x.ware-win81-release.refleak\build\lib\test\lock_tests.py", line 49, in task Exception ignored in thread started by : Traceback (most recent call last): <function Bunch.__init__.<locals>.task at 0x000000FB9A37D4F0> File "D:\buildarea\3.x.ware-win81-release.refleak\build\lib\test\lock_tests.py", line 49, in task
Traceback (most recent call last): File "D:\buildarea\3.x.ware-win81-release.refleak\build\lib\test\lock_tests.py", line 1026, in test_default_timeout self.run_threads(f) ^^^^^^^^^^^^^^^^^^^ File "D:\buildarea\3.x.ware-win81-release.refleak\build\lib\test\lock_tests.py", line 855, in run_threads f() ^^^ File "D:\buildarea\3.x.ware-win81-release.refleak\build\lib\test\lock_tests.py", line 1021, in f i = barrier.wait() ^^^^^^^^^^^^^^ File "D:\buildarea\3.x.ware-win81-release.refleak\build\lib\threading.py", line 683, in wait self._wait(timeout) ^^^^^^^^^^^^^^^^^^^ File "D:\buildarea\3.x.ware-win81-release.refleak\build\lib\threading.py", line 721, in _wait raise BrokenBarrierError ^^^^^^^^^^^^^^^^^^^^^^^^ threading.BrokenBarrierError
Test report
Failed tests:
- test_ttk_guionly
Test leaking resources:
- test_ttk_guionly: references
- test_ttk_guionly: memory blocks
Sincerely, -The Buildbot
participants (1)
-
buildbot@python.org