Buildbot failure in Python on aarch64 Fedora Stable 3.x
The Buildbot has detected a failed build on builder aarch64 Fedora Stable 3.x while building python/cpython. Full details are available at: https://buildbot.python.org/all/#builders/567/builds/2
Buildbot URL: https://buildbot.python.org/all/
Worker for this Build: cstratak-fedora-stable-aarch64
Build Reason: <unknown> Blamelist: Serhiy Storchaka <storchaka@gmail.com>, ananthan-123 <ananthakrishnan15.2001@gmail.com>
BUILD FAILED: failed compile (failure)
Summary of the results of the build (if available):
Captured traceback
remote: Enumerating objects: 25, done.
remote: Counting objects: 4% (1/25)
remote: Counting objects: 8% (2/25)
remote: Counting objects: 12% (3/25)
remote: Counting objects: 16% (4/25)
remote: Counting objects: 20% (5/25)
remote: Counting objects: 24% (6/25)
remote: Counting objects: 28% (7/25)
remote: Counting objects: 32% (8/25)
remote: Counting objects: 36% (9/25)
remote: Counting objects: 40% (10/25)
remote: Counting objects: 44% (11/25)
remote: Counting objects: 48% (12/25)
remote: Counting objects: 52% (13/25)
remote: Counting objects: 56% (14/25)
remote: Counting objects: 60% (15/25)
remote: Counting objects: 64% (16/25)
remote: Counting objects: 68% (17/25)
remote: Counting objects: 72% (18/25)
remote: Counting objects: 76% (19/25)
remote: Counting objects: 80% (20/25)
remote: Counting objects: 84% (21/25)
remote: Counting objects: 88% (22/25)
remote: Counting objects: 92% (23/25)
remote: Counting objects: 96% (24/25)
remote: Counting objects: 100% (25/25)
remote: Counting objects: 100% (25/25), done.
remote: Compressing objects: 7% (1/13)
remote: Compressing objects: 15% (2/13)
remote: Compressing objects: 23% (3/13)
remote: Compressing objects: 30% (4/13)
remote: Compressing objects: 38% (5/13)
remote: Compressing objects: 46% (6/13)
remote: Compressing objects: 53% (7/13)
remote: Compressing objects: 61% (8/13)
remote: Compressing objects: 69% (9/13)
remote: Compressing objects: 76% (10/13)
remote: Compressing objects: 84% (11/13)
remote: Compressing objects: 92% (12/13)
remote: Compressing objects: 100% (13/13)
remote: Compressing objects: 100% (13/13), done.
remote: Total 29 (delta 12), reused 14 (delta 12), pack-reused 4
From https://github.com/python/cpython
- branch master -> FETCH_HEAD Reset branch 'master'
Assembler messages: Fatal error: can't create Objects/interpreteridobject.o: No space left on device make: *** [Makefile:1718: Objects/interpreteridobject.o] Error 1 make: *** Waiting for unfinished jobs.... Assembler messages: Fatal error: can't create Objects/iterobject.o: No space left on device make: *** [Makefile:1718: Objects/iterobject.o] Error 1 Assembler messages: Fatal error: can't create Objects/funcobject.o: No space left on device make: *** [Makefile:1718: Objects/funcobject.o] Error 1 Assembler messages: Fatal error: can't create Objects/floatobject.o: No space left on device make: *** [Makefile:1718: Objects/floatobject.o] Error 1 Assembler messages: Fatal error: can't create Objects/exceptions.o: No space left on device make: *** [Makefile:1718: Objects/exceptions.o] Error 1 Assembler messages: Fatal error: can't create Objects/bytearrayobject.o: No space left on device make: *** [Makefile:1718: Objects/bytearrayobject.o] Error 1 Assembler messages: Fatal error: can't create Objects/bytesobject.o: No space left on device make: *** [Makefile:1718: Objects/bytesobject.o] Error 1 Assembler messages: Fatal error: can't create Objects/listobject.o: No space left on device make: *** [Makefile:1718: Objects/listobject.o] Error 1 Assembler messages: Fatal error: can't create Objects/dictobject.o: No space left on device make: *** [Makefile:1718: Objects/dictobject.o] Error 1 Assembler messages: Fatal error: can't create Objects/longobject.o: No space left on device make: *** [Makefile:1718: Objects/longobject.o] Error 1
find: ‘build’: No such file or directory find: ‘build’: No such file or directory find: ‘build’: No such file or directory find: ‘build’: No such file or directory make: [Makefile:1790: clean-retain-profile] Error 1 (ignored)
Test report
Sincerely, -The Buildbot
participants (1)
-
buildbot@python.org