Buildbot failure in Python on AMD64 FreeBSD Non-Debug 3.9
The Buildbot has detected a new failure on builder AMD64 FreeBSD Non-Debug 3.9 while building python/cpython. Full details are available at: https://buildbot.python.org/all/#builders/750/builds/11
Buildbot URL: https://buildbot.python.org/all/
Worker for this Build: koobs-freebsd-9e36
Build Reason: <unknown> Blamelist: Lysandros Nikolaou <lisandrosnik@gmail.com>, Miss Islington (bot) <31488909+miss-islington@users.noreply.github.com>, Pablo Galindo <Pablogsal@gmail.com>
BUILD FAILED: failed test (failure)
Summary of the results of the build (if available):
== Tests result: FAILURE then FAILURE ==
404 tests OK.
10 slowest tests:
- test_peg_generator: 9 min 16 sec
- test_multiprocessing_spawn: 5 min 2 sec
- test_concurrent_futures: 4 min 43 sec
- test_tokenize: 4 min 23 sec
- test_unparse: 3 min 36 sec
- test_multiprocessing_forkserver: 3 min 1 sec
- test_largefile: 2 min 31 sec
- test_unicodedata: 2 min 16 sec
- test_lib2to3: 2 min 8 sec
- test_multiprocessing_fork: 2 min 4 sec
1 test failed: test_asyncio
19 tests skipped: test_dbm_gnu test_devpoll test_epoll test_idle test_ioctl test_msilib test_ossaudiodev test_spwd test_startfile test_tcl test_tix test_tk test_ttk_guionly test_ttk_textonly test_turtle test_winconsoleio test_winreg test_winsound test_zipfile64
1 re-run test: test_asyncio
Total duration: 23 min 3 sec
Captured traceback
Traceback (most recent call last): File "/usr/home/buildbot/python/3.9.koobs-freebsd-9e36.nondebug/build/Lib/test/test_asyncio/test_sock_lowlevel.py", line 253, in test_sock_client_racing self.loop.run_until_complete(asyncio.wait_for( File "/usr/home/buildbot/python/3.9.koobs-freebsd-9e36.nondebug/build/Lib/asyncio/base_events.py", line 642, in run_until_complete return future.result() File "/usr/home/buildbot/python/3.9.koobs-freebsd-9e36.nondebug/build/Lib/asyncio/tasks.py", line 496, in wait_for return fut.result() File "/usr/home/buildbot/python/3.9.koobs-freebsd-9e36.nondebug/build/Lib/test/test_asyncio/test_sock_lowlevel.py", line 219, in _basetest_sock_connect_racing await self.loop.sock_connect(sock, addr) File "/usr/home/buildbot/python/3.9.koobs-freebsd-9e36.nondebug/build/Lib/asyncio/selector_events.py", line 500, in sock_connect return await fut File "/usr/home/buildbot/python/3.9.koobs-freebsd-9e36.nondebug/build/Lib/asyncio/selector_events.py", line 505, in _sock_connect sock.connect(address) ConnectionRefusedError: [Errno 61] Connection refused
Traceback (most recent call last): File "/usr/home/buildbot/python/3.9.koobs-freebsd-9e36.nondebug/build/Lib/test/test_asyncio/test_sock_lowlevel.py", line 216, in _basetest_sock_connect_racing await self.loop.sock_connect(sock, addr) File "/usr/home/buildbot/python/3.9.koobs-freebsd-9e36.nondebug/build/Lib/asyncio/selector_events.py", line 500, in sock_connect return await fut File "/usr/home/buildbot/python/3.9.koobs-freebsd-9e36.nondebug/build/Lib/asyncio/selector_events.py", line 505, in _sock_connect sock.connect(address) ConnectionRefusedError: [Errno 61] Connection refused
Test report
Failed tests:
- test_asyncio
Failed subtests:
- test_sock_client_racing - test.test_asyncio.test_sock_lowlevel.PollEventLoopTests
- test_sock_client_racing - test.test_asyncio.test_sock_lowlevel.KqueueEventLoopTests
- test_sock_client_racing - test.test_asyncio.test_sock_lowlevel.SelectEventLoopTests
Sincerely, -The Buildbot
participants (1)
-
buildbot@python.org