☠ Buildbot (Python): python/cpython - failed test (failure) uploading test-results.xml (failure) (main)
The Buildbot has detected a new failure on builder PPC64LE RHEL8 3.x while building python/cpython. Full details are available at: https://buildbot.python.org/all/#/builders/559/builds/3745
Buildbot URL: https://buildbot.python.org/all/
Worker for this Build: cstratak-RHEL8-ppc64le
Build Reason: <unknown> Blamelist: Alex Waygood <Alex.Waygood@Gmail.com>, Anders Kaseorg <andersk@mit.edu>, Brandt Bucher <brandtbucher@microsoft.com>, Carl Meyer <carl@oddbird.net>, Charlie Zhao <zhaoyu_hit@qq.com>, Christopher Chavez <chrischavez@gmx.us>, Daniele Procida <daniele@vurt.org>, Dong-hee Na <donghee.na@python.org>, Eric Snow <ericsnowcurrently@gmail.com>, Erlend E. Aasland <erlend@python.org>, Ezio Melotti <ezio.melotti@gmail.com>, Felipe A. Hernandez <ergoithz@gmail.com>, Furkan Onder <furkanonder@protonmail.com>, Georg Brandl <georg@python.org>, Gregory P. Smith <greg@krypto.org>, Guido van Rossum <guido@python.org>, Hakan Celik <hakancelikdev@gmail.com>, Hugo van Kemenade <hugovk@users.noreply.github.com>, Illia Volochii <illia.volochii@gmail.com>, Inada Naoki <songofacandy@gmail.com>, Irit Katriel <1055913+iritkatriel@users.noreply.github.com>, Jacob Walls <jacobtylerwalls@gmail.com>, James Cave <jcave137@gmail.com>, János Kukovecz <kukoveczjanos@gmail.com>, Jérôme Carretero <cJ-tub@zou gloub.eu>, Konstantin <kpp.live+github@gmail.com>, Kumar Aditya <kumaraditya@python.org>, Mark Shannon <mark@hotpy.org>, Michael The <michael-the1@users.noreply.github.com>, Ned Deily <nad@python.org>, Nikita Sobolev <mail@sobolevn.me>, Pablo Galindo Salgado <Pablogsal@gmail.com>, Paul Moore <p.f.moore@gmail.com>, Pieter Eendebak <pieter.eendebak@gmail.com>, Rakesh Sabale <102187286+ghubrakesh@users.noreply.github.com>, Roman Yurchak <rth.yurchak@gmail.com>, Serhiy Storchaka <storchaka@gmail.com>, Tian Gao <gaogaotiantian@hotmail.com>, Tom Niget <zippedfire@free.fr>, Tomas R <tomas.roun8@gmail.com>, TommyUnreal <45427816+TommyUnreal@users.noreply.github.com>, Victor Stinner <vstinner@python.org>, cLupus <cLupus@users.noreply.github.com>, da-woods <dw-git@d-woods.co.uk>, justdan6 <134341009+justdan6@users.noreply.github.com>, opavliuk <40970635+opavlyuk@users.noreply.github.com>, shailshouryya <42100758+shailshouryya@users.noreply.github.com>
BUILD FAILED: failed test (failure) uploading test-results.xml (failure)
Summary of the results of the build (if available):
==
Captured traceback
remote: Enumerating objects: 46, done.
remote: Counting objects: 2% (1/46)
remote: Counting objects: 4% (2/46)
remote: Counting objects: 6% (3/46)
remote: Counting objects: 8% (4/46)
remote: Counting objects: 10% (5/46)
remote: Counting objects: 13% (6/46)
remote: Counting objects: 15% (7/46)
remote: Counting objects: 17% (8/46)
remote: Counting objects: 19% (9/46)
remote: Counting objects: 21% (10/46)
remote: Counting objects: 23% (11/46)
remote: Counting objects: 26% (12/46)
remote: Counting objects: 28% (13/46)
remote: Counting objects: 30% (14/46)
remote: Counting objects: 32% (15/46)
remote: Counting objects: 34% (16/46)
remote: Counting objects: 36% (17/46)
remote: Counting objects: 39% (18/46)
remote: Counting objects: 41% (19/46)
remote: Counting objects: 43% (20/46)
remote: Counting objects: 45% (21/46)
remote: Counting objects: 47% (22/46)
remote: Counting objects: 50% (23/46)
remote: Counting objects: 52% (24/46)
remote: Counting objects: 54% (25/46)
remote: Counting objects: 56% (26/46)
remote: Counting objects: 58% (27/46)
remote: Counting objects: 60% (28/46)
remote: Counting objects: 63% (29/46)
remote: Counting objects: 65% (30/46)
remote: Counting objects: 67% (31/46)
remote: Counting objects: 69% (32/46)
remote: Counting objects: 71% (33/46)
remote: Counting objects: 73% (34/46)
remote: Counting objects: 76% (35/46)
remote: Counting objects: 78% (36/46)
remote: Counting objects: 80% (37/46)
remote: Counting objects: 82% (38/46)
remote: Counting objects: 84% (39/46)
remote: Counting objects: 86% (40/46)
remote: Counting objects: 89% (41/46)
remote: Counting objects: 91% (42/46)
remote: Counting objects: 93% (43/46)
remote: Counting objects: 95% (44/46)
remote: Counting objects: 97% (45/46)
remote: Counting objects: 100% (46/46)
remote: Counting objects: 100% (46/46), done.
remote: Compressing objects: 4% (1/21)
remote: Compressing objects: 9% (2/21)
remote: Compressing objects: 14% (3/21)
remote: Compressing objects: 19% (4/21)
remote: Compressing objects: 23% (5/21)
remote: Compressing objects: 28% (6/21)
remote: Compressing objects: 33% (7/21)
remote: Compressing objects: 38% (8/21)
remote: Compressing objects: 42% (9/21)
remote: Compressing objects: 47% (10/21)
remote: Compressing objects: 52% (11/21)
remote: Compressing objects: 57% (12/21)
remote: Compressing objects: 61% (13/21)
remote: Compressing objects: 66% (14/21)
remote: Compressing objects: 71% (15/21)
remote: Compressing objects: 76% (16/21)
remote: Compressing objects: 80% (17/21)
remote: Compressing objects: 85% (18/21)
remote: Compressing objects: 90% (19/21)
remote: Compressing objects: 95% (20/21)
remote: Compressing objects: 100% (21/21)
remote: Compressing objects: 100% (21/21), done.
remote: Total 24 (delta 22), reused 5 (delta 3), pack-reused 0
From https://github.com/python/cpython
- branch main -> FETCH_HEAD Note: switching to '6ef8f8ca88b925685c6af83a9f0a899e565e1e33'.
You are in 'detached HEAD' state. You can look around, make experimental changes and commit them, and you can discard any commits you make in this state without impacting any branches by switching back to a branch.
If you want to create a new branch to retain commits you create, you may do so (now or later) by using -c with the switch command. Example:
git switch -c <new-branch-name>
Or undo this operation with:
git switch -
Turn off this advice by setting config variable advice.detachedHead to false
HEAD is now at 6ef8f8ca88 gh-105481: the ENABLE_SPECIALIZATION flag does not need to be generated by the build script, or exposed in opcode.py (#107534) Switched to and reset branch 'main'
Timeout (0:15:00)! Thread 0x00007fffa1df4d70 (most recent call first): File "/home/buildbot/buildarea/3.x.cstratak-RHEL8-ppc64le/build/Lib/selectors.py", line 398 in select File "/home/buildbot/buildarea/3.x.cstratak-RHEL8-ppc64le/build/Lib/subprocess.py", line 2108 in _communicate File "/home/buildbot/buildarea/3.x.cstratak-RHEL8-ppc64le/build/Lib/subprocess.py", line 1209 in communicate File "/home/buildbot/buildarea/3.x.cstratak-RHEL8-ppc64le/build/Lib/test/test_gdb.py", line 112 in run_gdb File "/home/buildbot/buildarea/3.x.cstratak-RHEL8-ppc64le/build/Lib/test/test_gdb.py", line 229 in get_stack_trace File "/home/buildbot/buildarea/3.x.cstratak-RHEL8-ppc64le/build/Lib/test/test_gdb.py", line 936 in test_pycfunction File "/home/buildbot/buildarea/3.x.cstratak-RHEL8-ppc64le/build/Lib/unittest/case.py", line 589 in _callTestMethod File "/home/buildbot/buildarea/3.x.cstratak-RHEL8-ppc64le/build/Lib/unittest/case.py", line 634 in run File "/home/buildbot/buildarea/3.x.cstratak-RHEL8-ppc64le/build/Lib/unittest/case.py", line 690 in __call__ File "/home/buildbot/buildarea/3.x.cstratak-RHEL8-ppc64le/build/Lib/unittest/suite.py", line 122 in run File "/home/buildbot/buildarea/3.x.cstratak-RHEL8-ppc64le/build/Lib/unittest/suite.py", line 84 in __call__ File "/home/buildbot/buildarea/3.x.cstratak-RHEL8-ppc64le/build/Lib/unittest/suite.py", line 122 in run File "/home/buildbot/buildarea/3.x.cstratak-RHEL8-ppc64le/build/Lib/unittest/suite.py", line 84 in __call__ File "/home/buildbot/buildarea/3.x.cstratak-RHEL8-ppc64le/build/Lib/unittest/suite.py", line 122 in run File "/home/buildbot/buildarea/3.x.cstratak-RHEL8-ppc64le/build/Lib/unittest/suite.py", line 84 in __call__ File "/home/buildbot/buildarea/3.x.cstratak-RHEL8-ppc64le/build/Lib/unittest/runner.py", line 240 in run File "/home/buildbot/buildarea/3.x.cstratak-RHEL8-ppc64le/build/Lib/test/support/__init__.py", line 1115 in _run_suite File "/home/buildbot/buildarea/3.x.cstratak-RHEL8-ppc64le/build/Lib/test/support/__init__.py", line 1241 in run_unittest File "/home/buildbot/buildarea/3.x.cstratak-RHEL8-ppc64le/build/Lib/test/libregrtest/runtest.py", line 294 in _test_module File "/home/buildbot/buildarea/3.x.cstratak-RHEL8-ppc64le/build/Lib/test/libregrtest/runtest.py", line 330 in _runtest_inner2 File "/home/buildbot/buildarea/3.x.cstratak-RHEL8-ppc64le/build/Lib/test/libregrtest/runtest.py", line 373 in _runtest_inner File "/home/buildbot/buildarea/3.x.cstratak-RHEL8-ppc64le/build/Lib/test/libregrtest/runtest.py", line 248 in _runtest File "/home/buildbot/buildarea/3.x.cstratak-RHEL8-ppc64le/build/Lib/test/libregrtest/runtest.py", line 278 in runtest File "/home/buildbot/buildarea/3.x.cstratak-RHEL8-ppc64le/build/Lib/test/libregrtest/main.py", line 365 in rerun_failed_tests File "/home/buildbot/buildarea/3.x.cstratak-RHEL8-ppc64le/build/Lib/test/libregrtest/main.py", line 803 in _main File "/home/buildbot/buildarea/3.x.cstratak-RHEL8-ppc64le/build/Lib/test/libregrtest/main.py", line 758 in main File "/home/buildbot/buildarea/3.x.cstratak-RHEL8-ppc64le/build/Lib/test/libregrtest/main.py", line 822 in main File "/home/buildbot/buildarea/3.x.cstratak-RHEL8-ppc64le/build/Lib/test/__main__.py", line 2 in <module> File "/home/buildbot/buildarea/3.x.cstratak-RHEL8-ppc64le/build/Lib/runpy.py", line 88 in _run_code File "/home/buildbot/buildarea/3.x.cstratak-RHEL8-ppc64le/build/Lib/runpy.py", line 198 in _run_module_as_main make: *** [Makefile:2026: buildbottest] Error 1
Cannot open file '/home/buildbot/buildarea/3.x.cstratak-RHEL8-ppc64le/build/build_oot/test-results.xml' for upload
Test report
Failed tests:
- test_gdb
Sincerely, -The BuildbotThe Buildbot has detected a new failure on builder s390x RHEL8 LTO + PGO 3.x while building python/cpython. Full details are available at: https://buildbot.python.org/all/#/builders/442/builds/4693
Buildbot URL: https://buildbot.python.org/all/
Worker for this Build: edelsohn-rhel8-z
Build Reason: <unknown> Blamelist: Alex Waygood <Alex.Waygood@Gmail.com>, Anders Kaseorg <andersk@mit.edu>, Brandt Bucher <brandtbucher@microsoft.com>, Carl Meyer <carl@oddbird.net>, Charlie Zhao <zhaoyu_hit@qq.com>, Christopher Chavez <chrischavez@gmx.us>, Daniele Procida <daniele@vurt.org>, Dong-hee Na <donghee.na@python.org>, Eric Snow <ericsnowcurrently@gmail.com>, Erlend E. Aasland <erlend@python.org>, Ezio Melotti <ezio.melotti@gmail.com>, Felipe A. Hernandez <ergoithz@gmail.com>, Furkan Onder <furkanonder@protonmail.com>, Georg Brandl <georg@python.org>, Gregory P. Smith <greg@krypto.org>, Guido van Rossum <guido@python.org>, Hakan Celik <hakancelikdev@gmail.com>, Hugo van Kemenade <hugovk@users.noreply.github.com>, Illia Volochii <illia.volochii@gmail.com>, Inada Naoki <songofacandy@gmail.com>, Irit Katriel <1055913+iritkatriel@users.noreply.github.com>, Jacob Walls <jacobtylerwalls@gmail.com>, James Cave <jcave137@gmail.com>, János Kukovecz <kukoveczjanos@gmail.com>, Jérôme Carretero <cJ-tub@zou gloub.eu>, Konstantin <kpp.live+github@gmail.com>, Kumar Aditya <kumaraditya@python.org>, Mark Shannon <mark@hotpy.org>, Michael The <michael-the1@users.noreply.github.com>, Ned Deily <nad@python.org>, Nikita Sobolev <mail@sobolevn.me>, Pablo Galindo Salgado <Pablogsal@gmail.com>, Paul Moore <p.f.moore@gmail.com>, Pieter Eendebak <pieter.eendebak@gmail.com>, Rakesh Sabale <102187286+ghubrakesh@users.noreply.github.com>, Roman Yurchak <rth.yurchak@gmail.com>, Serhiy Storchaka <storchaka@gmail.com>, Tian Gao <gaogaotiantian@hotmail.com>, Tom Niget <zippedfire@free.fr>, Tomas R <tomas.roun8@gmail.com>, TommyUnreal <45427816+TommyUnreal@users.noreply.github.com>, Victor Stinner <vstinner@python.org>, cLupus <cLupus@users.noreply.github.com>, da-woods <dw-git@d-woods.co.uk>, justdan6 <134341009+justdan6@users.noreply.github.com>, opavliuk <40970635+opavlyuk@users.noreply.github.com>, shailshouryya <42100758+shailshouryya@users.noreply.github.com>
BUILD FAILED: failed test (failure) uploading test-results.xml (failure)
Summary of the results of the build (if available):
==
Captured traceback
remote: Enumerating objects: 46, done.
remote: Counting objects: 2% (1/46)
remote: Counting objects: 4% (2/46)
remote: Counting objects: 6% (3/46)
remote: Counting objects: 8% (4/46)
remote: Counting objects: 10% (5/46)
remote: Counting objects: 13% (6/46)
remote: Counting objects: 15% (7/46)
remote: Counting objects: 17% (8/46)
remote: Counting objects: 19% (9/46)
remote: Counting objects: 21% (10/46)
remote: Counting objects: 23% (11/46)
remote: Counting objects: 26% (12/46)
remote: Counting objects: 28% (13/46)
remote: Counting objects: 30% (14/46)
remote: Counting objects: 32% (15/46)
remote: Counting objects: 34% (16/46)
remote: Counting objects: 36% (17/46)
remote: Counting objects: 39% (18/46)
remote: Counting objects: 41% (19/46)
remote: Counting objects: 43% (20/46)
remote: Counting objects: 45% (21/46)
remote: Counting objects: 47% (22/46)
remote: Counting objects: 50% (23/46)
remote: Counting objects: 52% (24/46)
remote: Counting objects: 54% (25/46)
remote: Counting objects: 56% (26/46)
remote: Counting objects: 58% (27/46)
remote: Counting objects: 60% (28/46)
remote: Counting objects: 63% (29/46)
remote: Counting objects: 65% (30/46)
remote: Counting objects: 67% (31/46)
remote: Counting objects: 69% (32/46)
remote: Counting objects: 71% (33/46)
remote: Counting objects: 73% (34/46)
remote: Counting objects: 76% (35/46)
remote: Counting objects: 78% (36/46)
remote: Counting objects: 80% (37/46)
remote: Counting objects: 82% (38/46)
remote: Counting objects: 84% (39/46)
remote: Counting objects: 86% (40/46)
remote: Counting objects: 89% (41/46)
remote: Counting objects: 91% (42/46)
remote: Counting objects: 93% (43/46)
remote: Counting objects: 95% (44/46)
remote: Counting objects: 97% (45/46)
remote: Counting objects: 100% (46/46)
remote: Counting objects: 100% (46/46), done.
remote: Compressing objects: 4% (1/24)
remote: Compressing objects: 8% (2/24)
remote: Compressing objects: 12% (3/24)
remote: Compressing objects: 16% (4/24)
remote: Compressing objects: 20% (5/24)
remote: Compressing objects: 25% (6/24)
remote: Compressing objects: 29% (7/24)
remote: Compressing objects: 33% (8/24)
remote: Compressing objects: 37% (9/24)
remote: Compressing objects: 41% (10/24)
remote: Compressing objects: 45% (11/24)
remote: Compressing objects: 50% (12/24)
remote: Compressing objects: 54% (13/24)
remote: Compressing objects: 58% (14/24)
remote: Compressing objects: 62% (15/24)
remote: Compressing objects: 66% (16/24)
remote: Compressing objects: 70% (17/24)
remote: Compressing objects: 75% (18/24)
remote: Compressing objects: 79% (19/24)
remote: Compressing objects: 83% (20/24)
remote: Compressing objects: 87% (21/24)
remote: Compressing objects: 91% (22/24)
remote: Compressing objects: 95% (23/24)
remote: Compressing objects: 100% (24/24)
remote: Compressing objects: 100% (24/24), done.
remote: Total 24 (delta 22), reused 2 (delta 0), pack-reused 0
From https://github.com/python/cpython
- branch main -> FETCH_HEAD Note: switching to '6ef8f8ca88b925685c6af83a9f0a899e565e1e33'.
You are in 'detached HEAD' state. You can look around, make experimental changes and commit them, and you can discard any commits you make in this state without impacting any branches by switching back to a branch.
If you want to create a new branch to retain commits you create, you may do so (now or later) by using -c with the switch command. Example:
git switch -c <new-branch-name>
Or undo this operation with:
git switch -
Turn off this advice by setting config variable advice.detachedHead to false
HEAD is now at 6ef8f8ca88 gh-105481: the ENABLE_SPECIALIZATION flag does not need to be generated by the build script, or exposed in opcode.py (#107534) Switched to and reset branch 'main'
find: ‘build’: No such file or directory find: ‘build’: No such file or directory find: ‘build’: No such file or directory find: ‘build’: No such file or directory make[2]: [Makefile:2799: clean-retain-profile] Error 1 (ignored) ./Modules/_decimal/libmpdec/context.c:57: warning: mpd_setminalloc: ignoring request to set MPD_MINALLOC a second time
./Modules/_decimal/libmpdec/context.c:57: warning: mpd_setminalloc: ignoring request to set MPD_MINALLOC a second time
Timeout (0:15:00)! Thread 0x000003ff833f7730 (most recent call first): File "/home/dje/cpython-buildarea/3.x.edelsohn-rhel8-z.lto-pgo/build/Lib/selectors.py", line 398 in select File "/home/dje/cpython-buildarea/3.x.edelsohn-rhel8-z.lto-pgo/build/Lib/subprocess.py", line 2108 in _communicate File "/home/dje/cpython-buildarea/3.x.edelsohn-rhel8-z.lto-pgo/build/Lib/subprocess.py", line 1209 in communicate File "/home/dje/cpython-buildarea/3.x.edelsohn-rhel8-z.lto-pgo/build/Lib/subprocess.py", line 550 in run File "/home/dje/cpython-buildarea/3.x.edelsohn-rhel8-z.lto-pgo/build/Tools/freeze/test/freeze.py", line 25 in _run_quiet File "/home/dje/cpython-buildarea/3.x.edelsohn-rhel8-z.lto-pgo/build/Tools/freeze/test/freeze.py", line 198 in freeze File "/home/dje/cpython-buildarea/3.x.edelsohn-rhel8-z.lto-pgo/build/Lib/test/test_tools/test_freeze.py", line 28 in test_freeze_simple_script File "/home/dje/cpython-buildarea/3.x.edelsohn-rhel8-z.lto-pgo/build/Lib/unittest/case.py", line 589 in _callTestMethod File "/home/dje/cpython-buildarea/3.x.edelsohn-rhel8-z.lto-pgo/build/Lib/unittest/case.py", line 634 in run File "/home/dje/cpython-buildarea/3.x.edelsohn-rhel8-z.lto-pgo/build/Lib/unittest/case.py", line 690 in __call__ File "/home/dje/cpython-buildarea/3.x.edelsohn-rhel8-z.lto-pgo/build/Lib/unittest/suite.py", line 122 in run File "/home/dje/cpython-buildarea/3.x.edelsohn-rhel8-z.lto-pgo/build/Lib/unittest/suite.py", line 84 in __call__ File "/home/dje/cpython-buildarea/3.x.edelsohn-rhel8-z.lto-pgo/build/Lib/unittest/suite.py", line 122 in run File "/home/dje/cpython-buildarea/3.x.edelsohn-rhel8-z.lto-pgo/build/Lib/unittest/suite.py", line 84 in __call__ File "/home/dje/cpython-buildarea/3.x.edelsohn-rhel8-z.lto-pgo/build/Lib/unittest/suite.py", line 122 in run File "/home/dje/cpython-buildarea/3.x.edelsohn-rhel8-z.lto-pgo/build/Lib/unittest/suite.py", line 84 in __call__ File "/home/dje/cpython-buildarea/3.x.edelsohn-rhel8-z.lto-pgo/build/Lib/unittest/suite.py", line 122 in run File "/home/dje/cpython-buildarea/3.x.edelsohn-rhel8-z.lto-pgo/build/Lib/unittest/suite.py", line 84 in __call__ File "/home/dje/cpython-buildarea/3.x.edelsohn-rhel8-z.lto-pgo/build/Lib/unittest/suite.py", line 122 in run File "/home/dje/cpython-buildarea/3.x.edelsohn-rhel8-z.lto-pgo/build/Lib/unittest/suite.py", line 84 in __call__ File "/home/dje/cpython-buildarea/3.x.edelsohn-rhel8-z.lto-pgo/build/Lib/unittest/runner.py", line 240 in run File "/home/dje/cpython-buildarea/3.x.edelsohn-rhel8-z.lto-pgo/build/Lib/test/support/__init__.py", line 1115 in _run_suite File "/home/dje/cpython-buildarea/3.x.edelsohn-rhel8-z.lto-pgo/build/Lib/test/support/__init__.py", line 1241 in run_unittest File "/home/dje/cpython-buildarea/3.x.edelsohn-rhel8-z.lto-pgo/build/Lib/test/libregrtest/runtest.py", line 294 in _test_module File "/home/dje/cpython-buildarea/3.x.edelsohn-rhel8-z.lto-pgo/build/Lib/test/libregrtest/runtest.py", line 330 in _runtest_inner2 File "/home/dje/cpython-buildarea/3.x.edelsohn-rhel8-z.lto-pgo/build/Lib/test/libregrtest/runtest.py", line 373 in _runtest_inner File "/home/dje/cpython-buildarea/3.x.edelsohn-rhel8-z.lto-pgo/build/Lib/test/libregrtest/runtest.py", line 248 in _runtest File "/home/dje/cpython-buildarea/3.x.edelsohn-rhel8-z.lto-pgo/build/Lib/test/libregrtest/runtest.py", line 278 in runtest File "/home/dje/cpython-buildarea/3.x.edelsohn-rhel8-z.lto-pgo/build/Lib/test/libregrtest/main.py", line 365 in rerun_failed_tests File "/home/dje/cpython-buildarea/3.x.edelsohn-rhel8-z.lto-pgo/build/Lib/test/libregrtest/main.py", line 803 in _main File "/home/dje/cpython-buildarea/3.x.edelsohn-rhel8-z.lto-pgo/build/Lib/test/libregrtest/main.py", line 758 in main File "/home/dje/cpython-buildarea/3.x.edelsohn-rhel8-z.lto-pgo/build/Lib/test/libregrtest/main.py", line 822 in main File "/home/dje/cpython-buildarea/3.x.edelsohn-rhel8-z.lto-pgo/build/Lib/test/__main__.py", line 2 in <module> File "<frozen runpy>", line 88 in _run_code File "<frozen runpy>", line 198 in _run_module_as_main make: *** [Makefile:2026: buildbottest] Error 1
Cannot open file '/home/dje/cpython-buildarea/3.x.edelsohn-rhel8-z.lto-pgo/build/test-results.xml' for upload
Test report
Failed tests:
- test_tools
Sincerely, -The Buildbot
participants (1)
-
buildbot@python.org