☠ Buildbot (Python): python/cpython - failed test (failure) (main)
The Buildbot has detected a new failure on builder ARM64 macOS 3.x while building python/cpython. Full details are available at: https://buildbot.python.org/#/builders/725/builds/12256
Buildbot URL: https://buildbot.python.org/
Worker for this Build: pablogsal-macos-m1
Build Reason: <unknown> Blamelist: Serhiy Storchaka <storchaka@gmail.com>
BUILD FAILED: failed test (failure)
Summary of the results of the build (if available):
==
Captured traceback
Traceback (most recent call last): File "/Users/buildbot/buildarea/3.x.pablogsal-macos-m1.macos-with-brew/build/Lib/test/test_urllib2net.py", line 22, in _retry_thrice last_exc = e ^^^^^^^^ ResourceWarning: unclosed <socket.socket fd=9, family=2, type=1, proto=6, laddr=('192.168.0.101', 59180), raddr=('68.183.26.59', 21)> Warning -- Unraisable exception Exception ignored while finalizing socket <socket.socket fd=10, family=2, type=1, proto=6, laddr=('192.168.0.101', 59182), raddr=('68.183.26.59', 21)>: Traceback (most recent call last): File "/Users/buildbot/buildarea/3.x.pablogsal-macos-m1.macos-with-brew/build/Lib/urllib/request.py", line 1546, in ftp_open fp, retrlen = fw.retrfile(file, type) ~~~~~~~~~~~^^^^^^^^^^^^ File "/Users/buildbot/buildarea/3.x.pablogsal-macos-m1.macos-with-brew/build/Lib/urllib/request.py", line 1826, in retrfile conn, retrlen = self.ftp.ntransfercmd(cmd) ~~~~~~~~~~~~~~~~~~~~~^^^^^ File "/Users/buildbot/buildarea/3.x.pablogsal-macos-m1.macos-with-brew/build/Lib/ftplib.py", line 354, in ntransfercmd conn = socket.create_connection((host, port), self.timeout, source_address=self.source_address) File "/Users/buildbot/buildarea/3.x.pablogsal-macos-m1.macos-with-brew/build/Lib/socket.py", line 879, in create_connection raise exceptions[0] File "/Users/buildbot/buildarea/3.x.pablogsal-macos-m1.macos-with-brew/build/Lib/socket.py", line 864, in create_connection sock.connect(sa) ~~~~~~~~~~~~^^^^ TimeoutError: [Errno 60] Operation timed out
Traceback (most recent call last): File "/Users/buildbot/buildarea/3.x.pablogsal-macos-m1.macos-with-brew/build/Lib/test/test_urllib2net.py", line 22, in _retry_thrice last_exc = e ^^^^^^^^ ResourceWarning: unclosed <socket.socket fd=9, family=2, type=1, proto=6, laddr=('192.168.0.101', 59135), raddr=('68.183.26.59', 21)> Warning -- Unraisable exception Exception ignored while finalizing socket <socket.socket fd=11, family=2, type=1, proto=6, laddr=('192.168.0.101', 59137), raddr=('68.183.26.59', 21)>: Traceback (most recent call last): File "/Users/buildbot/buildarea/3.x.pablogsal-macos-m1.macos-with-brew/build/Lib/urllib/request.py", line 1546, in ftp_open fp, retrlen = fw.retrfile(file, type) ~~~~~~~~~~~^^^^^^^^^^^^ File "/Users/buildbot/buildarea/3.x.pablogsal-macos-m1.macos-with-brew/build/Lib/urllib/request.py", line 1826, in retrfile conn, retrlen = self.ftp.ntransfercmd(cmd) ~~~~~~~~~~~~~~~~~~~~~^^^^^ File "/Users/buildbot/buildarea/3.x.pablogsal-macos-m1.macos-with-brew/build/Lib/ftplib.py", line 354, in ntransfercmd conn = socket.create_connection((host, port), self.timeout, source_address=self.source_address) File "/Users/buildbot/buildarea/3.x.pablogsal-macos-m1.macos-with-brew/build/Lib/socket.py", line 879, in create_connection raise exceptions[0] File "/Users/buildbot/buildarea/3.x.pablogsal-macos-m1.macos-with-brew/build/Lib/socket.py", line 864, in create_connection sock.connect(sa) ~~~~~~~~~~~~^^^^ TimeoutError: [Errno 60] Operation timed out
Traceback (most recent call last): File "/Users/buildbot/buildarea/3.x.pablogsal-macos-m1.macos-with-brew/build/Lib/test/support/__init__.py", line 847, in gc_collect gc.collect() ~~~~~~~~~~^^ ResourceWarning: unclosed <socket.socket fd=6, family=2, type=1, proto=6, laddr=('192.168.0.101', 59121), raddr=('68.183.26.59', 21)> Warning -- Unraisable exception Exception ignored while finalizing socket <socket.socket fd=7, family=2, type=1, proto=6, laddr=('192.168.0.101', 59127), raddr=('68.183.26.59', 21)>: Traceback (most recent call last): File "/Users/buildbot/buildarea/3.x.pablogsal-macos-m1.macos-with-brew/build/Lib/test/support/__init__.py", line 847, in gc_collect gc.collect() ~~~~~~~~~~^^ ResourceWarning: unclosed <socket.socket fd=7, family=2, type=1, proto=6, laddr=('192.168.0.101', 59127), raddr=('68.183.26.59', 21)> Warning -- Unraisable exception Exception ignored while finalizing socket <socket.socket fd=8, family=2, type=1, proto=6, laddr=('192.168.0.101', 59133), raddr=('68.183.26.59', 21)>: Traceback (most recent call last): File "/Users/buildbot/buildarea/3.x.pablogsal-macos-m1.macos-with-brew/build/Lib/test/support/__init__.py", line 847, in gc_collect gc.collect() ~~~~~~~~~~^^ ResourceWarning: unclosed <socket.socket fd=8, family=2, type=1, proto=6, laddr=('192.168.0.101', 59133), raddr=('68.183.26.59', 21)> Warning -- Unraisable exception Exception ignored while finalizing socket <socket.socket fd=9, family=2, type=1, proto=6, laddr=('192.168.0.101', 59139), raddr=('68.183.26.59', 21)>: Traceback (most recent call last): File "/Users/buildbot/buildarea/3.x.pablogsal-macos-m1.macos-with-brew/build/Lib/test/support/__init__.py", line 847, in gc_collect gc.collect() ~~~~~~~~~~^^ ResourceWarning: unclosed <socket.socket fd=9, family=2, type=1, proto=6, laddr=('192.168.0.101', 59139), raddr=('68.183.26.59', 21)>
Traceback (most recent call last): File "/Users/buildbot/buildarea/3.x.pablogsal-macos-m1.macos-with-brew/build/Lib/urllib/request.py", line 1546, in ftp_open fp, retrlen = fw.retrfile(file, type) ~~~~~~~~~~~^^^^^^^^^^^^ File "/Users/buildbot/buildarea/3.x.pablogsal-macos-m1.macos-with-brew/build/Lib/urllib/request.py", line 1826, in retrfile conn, retrlen = self.ftp.ntransfercmd(cmd) ~~~~~~~~~~~~~~~~~~~~~^^^^^ File "/Users/buildbot/buildarea/3.x.pablogsal-macos-m1.macos-with-brew/build/Lib/ftplib.py", line 354, in ntransfercmd conn = socket.create_connection((host, port), self.timeout, source_address=self.source_address) File "/Users/buildbot/buildarea/3.x.pablogsal-macos-m1.macos-with-brew/build/Lib/socket.py", line 879, in create_connection raise exceptions[0] File "/Users/buildbot/buildarea/3.x.pablogsal-macos-m1.macos-with-brew/build/Lib/socket.py", line 864, in create_connection sock.connect(sa) ~~~~~~~~~~~~^^^^ TimeoutError: [Errno 60] Operation timed out
Traceback (most recent call last): File "/Users/buildbot/buildarea/3.x.pablogsal-macos-m1.macos-with-brew/build/Lib/test/test_urllib2net.py", line 22, in _retry_thrice last_exc = e ^^^^^^^^ ResourceWarning: unclosed <socket.socket fd=8, family=2, type=1, proto=6, laddr=('192.168.0.101', 59168), raddr=('68.183.26.59', 21)> skipped "Resource 'ftp://www.pythontest.net/' is not available"
Traceback (most recent call last): File "/Users/buildbot/buildarea/3.x.pablogsal-macos-m1.macos-with-brew/build/Lib/test/test_urllib2net.py", line 22, in _retry_thrice last_exc = e ^^^^^^^^ ResourceWarning: unclosed <socket.socket fd=7, family=2, type=1, proto=6, laddr=('192.168.0.101', 59123), raddr=('68.183.26.59', 21)> Warning -- Unraisable exception Exception ignored while finalizing socket <socket.socket fd=8, family=2, type=1, proto=6, laddr=('192.168.0.101', 59125), raddr=('68.183.26.59', 21)>: Traceback (most recent call last): File "/Users/buildbot/buildarea/3.x.pablogsal-macos-m1.macos-with-brew/build/Lib/urllib/request.py", line 1546, in ftp_open fp, retrlen = fw.retrfile(file, type) ~~~~~~~~~~~^^^^^^^^^^^^ File "/Users/buildbot/buildarea/3.x.pablogsal-macos-m1.macos-with-brew/build/Lib/urllib/request.py", line 1826, in retrfile conn, retrlen = self.ftp.ntransfercmd(cmd) ~~~~~~~~~~~~~~~~~~~~~^^^^^ File "/Users/buildbot/buildarea/3.x.pablogsal-macos-m1.macos-with-brew/build/Lib/ftplib.py", line 354, in ntransfercmd conn = socket.create_connection((host, port), self.timeout, source_address=self.source_address) File "/Users/buildbot/buildarea/3.x.pablogsal-macos-m1.macos-with-brew/build/Lib/socket.py", line 879, in create_connection raise exceptions[0] File "/Users/buildbot/buildarea/3.x.pablogsal-macos-m1.macos-with-brew/build/Lib/socket.py", line 864, in create_connection sock.connect(sa) ~~~~~~~~~~~~^^^^ TimeoutError: [Errno 60] Operation timed out
Traceback (most recent call last): File "/Users/buildbot/buildarea/3.x.pablogsal-macos-m1.macos-with-brew/build/Lib/test/test_urllib2net.py", line 22, in _retry_thrice last_exc = e ^^^^^^^^ ResourceWarning: unclosed <socket.socket fd=9, family=2, type=1, proto=6, laddr=('192.168.0.101', 59176), raddr=('68.183.26.59', 21)> skipped "Resource 'ftp://www.pythontest.net/' is not available"
Traceback (most recent call last): File "/Users/buildbot/buildarea/3.x.pablogsal-macos-m1.macos-with-brew/build/Lib/test/test_urllib2net.py", line 22, in _retry_thrice last_exc = e ^^^^^^^^ ResourceWarning: unclosed <socket.socket fd=11, family=2, type=1, proto=6, laddr=('192.168.0.101', 59189), raddr=('68.183.26.59', 21)> skipped "Resource 'ftp://www.pythontest.net/' is not available"
Traceback (most recent call last): File "/Users/buildbot/buildarea/3.x.pablogsal-macos-m1.macos-with-brew/build/Lib/test/test_urllib2net.py", line 22, in _retry_thrice last_exc = e ^^^^^^^^ ResourceWarning: unclosed <socket.socket fd=7, family=2, type=1, proto=6, laddr=('192.168.0.101', 59118), raddr=('68.183.26.59', 21)> skipped "Resource 'ftp://www.pythontest.net/' is not available"
Traceback (most recent call last): File "/Users/buildbot/buildarea/3.x.pablogsal-macos-m1.macos-with-brew/build/Lib/test/test_urllib2net.py", line 22, in _retry_thrice last_exc = e ^^^^^^^^ ResourceWarning: unclosed <socket.socket fd=10, family=2, type=1, proto=6, laddr=('192.168.0.101', 59182), raddr=('68.183.26.59', 21)> skipped "Resource 'ftp://www.pythontest.net/' is not available"
Traceback (most recent call last): File "/Users/buildbot/buildarea/3.x.pablogsal-macos-m1.macos-with-brew/build/Lib/test/test_urllib2net.py", line 22, in _retry_thrice last_exc = e ^^^^^^^^ ResourceWarning: unclosed <socket.socket fd=8, family=2, type=1, proto=6, laddr=('192.168.0.101', 59174), raddr=('68.183.26.59', 21)> Warning -- Unraisable exception Exception ignored while finalizing socket <socket.socket fd=9, family=2, type=1, proto=6, laddr=('192.168.0.101', 59176), raddr=('68.183.26.59', 21)>: Traceback (most recent call last): File "/Users/buildbot/buildarea/3.x.pablogsal-macos-m1.macos-with-brew/build/Lib/urllib/request.py", line 1546, in ftp_open fp, retrlen = fw.retrfile(file, type) ~~~~~~~~~~~^^^^^^^^^^^^ File "/Users/buildbot/buildarea/3.x.pablogsal-macos-m1.macos-with-brew/build/Lib/urllib/request.py", line 1826, in retrfile conn, retrlen = self.ftp.ntransfercmd(cmd) ~~~~~~~~~~~~~~~~~~~~~^^^^^ File "/Users/buildbot/buildarea/3.x.pablogsal-macos-m1.macos-with-brew/build/Lib/ftplib.py", line 354, in ntransfercmd conn = socket.create_connection((host, port), self.timeout, source_address=self.source_address) File "/Users/buildbot/buildarea/3.x.pablogsal-macos-m1.macos-with-brew/build/Lib/socket.py", line 879, in create_connection raise exceptions[0] File "/Users/buildbot/buildarea/3.x.pablogsal-macos-m1.macos-with-brew/build/Lib/socket.py", line 864, in create_connection sock.connect(sa) ~~~~~~~~~~~~^^^^ TimeoutError: timed out
Traceback (most recent call last): File "/Users/buildbot/buildarea/3.x.pablogsal-macos-m1.macos-with-brew/build/Lib/test/test_urllib2net.py", line 22, in _retry_thrice last_exc = e ^^^^^^^^ ResourceWarning: unclosed <socket.socket fd=8, family=2, type=1, proto=6, laddr=('192.168.0.101', 59129), raddr=('68.183.26.59', 21)> Warning -- Unraisable exception Exception ignored while finalizing socket <socket.socket fd=9, family=2, type=1, proto=6, laddr=('192.168.0.101', 59131), raddr=('68.183.26.59', 21)>: Traceback (most recent call last): File "/Users/buildbot/buildarea/3.x.pablogsal-macos-m1.macos-with-brew/build/Lib/urllib/request.py", line 1546, in ftp_open fp, retrlen = fw.retrfile(file, type) ~~~~~~~~~~~^^^^^^^^^^^^ File "/Users/buildbot/buildarea/3.x.pablogsal-macos-m1.macos-with-brew/build/Lib/urllib/request.py", line 1826, in retrfile conn, retrlen = self.ftp.ntransfercmd(cmd) ~~~~~~~~~~~~~~~~~~~~~^^^^^ File "/Users/buildbot/buildarea/3.x.pablogsal-macos-m1.macos-with-brew/build/Lib/ftplib.py", line 354, in ntransfercmd conn = socket.create_connection((host, port), self.timeout, source_address=self.source_address) File "/Users/buildbot/buildarea/3.x.pablogsal-macos-m1.macos-with-brew/build/Lib/socket.py", line 879, in create_connection raise exceptions[0] File "/Users/buildbot/buildarea/3.x.pablogsal-macos-m1.macos-with-brew/build/Lib/socket.py", line 864, in create_connection sock.connect(sa) ~~~~~~~~~~~~^^^^ TimeoutError: [Errno 60] Operation timed out
Traceback (most recent call last): File "/Users/buildbot/buildarea/3.x.pablogsal-macos-m1.macos-with-brew/build/Lib/urllib/request.py", line 1546, in ftp_open fp, retrlen = fw.retrfile(file, type) ~~~~~~~~~~~^^^^^^^^^^^^ File "/Users/buildbot/buildarea/3.x.pablogsal-macos-m1.macos-with-brew/build/Lib/urllib/request.py", line 1826, in retrfile conn, retrlen = self.ftp.ntransfercmd(cmd) ~~~~~~~~~~~~~~~~~~~~~^^^^^ File "/Users/buildbot/buildarea/3.x.pablogsal-macos-m1.macos-with-brew/build/Lib/ftplib.py", line 354, in ntransfercmd conn = socket.create_connection((host, port), self.timeout, source_address=self.source_address) File "/Users/buildbot/buildarea/3.x.pablogsal-macos-m1.macos-with-brew/build/Lib/socket.py", line 879, in create_connection raise exceptions[0] File "/Users/buildbot/buildarea/3.x.pablogsal-macos-m1.macos-with-brew/build/Lib/socket.py", line 864, in create_connection sock.connect(sa) ~~~~~~~~~~~~^^^^ TimeoutError: timed out
Traceback (most recent call last): File "/Users/buildbot/buildarea/3.x.pablogsal-macos-m1.macos-with-brew/build/Lib/test/test_urllib2net.py", line 22, in _retry_thrice last_exc = e ^^^^^^^^ ResourceWarning: unclosed <socket.socket fd=11, family=2, type=1, proto=6, laddr=('192.168.0.101', 59137), raddr=('68.183.26.59', 21)> skipped "Resource 'ftp://www.pythontest.net/' is not available"
Traceback (most recent call last): File "/Users/buildbot/buildarea/3.x.pablogsal-macos-m1.macos-with-brew/build/Lib/test/test_urllib2net.py", line 20, in _retry_thrice return func(*args, **kwargs) File "/Users/buildbot/buildarea/3.x.pablogsal-macos-m1.macos-with-brew/build/Lib/urllib/request.py", line 187, in urlopen return opener.open(url, data, timeout) ~~~~~~~~~~~^^^^^^^^^^^^^^^^^^^^ File "/Users/buildbot/buildarea/3.x.pablogsal-macos-m1.macos-with-brew/build/Lib/urllib/request.py", line 487, in open response = self._open(req, data) File "/Users/buildbot/buildarea/3.x.pablogsal-macos-m1.macos-with-brew/build/Lib/urllib/request.py", line 504, in _open result = self._call_chain(self.handle_open, protocol, protocol + '_open', req) File "/Users/buildbot/buildarea/3.x.pablogsal-macos-m1.macos-with-brew/build/Lib/urllib/request.py", line 464, in _call_chain result = func(*args) File "/Users/buildbot/buildarea/3.x.pablogsal-macos-m1.macos-with-brew/build/Lib/urllib/request.py", line 1556, in ftp_open raise URLError(f"ftp error: {exp}") from exp urllib.error.URLError: <urlopen error ftp error: timed out>
Traceback (most recent call last): File "/Users/buildbot/buildarea/3.x.pablogsal-macos-m1.macos-with-brew/build/Lib/test/support/__init__.py", line 847, in gc_collect gc.collect() ~~~~~~~~~~^^ ResourceWarning: unclosed <socket.socket fd=7, family=2, type=1, proto=6, laddr=('192.168.0.101', 59171), raddr=('68.183.26.59', 21)> Warning -- Unraisable exception Exception ignored while finalizing socket <socket.socket fd=8, family=2, type=1, proto=6, laddr=('192.168.0.101', 59178), raddr=('68.183.26.59', 21)>: Traceback (most recent call last): File "/Users/buildbot/buildarea/3.x.pablogsal-macos-m1.macos-with-brew/build/Lib/test/support/__init__.py", line 847, in gc_collect gc.collect() ~~~~~~~~~~^^ ResourceWarning: unclosed <socket.socket fd=8, family=2, type=1, proto=6, laddr=('192.168.0.101', 59178), raddr=('68.183.26.59', 21)> Warning -- Unraisable exception Exception ignored while finalizing socket <socket.socket fd=9, family=2, type=1, proto=6, laddr=('192.168.0.101', 59185), raddr=('68.183.26.59', 21)>: Traceback (most recent call last): File "/Users/buildbot/buildarea/3.x.pablogsal-macos-m1.macos-with-brew/build/Lib/test/support/__init__.py", line 847, in gc_collect gc.collect() ~~~~~~~~~~^^ ResourceWarning: unclosed <socket.socket fd=9, family=2, type=1, proto=6, laddr=('192.168.0.101', 59185), raddr=('68.183.26.59', 21)> Warning -- Unraisable exception Exception ignored while finalizing socket <socket.socket fd=10, family=2, type=1, proto=6, laddr=('192.168.0.101', 59191), raddr=('68.183.26.59', 21)>: Traceback (most recent call last): File "/Users/buildbot/buildarea/3.x.pablogsal-macos-m1.macos-with-brew/build/Lib/test/support/__init__.py", line 847, in gc_collect gc.collect() ~~~~~~~~~~^^ ResourceWarning: unclosed <socket.socket fd=10, family=2, type=1, proto=6, laddr=('192.168.0.101', 59191), raddr=('68.183.26.59', 21)>
Traceback (most recent call last): File "/Users/buildbot/buildarea/3.x.pablogsal-macos-m1.macos-with-brew/build/Lib/test/test_urllib2net.py", line 22, in _retry_thrice last_exc = e ^^^^^^^^ ResourceWarning: unclosed <socket.socket fd=7, family=2, type=1, proto=6, laddr=('192.168.0.101', 59166), raddr=('68.183.26.59', 21)> Warning -- Unraisable exception Exception ignored while finalizing socket <socket.socket fd=8, family=2, type=1, proto=6, laddr=('192.168.0.101', 59168), raddr=('68.183.26.59', 21)>: Traceback (most recent call last): File "/Users/buildbot/buildarea/3.x.pablogsal-macos-m1.macos-with-brew/build/Lib/urllib/request.py", line 1546, in ftp_open fp, retrlen = fw.retrfile(file, type) ~~~~~~~~~~~^^^^^^^^^^^^ File "/Users/buildbot/buildarea/3.x.pablogsal-macos-m1.macos-with-brew/build/Lib/urllib/request.py", line 1826, in retrfile conn, retrlen = self.ftp.ntransfercmd(cmd) ~~~~~~~~~~~~~~~~~~~~~^^^^^ File "/Users/buildbot/buildarea/3.x.pablogsal-macos-m1.macos-with-brew/build/Lib/ftplib.py", line 354, in ntransfercmd conn = socket.create_connection((host, port), self.timeout, source_address=self.source_address) File "/Users/buildbot/buildarea/3.x.pablogsal-macos-m1.macos-with-brew/build/Lib/socket.py", line 879, in create_connection raise exceptions[0] File "/Users/buildbot/buildarea/3.x.pablogsal-macos-m1.macos-with-brew/build/Lib/socket.py", line 864, in create_connection sock.connect(sa) ~~~~~~~~~~~~^^^^ TimeoutError: [Errno 60] Operation timed out
Traceback (most recent call last): File "/Users/buildbot/buildarea/3.x.pablogsal-macos-m1.macos-with-brew/build/Lib/test/test_urllib2net.py", line 22, in _retry_thrice last_exc = e ^^^^^^^^ ResourceWarning: unclosed <socket.socket fd=9, family=2, type=1, proto=6, laddr=('192.168.0.101', 59131), raddr=('68.183.26.59', 21)> skipped "Resource 'ftp://www.pythontest.net/' is not available"
Traceback (most recent call last): File "/Users/buildbot/buildarea/3.x.pablogsal-macos-m1.macos-with-brew/build/Lib/test/test_ssl.py", line 5462, in test_preauth_data_to_tls_server self.assertIn("before TLS handshake with data", wrap_error.args[1]) ~~~~~~~~~~~~~^^^^^^^^^^^^^^^^^^^^^^^^^^^^^^^^^^^^^^^^^^^^^^^^^^^^^^ AssertionError: 'before TLS handshake with data' not found in '[SSL: RECORD_LAYER_FAILURE] record layer failure (_ssl.c:1108)'
Traceback (most recent call last): File "/Users/buildbot/buildarea/3.x.pablogsal-macos-m1.macos-with-brew/build/Lib/test/test_urllib2net.py", line 22, in _retry_thrice last_exc = e ^^^^^^^^ ResourceWarning: unclosed <socket.socket fd=8, family=2, type=1, proto=6, laddr=('192.168.0.101', 59125), raddr=('68.183.26.59', 21)> skipped "Resource 'ftp://www.pythontest.net/' is not available"
Traceback (most recent call last): File "/Users/buildbot/buildarea/3.x.pablogsal-macos-m1.macos-with-brew/build/Lib/test/test_urllib2net.py", line 22, in _retry_thrice last_exc = e ^^^^^^^^ ResourceWarning: unclosed <socket.socket fd=10, family=2, type=1, proto=6, laddr=('192.168.0.101', 59187), raddr=('68.183.26.59', 21)> Warning -- Unraisable exception Exception ignored while finalizing socket <socket.socket fd=11, family=2, type=1, proto=6, laddr=('192.168.0.101', 59189), raddr=('68.183.26.59', 21)>: Traceback (most recent call last): File "/Users/buildbot/buildarea/3.x.pablogsal-macos-m1.macos-with-brew/build/Lib/urllib/request.py", line 1546, in ftp_open fp, retrlen = fw.retrfile(file, type) ~~~~~~~~~~~^^^^^^^^^^^^ File "/Users/buildbot/buildarea/3.x.pablogsal-macos-m1.macos-with-brew/build/Lib/urllib/request.py", line 1826, in retrfile conn, retrlen = self.ftp.ntransfercmd(cmd) ~~~~~~~~~~~~~~~~~~~~~^^^^^ File "/Users/buildbot/buildarea/3.x.pablogsal-macos-m1.macos-with-brew/build/Lib/ftplib.py", line 354, in ntransfercmd conn = socket.create_connection((host, port), self.timeout, source_address=self.source_address) File "/Users/buildbot/buildarea/3.x.pablogsal-macos-m1.macos-with-brew/build/Lib/socket.py", line 879, in create_connection raise exceptions[0] File "/Users/buildbot/buildarea/3.x.pablogsal-macos-m1.macos-with-brew/build/Lib/socket.py", line 864, in create_connection sock.connect(sa) ~~~~~~~~~~~~^^^^ TimeoutError: timed out
Traceback (most recent call last): File "/Users/buildbot/buildarea/3.x.pablogsal-macos-m1.macos-with-brew/build/Lib/test/test_urllib2net.py", line 22, in _retry_thrice last_exc = e ^^^^^^^^ ResourceWarning: unclosed <socket.socket fd=6, family=2, type=1, proto=6, laddr=('192.168.0.101', 59116), raddr=('68.183.26.59', 21)> Warning -- Unraisable exception Exception ignored while finalizing socket <socket.socket fd=7, family=2, type=1, proto=6, laddr=('192.168.0.101', 59118), raddr=('68.183.26.59', 21)>: Traceback (most recent call last): File "/Users/buildbot/buildarea/3.x.pablogsal-macos-m1.macos-with-brew/build/Lib/urllib/request.py", line 1546, in ftp_open fp, retrlen = fw.retrfile(file, type) ~~~~~~~~~~~^^^^^^^^^^^^ File "/Users/buildbot/buildarea/3.x.pablogsal-macos-m1.macos-with-brew/build/Lib/urllib/request.py", line 1826, in retrfile conn, retrlen = self.ftp.ntransfercmd(cmd) ~~~~~~~~~~~~~~~~~~~~~^^^^^ File "/Users/buildbot/buildarea/3.x.pablogsal-macos-m1.macos-with-brew/build/Lib/ftplib.py", line 354, in ntransfercmd conn = socket.create_connection((host, port), self.timeout, source_address=self.source_address) File "/Users/buildbot/buildarea/3.x.pablogsal-macos-m1.macos-with-brew/build/Lib/socket.py", line 879, in create_connection raise exceptions[0] File "/Users/buildbot/buildarea/3.x.pablogsal-macos-m1.macos-with-brew/build/Lib/socket.py", line 864, in create_connection sock.connect(sa) ~~~~~~~~~~~~^^^^ TimeoutError: [Errno 60] Operation timed out
Traceback (most recent call last): File "/Users/buildbot/buildarea/3.x.pablogsal-macos-m1.macos-with-brew/build/Lib/test/test_urllib2net.py", line 20, in _retry_thrice return func(*args, **kwargs) File "/Users/buildbot/buildarea/3.x.pablogsal-macos-m1.macos-with-brew/build/Lib/urllib/request.py", line 187, in urlopen return opener.open(url, data, timeout) ~~~~~~~~~~~^^^^^^^^^^^^^^^^^^^^ File "/Users/buildbot/buildarea/3.x.pablogsal-macos-m1.macos-with-brew/build/Lib/urllib/request.py", line 487, in open response = self._open(req, data) File "/Users/buildbot/buildarea/3.x.pablogsal-macos-m1.macos-with-brew/build/Lib/urllib/request.py", line 504, in _open result = self._call_chain(self.handle_open, protocol, protocol + '_open', req) File "/Users/buildbot/buildarea/3.x.pablogsal-macos-m1.macos-with-brew/build/Lib/urllib/request.py", line 464, in _call_chain result = func(*args) File "/Users/buildbot/buildarea/3.x.pablogsal-macos-m1.macos-with-brew/build/Lib/urllib/request.py", line 1556, in ftp_open raise URLError(f"ftp error: {exp}") from exp urllib.error.URLError: <urlopen error ftp error: [Errno 60] Operation timed out>
Test report
Failed tests:
- test_ssl
Failed subtests:
- test_preauth_data_to_tls_server - test.test_ssl.TestPreHandshakeClose.test_preauth_data_to_tls_server
Sincerely, -The Buildbot
participants (1)
-
buildbot@python.org