☠ Buildbot (Python): - failed test (failure) (e5582bdbcf56033a445c7a96eca8503968771b33)
The Buildbot has detected a new failure on builder s390x Fedora Rawhide Refleaks 3.12 while building Python. Full details are available at: https://buildbot.python.org/all/#/builders/1199/builds/77
Buildbot URL: https://buildbot.python.org/all/
Worker for this Build: edelsohn-fedora-rawhide-z
Build Reason: <unknown> Blamelist:
BUILD FAILED: failed test (failure)
Summary of the results of the build (if available):
== Tests result: FAILURE then FAILURE ==
447 tests OK.
10 slowest tests:
- test_signal: 32 min 50 sec
- test_concurrent_futures: 14 min 13 sec
- test_multiprocessing_spawn: 13 min 25 sec
- test_multiprocessing_forkserver: 8 min 42 sec
- test_multiprocessing_fork: 6 min 45 sec
- test_socket: 4 min 45 sec
- test_io: 3 min 28 sec
- test_imaplib: 3 min 15 sec
- test_subprocess: 3 min 12 sec
- test_tarfile: 2 min 54 sec
1 test failed: test_tools
19 tests skipped: test.test_asyncio.test_windows_events test.test_asyncio.test_windows_utils test_devpoll test_gdb test_ioctl test_kqueue test_launcher test_msilib test_nis test_perf_profiler test_startfile test_tix test_tkinter test_ttk test_winconsoleio test_winreg test_winsound test_wmi test_zipfile64
2 re-run tests: test_import test_tools
Total duration: 44 min 54 sec
Captured traceback
Traceback (most recent call last): File "/home/dje/cpython-buildarea/3.12.edelsohn-fedora-rawhide-z.refleak/build/Lib/multiprocessing/util.py", line 300, in _run_finalizers finalizer() File "/home/dje/cpython-buildarea/3.12.edelsohn-fedora-rawhide-z.refleak/build/Lib/multiprocessing/util.py", line 224, in __call__ res = self._callback(*self._args, **self._kwargs) ^^^^^^^^^^^^^^^^^^^^^^^^^^^^^^^^^^^^^^^^^^^ File "/home/dje/cpython-buildarea/3.12.edelsohn-fedora-rawhide-z.refleak/build/Lib/multiprocessing/synchronize.py", line 87, in _cleanup sem_unlink(name) FileNotFoundError: [Errno 2] No such file or directory Traceback (most recent call last): File "/home/dje/cpython-buildarea/3.12.edelsohn-fedora-rawhide-z.refleak/build/Lib/multiprocessing/util.py", line 300, in _run_finalizers finalizer() File "/home/dje/cpython-buildarea/3.12.edelsohn-fedora-rawhide-z.refleak/build/Lib/multiprocessing/util.py", line 224, in __call__ res = self._callback(*self._args, **self._kwargs) ^^^^^^^^^^^^^^^^^^^^^^^^^^^^^^^^^^^^^^^^^^^ File "/home/dje/cpython-buildarea/3.12.edelsohn-fedora-rawhide-z.refleak/build/Lib/multiprocessing/synchronize.py", line 87, in _cleanup sem_unlink(name) FileNotFoundError: [Errno 2] No such file or directory Traceback (most recent call last): File "/home/dje/cpython-buildarea/3.12.edelsohn-fedora-rawhide-z.refleak/build/Lib/multiprocessing/util.py", line 300, in _run_finalizers finalizer() File "/home/dje/cpython-buildarea/3.12.edelsohn-fedora-rawhide-z.refleak/build/Lib/multiprocessing/util.py", line 224, in __call__ res = self._callback(*self._args, **self._kwargs) ^^^^^^^^^^^^^^^^^^^^^^^^^^^^^^^^^^^^^^^^^^^ File "/home/dje/cpython-buildarea/3.12.edelsohn-fedora-rawhide-z.refleak/build/Lib/multiprocessing/synchronize.py", line 87, in _cleanup sem_unlink(name) FileNotFoundError: [Errno 2] No such file or directory Traceback (most recent call last): File "/home/dje/cpython-buildarea/3.12.edelsohn-fedora-rawhide-z.refleak/build/Lib/multiprocessing/util.py", line 300, in _run_finalizers finalizer() File "/home/dje/cpython-buildarea/3.12.edelsohn-fedora-rawhide-z.refleak/build/Lib/multiprocessing/util.py", line 224, in __call__ res = self._callback(*self._args, **self._kwargs) ^^^^^^^^^^^^^^^^^^^^^^^^^^^^^^^^^^^^^^^^^^^ File "/home/dje/cpython-buildarea/3.12.edelsohn-fedora-rawhide-z.refleak/build/Lib/multiprocessing/synchronize.py", line 87, in _cleanup sem_unlink(name) FileNotFoundError: [Errno 2] No such file or directory Traceback (most recent call last): File "/home/dje/cpython-buildarea/3.12.edelsohn-fedora-rawhide-z.refleak/build/Lib/multiprocessing/util.py", line 300, in _run_finalizers finalizer() File "/home/dje/cpython-buildarea/3.12.edelsohn-fedora-rawhide-z.refleak/build/Lib/multiprocessing/util.py", line 224, in __call__ res = self._callback(*self._args, **self._kwargs) ^^^^^^^^^^^^^^^^^^^^^^^^^^^^^^^^^^^^^^^^^^^ File "/home/dje/cpython-buildarea/3.12.edelsohn-fedora-rawhide-z.refleak/build/Lib/multiprocessing/synchronize.py", line 87, in _cleanup sem_unlink(name) FileNotFoundError: [Errno 2] No such file or directory Traceback (most recent call last): File "/home/dje/cpython-buildarea/3.12.edelsohn-fedora-rawhide-z.refleak/build/Lib/multiprocessing/util.py", line 300, in _run_finalizers finalizer() File "/home/dje/cpython-buildarea/3.12.edelsohn-fedora-rawhide-z.refleak/build/Lib/multiprocessing/util.py", line 224, in __call__ res = self._callback(*self._args, **self._kwargs) ^^^^^^^^^^^^^^^^^^^^^^^^^^^^^^^^^^^^^^^^^^^ File "/home/dje/cpython-buildarea/3.12.edelsohn-fedora-rawhide-z.refleak/build/Lib/multiprocessing/synchronize.py", line 87, in _cleanup sem_unlink(name) FileNotFoundError: [Errno 2] No such file or directory ./home/dje/cpython-buildarea/3.12.edelsohn-fedora-rawhide-z.refleak/build/Lib/multiprocessing/popen_fork.py:66: DeprecationWarning: This process (pid=2947333) is multi-threaded, use of fork() may lead to deadlocks in the child. self.pid = os.fork() /home/dje/cpython-buildarea/3.12.edelsohn-fedora-rawhide-z.refleak/build/Lib/multiprocessing/resource_tracker.py:224: UserWarning: resource_tracker: There appear to be 6 leaked semaphore objects to clean up at shutdown warnings.warn('resource_tracker: There appear to be %d ' Traceback (most recent call last): File "/home/dje/cpython-buildarea/3.12.edelsohn-fedora-rawhide-z.refleak/build/Lib/multiprocessing/util.py", line 300, in _run_finalizers finalizer() File "/home/dje/cpython-buildarea/3.12.edelsohn-fedora-rawhide-z.refleak/build/Lib/multiprocessing/util.py", line 224, in __call__ res = self._callback(*self._args, **self._kwargs) ^^^^^^^^^^^^^^^^^^^^^^^^^^^^^^^^^^^^^^^^^^^ File "/home/dje/cpython-buildarea/3.12.edelsohn-fedora-rawhide-z.refleak/build/Lib/multiprocessing/synchronize.py", line 87, in _cleanup sem_unlink(name) FileNotFoundError: [Errno 2] No such file or directory Traceback (most recent call last): File "/home/dje/cpython-buildarea/3.12.edelsohn-fedora-rawhide-z.refleak/build/Lib/multiprocessing/util.py", line 300, in _run_finalizers finalizer() File "/home/dje/cpython-buildarea/3.12.edelsohn-fedora-rawhide-z.refleak/build/Lib/multiprocessing/util.py", line 224, in __call__ res = self._callback(*self._args, **self._kwargs) ^^^^^^^^^^^^^^^^^^^^^^^^^^^^^^^^^^^^^^^^^^^ File "/home/dje/cpython-buildarea/3.12.edelsohn-fedora-rawhide-z.refleak/build/Lib/multiprocessing/synchronize.py", line 87, in _cleanup sem_unlink(name) FileNotFoundError: [Errno 2] No such file or directory Traceback (most recent call last): File "/home/dje/cpython-buildarea/3.12.edelsohn-fedora-rawhide-z.refleak/build/Lib/multiprocessing/util.py", line 300, in _run_finalizers finalizer() File "/home/dje/cpython-buildarea/3.12.edelsohn-fedora-rawhide-z.refleak/build/Lib/multiprocessing/util.py", line 224, in __call__ res = self._callback(*self._args, **self._kwargs) ^^^^^^^^^^^^^^^^^^^^^^^^^^^^^^^^^^^^^^^^^^^ File "/home/dje/cpython-buildarea/3.12.edelsohn-fedora-rawhide-z.refleak/build/Lib/multiprocessing/synchronize.py", line 87, in _cleanup sem_unlink(name) FileNotFoundError: [Errno 2] No such file or directory Traceback (most recent call last): File "/home/dje/cpython-buildarea/3.12.edelsohn-fedora-rawhide-z.refleak/build/Lib/multiprocessing/util.py", line 300, in _run_finalizers finalizer() File "/home/dje/cpython-buildarea/3.12.edelsohn-fedora-rawhide-z.refleak/build/Lib/multiprocessing/util.py", line 224, in __call__ res = self._callback(*self._args, **self._kwargs) ^^^^^^^^^^^^^^^^^^^^^^^^^^^^^^^^^^^^^^^^^^^ File "/home/dje/cpython-buildarea/3.12.edelsohn-fedora-rawhide-z.refleak/build/Lib/multiprocessing/synchronize.py", line 87, in _cleanup sem_unlink(name) FileNotFoundError: [Errno 2] No such file or directory Traceback (most recent call last): File "/home/dje/cpython-buildarea/3.12.edelsohn-fedora-rawhide-z.refleak/build/Lib/multiprocessing/util.py", line 300, in _run_finalizers finalizer() File "/home/dje/cpython-buildarea/3.12.edelsohn-fedora-rawhide-z.refleak/build/Lib/multiprocessing/util.py", line 224, in __call__ res = self._callback(*self._args, **self._kwargs) ^^^^^^^^^^^^^^^^^^^^^^^^^^^^^^^^^^^^^^^^^^^ File "/home/dje/cpython-buildarea/3.12.edelsohn-fedora-rawhide-z.refleak/build/Lib/multiprocessing/synchronize.py", line 87, in _cleanup sem_unlink(name) FileNotFoundError: [Errno 2] No such file or directory Traceback (most recent call last): File "/home/dje/cpython-buildarea/3.12.edelsohn-fedora-rawhide-z.refleak/build/Lib/multiprocessing/util.py", line 300, in _run_finalizers finalizer() File "/home/dje/cpython-buildarea/3.12.edelsohn-fedora-rawhide-z.refleak/build/Lib/multiprocessing/util.py", line 224, in __call__ res = self._callback(*self._args, **self._kwargs) ^^^^^^^^^^^^^^^^^^^^^^^^^^^^^^^^^^^^^^^^^^^ File "/home/dje/cpython-buildarea/3.12.edelsohn-fedora-rawhide-z.refleak/build/Lib/multiprocessing/synchronize.py", line 87, in _cleanup sem_unlink(name) FileNotFoundError: [Errno 2] No such file or directory ./home/dje/cpython-buildarea/3.12.edelsohn-fedora-rawhide-z.refleak/build/Lib/multiprocessing/popen_fork.py:66: DeprecationWarning: This process (pid=2947333) is multi-threaded, use of fork() may lead to deadlocks in the child. self.pid = os.fork() /home/dje/cpython-buildarea/3.12.edelsohn-fedora-rawhide-z.refleak/build/Lib/multiprocessing/resource_tracker.py:224: UserWarning: resource_tracker: There appear to be 6 leaked semaphore objects to clean up at shutdown warnings.warn('resource_tracker: There appear to be %d ' Traceback (most recent call last): File "/home/dje/cpython-buildarea/3.12.edelsohn-fedora-rawhide-z.refleak/build/Lib/multiprocessing/util.py", line 300, in _run_finalizers finalizer() File "/home/dje/cpython-buildarea/3.12.edelsohn-fedora-rawhide-z.refleak/build/Lib/multiprocessing/util.py", line 224, in __call__ res = self._callback(*self._args, **self._kwargs) ^^^^^^^^^^^^^^^^^^^^^^^^^^^^^^^^^^^^^^^^^^^ File "/home/dje/cpython-buildarea/3.12.edelsohn-fedora-rawhide-z.refleak/build/Lib/multiprocessing/synchronize.py", line 87, in _cleanup sem_unlink(name) FileNotFoundError: [Errno 2] No such file or directory Traceback (most recent call last): File "/home/dje/cpython-buildarea/3.12.edelsohn-fedora-rawhide-z.refleak/build/Lib/multiprocessing/util.py", line 300, in _run_finalizers finalizer() File "/home/dje/cpython-buildarea/3.12.edelsohn-fedora-rawhide-z.refleak/build/Lib/multiprocessing/util.py", line 224, in __call__ res = self._callback(*self._args, **self._kwargs) ^^^^^^^^^^^^^^^^^^^^^^^^^^^^^^^^^^^^^^^^^^^ File "/home/dje/cpython-buildarea/3.12.edelsohn-fedora-rawhide-z.refleak/build/Lib/multiprocessing/synchronize.py", line 87, in _cleanup sem_unlink(name) FileNotFoundError: [Errno 2] No such file or directory Traceback (most recent call last): File "/home/dje/cpython-buildarea/3.12.edelsohn-fedora-rawhide-z.refleak/build/Lib/multiprocessing/util.py", line 300, in _run_finalizers finalizer() File "/home/dje/cpython-buildarea/3.12.edelsohn-fedora-rawhide-z.refleak/build/Lib/multiprocessing/util.py", line 224, in __call__ res = self._callback(*self._args, **self._kwargs) ^^^^^^^^^^^^^^^^^^^^^^^^^^^^^^^^^^^^^^^^^^^ File "/home/dje/cpython-buildarea/3.12.edelsohn-fedora-rawhide-z.refleak/build/Lib/multiprocessing/synchronize.py", line 87, in _cleanup sem_unlink(name) FileNotFoundError: [Errno 2] No such file or directory Traceback (most recent call last): File "/home/dje/cpython-buildarea/3.12.edelsohn-fedora-rawhide-z.refleak/build/Lib/multiprocessing/util.py", line 300, in _run_finalizers finalizer() File "/home/dje/cpython-buildarea/3.12.edelsohn-fedora-rawhide-z.refleak/build/Lib/multiprocessing/util.py", line 224, in __call__ res = self._callback(*self._args, **self._kwargs) ^^^^^^^^^^^^^^^^^^^^^^^^^^^^^^^^^^^^^^^^^^^ File "/home/dje/cpython-buildarea/3.12.edelsohn-fedora-rawhide-z.refleak/build/Lib/multiprocessing/synchronize.py", line 87, in _cleanup sem_unlink(name) FileNotFoundError: [Errno 2] No such file or directory Traceback (most recent call last): File "/home/dje/cpython-buildarea/3.12.edelsohn-fedora-rawhide-z.refleak/build/Lib/multiprocessing/util.py", line 300, in _run_finalizers finalizer() File "/home/dje/cpython-buildarea/3.12.edelsohn-fedora-rawhide-z.refleak/build/Lib/multiprocessing/util.py", line 224, in __call__ res = self._callback(*self._args, **self._kwargs) ^^^^^^^^^^^^^^^^^^^^^^^^^^^^^^^^^^^^^^^^^^^ File "/home/dje/cpython-buildarea/3.12.edelsohn-fedora-rawhide-z.refleak/build/Lib/multiprocessing/synchronize.py", line 87, in _cleanup sem_unlink(name) FileNotFoundError: [Errno 2] No such file or directory Traceback (most recent call last): File "/home/dje/cpython-buildarea/3.12.edelsohn-fedora-rawhide-z.refleak/build/Lib/multiprocessing/util.py", line 300, in _run_finalizers finalizer() File "/home/dje/cpython-buildarea/3.12.edelsohn-fedora-rawhide-z.refleak/build/Lib/multiprocessing/util.py", line 224, in __call__ res = self._callback(*self._args, **self._kwargs) ^^^^^^^^^^^^^^^^^^^^^^^^^^^^^^^^^^^^^^^^^^^ File "/home/dje/cpython-buildarea/3.12.edelsohn-fedora-rawhide-z.refleak/build/Lib/multiprocessing/synchronize.py", line 87, in _cleanup sem_unlink(name) FileNotFoundError: [Errno 2] No such file or directory ./home/dje/cpython-buildarea/3.12.edelsohn-fedora-rawhide-z.refleak/build/Lib/multiprocessing/popen_fork.py:66: DeprecationWarning: This process (pid=2947333) is multi-threaded, use of fork() may lead to deadlocks in the child. self.pid = os.fork() /home/dje/cpython-buildarea/3.12.edelsohn-fedora-rawhide-z.refleak/build/Lib/multiprocessing/resource_tracker.py:224: UserWarning: resource_tracker: There appear to be 6 leaked semaphore objects to clean up at shutdown warnings.warn('resource_tracker: There appear to be %d ' Traceback (most recent call last): File "/home/dje/cpython-buildarea/3.12.edelsohn-fedora-rawhide-z.refleak/build/Lib/multiprocessing/util.py", line 300, in _run_finalizers finalizer() File "/home/dje/cpython-buildarea/3.12.edelsohn-fedora-rawhide-z.refleak/build/Lib/multiprocessing/util.py", line 224, in __call__ res = self._callback(*self._args, **self._kwargs) ^^^^^^^^^^^^^^^^^^^^^^^^^^^^^^^^^^^^^^^^^^^ File "/home/dje/cpython-buildarea/3.12.edelsohn-fedora-rawhide-z.refleak/build/Lib/multiprocessing/synchronize.py", line 87, in _cleanup sem_unlink(name) FileNotFoundError: [Errno 2] No such file or directory Traceback (most recent call last): File "/home/dje/cpython-buildarea/3.12.edelsohn-fedora-rawhide-z.refleak/build/Lib/multiprocessing/util.py", line 300, in _run_finalizers finalizer() File "/home/dje/cpython-buildarea/3.12.edelsohn-fedora-rawhide-z.refleak/build/Lib/multiprocessing/util.py", line 224, in __call__ res = self._callback(*self._args, **self._kwargs) ^^^^^^^^^^^^^^^^^^^^^^^^^^^^^^^^^^^^^^^^^^^ File "/home/dje/cpython-buildarea/3.12.edelsohn-fedora-rawhide-z.refleak/build/Lib/multiprocessing/synchronize.py", line 87, in _cleanup sem_unlink(name) FileNotFoundError: [Errno 2] No such file or directory Traceback (most recent call last): File "/home/dje/cpython-buildarea/3.12.edelsohn-fedora-rawhide-z.refleak/build/Lib/multiprocessing/util.py", line 300, in _run_finalizers finalizer() File "/home/dje/cpython-buildarea/3.12.edelsohn-fedora-rawhide-z.refleak/build/Lib/multiprocessing/util.py", line 224, in __call__ res = self._callback(*self._args, **self._kwargs) ^^^^^^^^^^^^^^^^^^^^^^^^^^^^^^^^^^^^^^^^^^^ File "/home/dje/cpython-buildarea/3.12.edelsohn-fedora-rawhide-z.refleak/build/Lib/multiprocessing/synchronize.py", line 87, in _cleanup sem_unlink(name) FileNotFoundError: [Errno 2] No such file or directory Traceback (most recent call last): File "/home/dje/cpython-buildarea/3.12.edelsohn-fedora-rawhide-z.refleak/build/Lib/multiprocessing/util.py", line 300, in _run_finalizers finalizer() File "/home/dje/cpython-buildarea/3.12.edelsohn-fedora-rawhide-z.refleak/build/Lib/multiprocessing/util.py", line 224, in __call__ res = self._callback(*self._args, **self._kwargs) ^^^^^^^^^^^^^^^^^^^^^^^^^^^^^^^^^^^^^^^^^^^ File "/home/dje/cpython-buildarea/3.12.edelsohn-fedora-rawhide-z.refleak/build/Lib/multiprocessing/synchronize.py", line 87, in _cleanup sem_unlink(name) FileNotFoundError: [Errno 2] No such file or directory Traceback (most recent call last): File "/home/dje/cpython-buildarea/3.12.edelsohn-fedora-rawhide-z.refleak/build/Lib/multiprocessing/util.py", line 300, in _run_finalizers finalizer() File "/home/dje/cpython-buildarea/3.12.edelsohn-fedora-rawhide-z.refleak/build/Lib/multiprocessing/util.py", line 224, in __call__ res = self._callback(*self._args, **self._kwargs) ^^^^^^^^^^^^^^^^^^^^^^^^^^^^^^^^^^^^^^^^^^^ File "/home/dje/cpython-buildarea/3.12.edelsohn-fedora-rawhide-z.refleak/build/Lib/multiprocessing/synchronize.py", line 87, in _cleanup sem_unlink(name) FileNotFoundError: [Errno 2] No such file or directory Traceback (most recent call last): File "/home/dje/cpython-buildarea/3.12.edelsohn-fedora-rawhide-z.refleak/build/Lib/multiprocessing/util.py", line 300, in _run_finalizers finalizer() File "/home/dje/cpython-buildarea/3.12.edelsohn-fedora-rawhide-z.refleak/build/Lib/multiprocessing/util.py", line 224, in __call__ res = self._callback(*self._args, **self._kwargs) ^^^^^^^^^^^^^^^^^^^^^^^^^^^^^^^^^^^^^^^^^^^ File "/home/dje/cpython-buildarea/3.12.edelsohn-fedora-rawhide-z.refleak/build/Lib/multiprocessing/synchronize.py", line 87, in _cleanup sem_unlink(name) FileNotFoundError: [Errno 2] No such file or directory ./home/dje/cpython-buildarea/3.12.edelsohn-fedora-rawhide-z.refleak/build/Lib/multiprocessing/popen_fork.py:66: DeprecationWarning: This process (pid=2947333) is multi-threaded, use of fork() may lead to deadlocks in the child. self.pid = os.fork() /home/dje/cpython-buildarea/3.12.edelsohn-fedora-rawhide-z.refleak/build/Lib/multiprocessing/resource_tracker.py:224: UserWarning: resource_tracker: There appear to be 6 leaked semaphore objects to clean up at shutdown warnings.warn('resource_tracker: There appear to be %d ' Traceback (most recent call last): File "/home/dje/cpython-buildarea/3.12.edelsohn-fedora-rawhide-z.refleak/build/Lib/multiprocessing/util.py", line 300, in _run_finalizers finalizer() File "/home/dje/cpython-buildarea/3.12.edelsohn-fedora-rawhide-z.refleak/build/Lib/multiprocessing/util.py", line 224, in __call__ res = self._callback(*self._args, **self._kwargs) ^^^^^^^^^^^^^^^^^^^^^^^^^^^^^^^^^^^^^^^^^^^ File "/home/dje/cpython-buildarea/3.12.edelsohn-fedora-rawhide-z.refleak/build/Lib/multiprocessing/synchronize.py", line 87, in _cleanup sem_unlink(name) FileNotFoundError: [Errno 2] No such file or directory Traceback (most recent call last): File "/home/dje/cpython-buildarea/3.12.edelsohn-fedora-rawhide-z.refleak/build/Lib/multiprocessing/util.py", line 300, in _run_finalizers finalizer() File "/home/dje/cpython-buildarea/3.12.edelsohn-fedora-rawhide-z.refleak/build/Lib/multiprocessing/util.py", line 224, in __call__ res = self._callback(*self._args, **self._kwargs) ^^^^^^^^^^^^^^^^^^^^^^^^^^^^^^^^^^^^^^^^^^^ File "/home/dje/cpython-buildarea/3.12.edelsohn-fedora-rawhide-z.refleak/build/Lib/multiprocessing/synchronize.py", line 87, in _cleanup sem_unlink(name) FileNotFoundError: [Errno 2] No such file or directory Traceback (most recent call last): File "/home/dje/cpython-buildarea/3.12.edelsohn-fedora-rawhide-z.refleak/build/Lib/multiprocessing/util.py", line 300, in _run_finalizers finalizer() File "/home/dje/cpython-buildarea/3.12.edelsohn-fedora-rawhide-z.refleak/build/Lib/multiprocessing/util.py", line 224, in __call__ res = self._callback(*self._args, **self._kwargs) ^^^^^^^^^^^^^^^^^^^^^^^^^^^^^^^^^^^^^^^^^^^ File "/home/dje/cpython-buildarea/3.12.edelsohn-fedora-rawhide-z.refleak/build/Lib/multiprocessing/synchronize.py", line 87, in _cleanup sem_unlink(name) FileNotFoundError: [Errno 2] No such file or directory Traceback (most recent call last): File "/home/dje/cpython-buildarea/3.12.edelsohn-fedora-rawhide-z.refleak/build/Lib/multiprocessing/util.py", line 300, in _run_finalizers finalizer() File "/home/dje/cpython-buildarea/3.12.edelsohn-fedora-rawhide-z.refleak/build/Lib/multiprocessing/util.py", line 224, in __call__ res = self._callback(*self._args, **self._kwargs) ^^^^^^^^^^^^^^^^^^^^^^^^^^^^^^^^^^^^^^^^^^^ File "/home/dje/cpython-buildarea/3.12.edelsohn-fedora-rawhide-z.refleak/build/Lib/multiprocessing/synchronize.py", line 87, in _cleanup sem_unlink(name) FileNotFoundError: [Errno 2] No such file or directory Traceback (most recent call last): File "/home/dje/cpython-buildarea/3.12.edelsohn-fedora-rawhide-z.refleak/build/Lib/multiprocessing/util.py", line 300, in _run_finalizers finalizer() File "/home/dje/cpython-buildarea/3.12.edelsohn-fedora-rawhide-z.refleak/build/Lib/multiprocessing/util.py", line 224, in __call__ res = self._callback(*self._args, **self._kwargs) ^^^^^^^^^^^^^^^^^^^^^^^^^^^^^^^^^^^^^^^^^^^ File "/home/dje/cpython-buildarea/3.12.edelsohn-fedora-rawhide-z.refleak/build/Lib/multiprocessing/synchronize.py", line 87, in _cleanup sem_unlink(name) FileNotFoundError: [Errno 2] No such file or directory Traceback (most recent call last): File "/home/dje/cpython-buildarea/3.12.edelsohn-fedora-rawhide-z.refleak/build/Lib/multiprocessing/util.py", line 300, in _run_finalizers finalizer() File "/home/dje/cpython-buildarea/3.12.edelsohn-fedora-rawhide-z.refleak/build/Lib/multiprocessing/util.py", line 224, in __call__ res = self._callback(*self._args, **self._kwargs) ^^^^^^^^^^^^^^^^^^^^^^^^^^^^^^^^^^^^^^^^^^^ File "/home/dje/cpython-buildarea/3.12.edelsohn-fedora-rawhide-z.refleak/build/Lib/multiprocessing/synchronize.py", line 87, in _cleanup sem_unlink(name) FileNotFoundError: [Errno 2] No such file or directory ./home/dje/cpython-buildarea/3.12.edelsohn-fedora-rawhide-z.refleak/build/Lib/multiprocessing/popen_fork.py:66: DeprecationWarning: This process (pid=2947333) is multi-threaded, use of fork() may lead to deadlocks in the child. self.pid = os.fork() /home/dje/cpython-buildarea/3.12.edelsohn-fedora-rawhide-z.refleak/build/Lib/multiprocessing/resource_tracker.py:224: UserWarning: resource_tracker: There appear to be 6 leaked semaphore objects to clean up at shutdown warnings.warn('resource_tracker: There appear to be %d ' Traceback (most recent call last): File "/home/dje/cpython-buildarea/3.12.edelsohn-fedora-rawhide-z.refleak/build/Lib/multiprocessing/util.py", line 300, in _run_finalizers finalizer() File "/home/dje/cpython-buildarea/3.12.edelsohn-fedora-rawhide-z.refleak/build/Lib/multiprocessing/util.py", line 224, in __call__ res = self._callback(*self._args, **self._kwargs) ^^^^^^^^^^^^^^^^^^^^^^^^^^^^^^^^^^^^^^^^^^^ File "/home/dje/cpython-buildarea/3.12.edelsohn-fedora-rawhide-z.refleak/build/Lib/multiprocessing/synchronize.py", line 87, in _cleanup sem_unlink(name) FileNotFoundError: [Errno 2] No such file or directory Traceback (most recent call last): File "/home/dje/cpython-buildarea/3.12.edelsohn-fedora-rawhide-z.refleak/build/Lib/multiprocessing/util.py", line 300, in _run_finalizers finalizer() File "/home/dje/cpython-buildarea/3.12.edelsohn-fedora-rawhide-z.refleak/build/Lib/multiprocessing/util.py", line 224, in __call__ res = self._callback(*self._args, **self._kwargs) ^^^^^^^^^^^^^^^^^^^^^^^^^^^^^^^^^^^^^^^^^^^ File "/home/dje/cpython-buildarea/3.12.edelsohn-fedora-rawhide-z.refleak/build/Lib/multiprocessing/synchronize.py", line 87, in _cleanup sem_unlink(name) FileNotFoundError: [Errno 2] No such file or directory Traceback (most recent call last): File "/home/dje/cpython-buildarea/3.12.edelsohn-fedora-rawhide-z.refleak/build/Lib/multiprocessing/util.py", line 300, in _run_finalizers finalizer() File "/home/dje/cpython-buildarea/3.12.edelsohn-fedora-rawhide-z.refleak/build/Lib/multiprocessing/util.py", line 224, in __call__ res = self._callback(*self._args, **self._kwargs) ^^^^^^^^^^^^^^^^^^^^^^^^^^^^^^^^^^^^^^^^^^^ File "/home/dje/cpython-buildarea/3.12.edelsohn-fedora-rawhide-z.refleak/build/Lib/multiprocessing/synchronize.py", line 87, in _cleanup sem_unlink(name) FileNotFoundError: [Errno 2] No such file or directory Traceback (most recent call last): File "/home/dje/cpython-buildarea/3.12.edelsohn-fedora-rawhide-z.refleak/build/Lib/multiprocessing/util.py", line 300, in _run_finalizers finalizer() File "/home/dje/cpython-buildarea/3.12.edelsohn-fedora-rawhide-z.refleak/build/Lib/multiprocessing/util.py", line 224, in __call__ res = self._callback(*self._args, **self._kwargs) ^^^^^^^^^^^^^^^^^^^^^^^^^^^^^^^^^^^^^^^^^^^ File "/home/dje/cpython-buildarea/3.12.edelsohn-fedora-rawhide-z.refleak/build/Lib/multiprocessing/synchronize.py", line 87, in _cleanup sem_unlink(name) FileNotFoundError: [Errno 2] No such file or directory Traceback (most recent call last): File "/home/dje/cpython-buildarea/3.12.edelsohn-fedora-rawhide-z.refleak/build/Lib/multiprocessing/util.py", line 300, in _run_finalizers finalizer() File "/home/dje/cpython-buildarea/3.12.edelsohn-fedora-rawhide-z.refleak/build/Lib/multiprocessing/util.py", line 224, in __call__ res = self._callback(*self._args, **self._kwargs) ^^^^^^^^^^^^^^^^^^^^^^^^^^^^^^^^^^^^^^^^^^^ File "/home/dje/cpython-buildarea/3.12.edelsohn-fedora-rawhide-z.refleak/build/Lib/multiprocessing/synchronize.py", line 87, in _cleanup sem_unlink(name) FileNotFoundError: [Errno 2] No such file or directory Traceback (most recent call last): File "/home/dje/cpython-buildarea/3.12.edelsohn-fedora-rawhide-z.refleak/build/Lib/multiprocessing/util.py", line 300, in _run_finalizers finalizer() File "/home/dje/cpython-buildarea/3.12.edelsohn-fedora-rawhide-z.refleak/build/Lib/multiprocessing/util.py", line 224, in __call__ res = self._callback(*self._args, **self._kwargs) ^^^^^^^^^^^^^^^^^^^^^^^^^^^^^^^^^^^^^^^^^^^ File "/home/dje/cpython-buildarea/3.12.edelsohn-fedora-rawhide-z.refleak/build/Lib/multiprocessing/synchronize.py", line 87, in _cleanup sem_unlink(name) FileNotFoundError: [Errno 2] No such file or directory .
TracebackTests.test_import_bug) ... ok
Traceback (most recent call last): File "/home/dje/cpython-buildarea/3.12.edelsohn-fedora-rawhide-z.refleak/build/Lib/test/test_tools/test_freeze.py", line 27, in test_freeze_simple_script outdir, scriptfile, python = helper.prepare(script, outdir) ^^^^^^^^^^^^^^^^^^^^^^^^^^^^^^ File "/home/dje/cpython-buildarea/3.12.edelsohn-fedora-rawhide-z.refleak/build/Tools/freeze/test/freeze.py", line 184, in prepare _run_quiet([MAKE, '-C', builddir, 'install']) File "/home/dje/cpython-buildarea/3.12.edelsohn-fedora-rawhide-z.refleak/build/Tools/freeze/test/freeze.py", line 25, in _run_quiet return subprocess.run( ^^^^^^^^^^^^^^^ File "/home/dje/cpython-buildarea/3.12.edelsohn-fedora-rawhide-z.refleak/build/Lib/subprocess.py", line 571, in run raise CalledProcessError(retcode, process.args, subprocess.CalledProcessError: Command '['/usr/bin/make', '-C', '/tmp/tmp5pqb1ggu/python-build', 'install']' returned non-zero exit status 2.
TracebackTests.test_broken_parent_from) ... ok
TracebackTests.test_exec_failure) ... ok
Traceback (most recent call last): File "/home/dje/cpython-buildarea/3.12.edelsohn-fedora-rawhide-z.refleak/build/Lib/test/test_tools/test_freeze.py", line 27, in test_freeze_simple_script outdir, scriptfile, python = helper.prepare(script, outdir) ^^^^^^^^^^^^^^^^^^^^^^^^^^^^^^ File "/home/dje/cpython-buildarea/3.12.edelsohn-fedora-rawhide-z.refleak/build/Tools/freeze/test/freeze.py", line 184, in prepare _run_quiet([MAKE, '-C', builddir, 'install']) File "/home/dje/cpython-buildarea/3.12.edelsohn-fedora-rawhide-z.refleak/build/Tools/freeze/test/freeze.py", line 36, in _run_quiet print(err.stdout) OSError: [Errno 28] No space left on device
TracebackTests.test_exec_failure_nested) ... ok
TracebackTests.test_broken_parent) ... ok
TracebackTests.test_nonexistent_module_nested) ... ok
TracebackTests.test_broken_submodule) ... ok
TracebackTests.test_syntax_error) ... ok
Traceback (most recent call last): File "/home/dje/cpython-buildarea/3.12.edelsohn-fedora-rawhide-z.refleak/build/Tools/freeze/test/freeze.py", line 25, in _run_quiet return subprocess.run( ^^^^^^^^^^^^^^^ File "/home/dje/cpython-buildarea/3.12.edelsohn-fedora-rawhide-z.refleak/build/Lib/subprocess.py", line 571, in run raise CalledProcessError(retcode, process.args, subprocess.CalledProcessError: Command '['/usr/bin/make', '-C', '/tmp/test_python_pc2gw8bg/tmppk46chxz/python-build', 'install']' returned non-zero exit status 2.
TracebackTests.test_nonexistent_module) ... ok
TracebackTests.test_unencodable_filename) ... ok
TracebackTests.test_broken_from) ... ok
Test report
Failed tests:
- test_tools
Failed subtests:
- test_freeze_simple_script - test.test_tools.test_freeze.TestFreeze.test_freeze_simple_script
Test leaking resources:
- test_import: memory blocks
- test_import: references
Sincerely, -The Buildbot
participants (1)
-
buildbot@python.org