Buildbot failure in Python on AMD64 FreeBSD Non-Debug 3.x
The Buildbot has detected a new failure on builder AMD64 FreeBSD Non-Debug 3.x while building python/cpython. Full details are available at: https://buildbot.python.org/all/#builders/214/builds/313
Buildbot URL: https://buildbot.python.org/all/
Worker for this Build: koobs-freebsd-9e36
Build Reason: <unknown> Blamelist: Andy Lester <andy@petdance.com>, Brandt Bucher <brandtbucher@gmail.com>, Cheryl Sabella <cheryl.sabella@gmail.com>, Dong-hee Na <donghee.na92@gmail.com>, Hai Shi <shihai1992@gmail.com>, Ian Norton <inorton@gmail.com>, Jeroen Demeyer <jeroen.k.demeyer@gmail.com>, Kyle Meyer <kyle@kyleam.com>, Nathaniel J. Smith <njs@pobox.com>, Saiyang Gou <gousaiyang@163.com>, Serhiy Storchaka <storchaka@gmail.com>, Thomas Moreau <thomas.moreau.2010@gmail.com>, Victor Stinner <vstinner@python.org>, Vinay Sajip <vinay_sajip@yahoo.co.uk>, Vlad Emelianov <volshebnyi@gmail.com>, William Chargin <wchargin@gmail.com>, idomic <michael.ido@gmail.com>, mpheath <58158242+mpheath@users.noreply.github.com>
BUILD FAILED: failed test (failure)
Summary of the results of the build (if available):
== Tests result: FAILURE then FAILURE ==
398 tests OK.
10 slowest tests:
- test_multiprocessing_spawn: 4 min 54 sec
- test_concurrent_futures: 4 min 34 sec
- test_tokenize: 3 min 57 sec
- test_multiprocessing_forkserver: 2 min 44 sec
- test_pydoc: 2 min 43 sec
- test_unparse: 2 min 41 sec
- test_largefile: 2 min 12 sec
- test_multiprocessing_fork: 1 min 56 sec
- test_asyncio: 1 min 56 sec
- test_unicodedata: 1 min 45 sec
1 test failed: test_asyncio
21 tests skipped: test_dbm_gnu test_devpoll test_epoll test_gdb test_idle test_ioctl test_msilib test_ossaudiodev test_spwd test_sqlite test_startfile test_tcl test_tix test_tk test_ttk_guionly test_ttk_textonly test_turtle test_winconsoleio test_winreg test_winsound test_zipfile64
1 re-run test: test_asyncio
Total duration: 19 min 49 sec
Captured traceback
Traceback (most recent call last): File "/usr/home/buildbot/python/3.x.koobs-freebsd-9e36.nondebug/build/Lib/test/test_asyncio/test_events.py", line 1106, in test_create_server_ssl_verified proto.transport.close() AttributeError: 'NoneType' object has no attribute 'close'
Traceback (most recent call last): File "/usr/home/buildbot/python/3.x.koobs-freebsd-9e36.nondebug/build/Lib/test/test_asyncio/test_tasks.py", line 3213, in test_run_coroutine_threadsafe_with_timeout self.loop.run_until_complete(future) AssertionError: TimeoutError not raised
Test report
Failed tests:
- test_asyncio
Failed subtests:
- test_create_server_ssl_verified - test.test_asyncio.test_events.SelectEventLoopTests
Sincerely, -The Buildbot
participants (1)
-
buildbot@python.org