Buildbot failure in Python on PPC64LE RHEL8 3.9
The Buildbot has detected a failed build on builder PPC64LE RHEL8 3.9 while building python/cpython. Full details are available at: https://buildbot.python.org/all/#builders/250/builds/122
Buildbot URL: https://buildbot.python.org/all/
Worker for this Build: cstratak-RHEL8-ppc64le
Build Reason: <unknown> Blamelist: Miss Islington (bot) <31488909+miss-islington@users.noreply.github.com>
BUILD FAILED: failed test (failure) uploading test-results.xml (failure)
Summary of the results of the build (if available):
==
Captured traceback
Traceback (most recent call last): File "/home/buildbot/buildarea/3.9.cstratak-RHEL8-ppc64le/build/Lib/test/test_asyncio/test_events.py", line 620, in test_create_ssl_connection self._test_create_ssl_connection(httpd, create_connection, File "/home/buildbot/buildarea/3.9.cstratak-RHEL8-ppc64le/build/Lib/test/test_asyncio/test_events.py", line 579, in _test_create_ssl_connection self._basetest_create_ssl_connection(conn_fut, check_sockname, File "/home/buildbot/buildarea/3.9.cstratak-RHEL8-ppc64le/build/Lib/test/test_asyncio/test_events.py", line 571, in _basetest_create_ssl_connection self.check_ssl_extra_info(tr, check_sockname, peername) File "/home/buildbot/buildarea/3.9.cstratak-RHEL8-ppc64le/build/Lib/test/test_asyncio/test_events.py", line 535, in check_ssl_extra_info self.assertIsNotNone(client.get_extra_info('sockname')) AssertionError: unexpectedly None
Test report
Failed tests:
- test_asyncio
Failed subtests:
- test_create_ssl_connection - test.test_asyncio.test_events.SelectEventLoopTests
Sincerely, -The Buildbot
participants (1)
-
buildbot@python.org