☠ Buildbot (Python): python/cpython - failed test (failure) (main)
The Buildbot has detected a new failure on builder ARM Raspbian 3.x while building python/cpython. Full details are available at: https://buildbot.python.org/all/#builders/424/builds/2696
Buildbot URL: https://buildbot.python.org/all/
Worker for this Build: gps-raspbian
Build Reason: <unknown> Blamelist: 180909 <734461790@qq.com>, Anh71me <iyumelive@gmail.com>, Eric Wieser <wieser.eric@gmail.com>, Marc Monfort <marc.monfort@gmail.com>, Nikita Sobolev <mail@sobolevn.me>, Noam Cohen <noam@noam.me>, Serhiy Storchaka <storchaka@gmail.com>, Stanley <46876382+slateny@users.noreply.github.com>, Victor Stinner <vstinner@python.org>, andrei kulakov <andrei.avk@gmail.com>, zikcheng <surfingbyte@gmail.com>
BUILD FAILED: failed test (failure)
Summary of the results of the build (if available):
== Tests result: FAILURE then FAILURE ==
417 tests OK.
10 slowest tests:
- test_largefile: 5 min 6 sec
- test_multiprocessing_spawn: 4 min 57 sec
- test_venv: 3 min 53 sec
- test_concurrent_futures: 3 min 4 sec
- test_asyncio: 2 min 49 sec
- test_lib2to3: 1 min 57 sec
- test_tokenize: 1 min 57 sec
- test_multiprocessing_forkserver: 1 min 52 sec
- test_compileall: 1 min 47 sec
- test_unittest: 1 min 46 sec
1 test failed: test_unicode
19 tests skipped: test_devpoll test_idle test_ioctl test_kqueue test_launcher test_msilib test_perf_profiler test_startfile test_tcl test_tix test_tkinter test_ttk test_ttk_textonly test_turtle test_winconsoleio test_winreg test_winsound test_wmi test_zipfile64
1 re-run test: test_unicode
Total duration: 27 min 8 sec
Captured traceback
Traceback (most recent call last): File "/var/lib/buildbot/workers/3.x.gps-raspbian.nondebug/build/Lib/test/test_unicode.py", line 2817, in test_from_format self.assertRegex(p_format1, p_format_regex) AssertionError: Regex didn't match: '^0x[a-zA-Z0-9]{8,}$' not found in '0x3dd984'
Test report
Failed tests:
- test_unicode
Failed subtests:
- test_from_format - test.test_unicode.CAPITest.test_from_format
Sincerely, -The Buildbot
participants (1)
-
buildbot@python.org