☠ Buildbot (Python): python/cpython - failed test (failure) (main)
The Buildbot has detected a new failure on builder ARM Raspbian 3.x while building python/cpython. Full details are available at: https://buildbot.python.org/all/#/builders/424/builds/4611
Buildbot URL: https://buildbot.python.org/all/
Worker for this Build: gps-raspbian
Build Reason: <unknown> Blamelist: Erlend E. Aasland <erlend@python.org>, Kamil Turek <kamil.turek@hotmail.com>, Serhiy Storchaka <storchaka@gmail.com>, Tomas R <tomas.roun8@gmail.com>
BUILD FAILED: failed test (failure)
Summary of the results of the build (if available):
== Tests result: ENV CHANGED ==
427 tests OK.
10 slowest tests:
- test_concurrent_futures: 11 min 37 sec
- test_venv: 10 min 32 sec
- test_largefile: 8 min 31 sec
- test_math: 4 min 26 sec
- test_multiprocessing_spawn: 4 min 23 sec
- test_shelve: 3 min 23 sec
- test_faulthandler: 2 min 37 sec
- test_hashlib: 2 min 12 sec
- test_peg_generator: 2 min 10 sec
- test_zipfile: 2 min 4 sec
1 test altered the execution environment: test.test_asyncio.test_unix_events
19 tests skipped: test.test_asyncio.test_windows_events test.test_asyncio.test_windows_utils test_devpoll test_idle test_ioctl test_kqueue test_launcher test_perf_profiler test_startfile test_tcl test_tkinter test_ttk test_ttk_textonly test_turtle test_winconsoleio test_winreg test_winsound test_wmi test_zipfile64
Total duration: 38 min 46 sec
Captured traceback
remote: Enumerating objects: 17, done.
remote: Counting objects: 5% (1/17)
remote: Counting objects: 11% (2/17)
remote: Counting objects: 17% (3/17)
remote: Counting objects: 23% (4/17)
remote: Counting objects: 29% (5/17)
remote: Counting objects: 35% (6/17)
remote: Counting objects: 41% (7/17)
remote: Counting objects: 47% (8/17)
remote: Counting objects: 52% (9/17)
remote: Counting objects: 58% (10/17)
remote: Counting objects: 64% (11/17)
remote: Counting objects: 70% (12/17)
remote: Counting objects: 76% (13/17)
remote: Counting objects: 82% (14/17)
remote: Counting objects: 88% (15/17)
remote: Counting objects: 94% (16/17)
remote: Counting objects: 100% (17/17)
remote: Counting objects: 100% (17/17), done.
remote: Compressing objects: 6% (1/15)
remote: Compressing objects: 13% (2/15)
remote: Compressing objects: 20% (3/15)
remote: Compressing objects: 26% (4/15)
remote: Compressing objects: 33% (5/15)
remote: Compressing objects: 40% (6/15)
remote: Compressing objects: 46% (7/15)
remote: Compressing objects: 53% (8/15)
remote: Compressing objects: 60% (9/15)
remote: Compressing objects: 66% (10/15)
remote: Compressing objects: 73% (11/15)
remote: Compressing objects: 80% (12/15)
remote: Compressing objects: 86% (13/15)
remote: Compressing objects: 93% (14/15)
remote: Compressing objects: 100% (15/15)
remote: Compressing objects: 100% (15/15), done.
remote: Total 17 (delta 2), reused 4 (delta 2), pack-reused 0
From https://github.com/python/cpython
- branch main -> FETCH_HEAD Note: switching to '33cb0b06efe33968eb32463fa1b02b5a729a17f8'.
You are in 'detached HEAD' state. You can look around, make experimental changes and commit them, and you can discard any commits you make in this state without impacting any branches by switching back to a branch.
If you want to create a new branch to retain commits you create, you may do so (now or later) by using -c with the switch command. Example:
git switch -c <new-branch-name>
Or undo this operation with:
git switch -
Turn off this advice by setting config variable advice.detachedHead to false
HEAD is now at 33cb0b06ef gh-95065: Add Argument Clinic support for deprecating positional use of parameters (#95151) Switched to and reset branch 'main'
./Modules/_testcapi/heaptype_relative.c: In function ‘make_sized_heaptypes’: ./Modules/_testcapi/heaptype_relative.c:62:28: warning: cast from pointer to integer of different size [-Wpointer-to-int-cast] 62 | (unsigned long long)data_ptr, | ^
make: *** [Makefile:2017: buildbottest] Error 3
Test report
Sincerely, -The BuildbotThe Buildbot has detected a new failure on builder s390x RHEL8 LTO + PGO 3.x while building python/cpython. Full details are available at: https://buildbot.python.org/all/#/builders/442/builds/4727
Buildbot URL: https://buildbot.python.org/all/
Worker for this Build: edelsohn-rhel8-z
Build Reason: <unknown> Blamelist: Adam Turner <9087854+AA-Turner@users.noreply.github.com>, Alex Waygood <Alex.Waygood@Gmail.com>, Alexandru Mărășteanu <alexei@users.noreply.github.com>, Anders Kaseorg <andersk@mit.edu>, Barney Gale <barney.gale@gmail.com>, Brandt Bucher <brandtbucher@microsoft.com>, Charlie Zhao <zhaoyu_hit@qq.com>, Christopher Chavez <chrischavez@gmx.us>, Daniele Procida <daniele@vurt.org>, Dong-hee Na <donghee.na@python.org>, Eric Snow <ericsnowcurrently@gmail.com>, Erlend E. Aasland <erlend@python.org>, Felipe A. Hernandez <ergoithz@gmail.com>, Furkan Onder <furkanonder@protonmail.com>, Georg Brandl <georg@python.org>, Guido van Rossum <guido@python.org>, Hugo van Kemenade <hugovk@users.noreply.github.com>, Illia Volochii <illia.volochii@gmail.com>, Inada Naoki <songofacandy@gmail.com>, Irit Katriel <1055913+iritkatriel@users.noreply.github.com>, Ivin Lee <62840497+rdrf2838@users.noreply.github.com>, Jacob Walls <jacobtylerwalls@gmail.com>, James Cave <jcave137@gmail.com>, James Hil ton-Balfe <gobot1234yt@gmail.com>, János Kukovecz <kukoveczjanos@gmail.com>, Kamil Turek <kamil.turek@hotmail.com>, Konstantin <kpp.live+github@gmail.com>, Kumar Aditya <kumaraditya@python.org>, Mark Shannon <mark@hotpy.org>, Michael The <michael-the1@users.noreply.github.com>, Ned Deily <nad@python.org>, Pablo Galindo Salgado <Pablogsal@gmail.com>, Pieter Eendebak <pieter.eendebak@gmail.com>, Rakesh Sabale <102187286+ghubrakesh@users.noreply.github.com>, Roman Yurchak <rth.yurchak@gmail.com>, Serhiy Storchaka <storchaka@gmail.com>, Terry Jan Reedy <tjreedy@udel.edu>, Tian Gao <gaogaotiantian@hotmail.com>, Tom Niget <zippedfire@free.fr>, Tomas R <tomas.roun8@gmail.com>, Victor Stinner <vstinner@python.org>, cocoatomo <cocoatomo77@gmail.com>, da-woods <dw-git@d-woods.co.uk>, justdan6 <134341009+justdan6@users.noreply.github.com>, opavliuk <40970635+opavlyuk@users.noreply.github.com>, shailshouryya <42100758+shailshouryya@users.noreply.github.com>
BUILD FAILED: failed test (failure) uploading test-results.xml (failure)
Summary of the results of the build (if available):
==
Captured traceback
remote: Enumerating objects: 17, done.
remote: Counting objects: 5% (1/17)
remote: Counting objects: 11% (2/17)
remote: Counting objects: 17% (3/17)
remote: Counting objects: 23% (4/17)
remote: Counting objects: 29% (5/17)
remote: Counting objects: 35% (6/17)
remote: Counting objects: 41% (7/17)
remote: Counting objects: 47% (8/17)
remote: Counting objects: 52% (9/17)
remote: Counting objects: 58% (10/17)
remote: Counting objects: 64% (11/17)
remote: Counting objects: 70% (12/17)
remote: Counting objects: 76% (13/17)
remote: Counting objects: 82% (14/17)
remote: Counting objects: 88% (15/17)
remote: Counting objects: 94% (16/17)
remote: Counting objects: 100% (17/17)
remote: Counting objects: 100% (17/17), done.
remote: Compressing objects: 6% (1/15)
remote: Compressing objects: 13% (2/15)
remote: Compressing objects: 20% (3/15)
remote: Compressing objects: 26% (4/15)
remote: Compressing objects: 33% (5/15)
remote: Compressing objects: 40% (6/15)
remote: Compressing objects: 46% (7/15)
remote: Compressing objects: 53% (8/15)
remote: Compressing objects: 60% (9/15)
remote: Compressing objects: 66% (10/15)
remote: Compressing objects: 73% (11/15)
remote: Compressing objects: 80% (12/15)
remote: Compressing objects: 86% (13/15)
remote: Compressing objects: 93% (14/15)
remote: Compressing objects: 100% (15/15)
remote: Compressing objects: 100% (15/15), done.
remote: Total 17 (delta 2), reused 4 (delta 2), pack-reused 0
From https://github.com/python/cpython
- branch main -> FETCH_HEAD Note: switching to '33cb0b06efe33968eb32463fa1b02b5a729a17f8'.
You are in 'detached HEAD' state. You can look around, make experimental changes and commit them, and you can discard any commits you make in this state without impacting any branches by switching back to a branch.
If you want to create a new branch to retain commits you create, you may do so (now or later) by using -c with the switch command. Example:
git switch -c <new-branch-name>
Or undo this operation with:
git switch -
Turn off this advice by setting config variable advice.detachedHead to false
HEAD is now at 33cb0b06ef gh-95065: Add Argument Clinic support for deprecating positional use of parameters (#95151) Switched to and reset branch 'main'
find: ‘build’: No such file or directory find: ‘build’: No such file or directory find: ‘build’: No such file or directory find: ‘build’: No such file or directory make[2]: [Makefile:2794: clean-retain-profile] Error 1 (ignored) ./Modules/_decimal/libmpdec/context.c:57: warning: mpd_setminalloc: ignoring request to set MPD_MINALLOC a second time
./Modules/_decimal/libmpdec/context.c:57: warning: mpd_setminalloc: ignoring request to set MPD_MINALLOC a second time
Timeout (0:15:00)! Thread 0x000003ffb2c77730 (most recent call first): File "/home/dje/cpython-buildarea/3.x.edelsohn-rhel8-z.lto-pgo/build/Lib/selectors.py", line 398 in select File "/home/dje/cpython-buildarea/3.x.edelsohn-rhel8-z.lto-pgo/build/Lib/subprocess.py", line 2108 in _communicate File "/home/dje/cpython-buildarea/3.x.edelsohn-rhel8-z.lto-pgo/build/Lib/subprocess.py", line 1209 in communicate File "/home/dje/cpython-buildarea/3.x.edelsohn-rhel8-z.lto-pgo/build/Lib/subprocess.py", line 550 in run File "/home/dje/cpython-buildarea/3.x.edelsohn-rhel8-z.lto-pgo/build/Tools/freeze/test/freeze.py", line 25 in _run_quiet File "/home/dje/cpython-buildarea/3.x.edelsohn-rhel8-z.lto-pgo/build/Tools/freeze/test/freeze.py", line 198 in freeze File "/home/dje/cpython-buildarea/3.x.edelsohn-rhel8-z.lto-pgo/build/Lib/test/test_tools/test_freeze.py", line 28 in test_freeze_simple_script File "/home/dje/cpython-buildarea/3.x.edelsohn-rhel8-z.lto-pgo/build/Lib/unittest/case.py", line 589 in _callTestMethod File "/home/dje/cpython-buildarea/3.x.edelsohn-rhel8-z.lto-pgo/build/Lib/unittest/case.py", line 634 in run File "/home/dje/cpython-buildarea/3.x.edelsohn-rhel8-z.lto-pgo/build/Lib/unittest/case.py", line 690 in __call__ File "/home/dje/cpython-buildarea/3.x.edelsohn-rhel8-z.lto-pgo/build/Lib/unittest/suite.py", line 122 in run File "/home/dje/cpython-buildarea/3.x.edelsohn-rhel8-z.lto-pgo/build/Lib/unittest/suite.py", line 84 in __call__ File "/home/dje/cpython-buildarea/3.x.edelsohn-rhel8-z.lto-pgo/build/Lib/unittest/suite.py", line 122 in run File "/home/dje/cpython-buildarea/3.x.edelsohn-rhel8-z.lto-pgo/build/Lib/unittest/suite.py", line 84 in __call__ File "/home/dje/cpython-buildarea/3.x.edelsohn-rhel8-z.lto-pgo/build/Lib/unittest/suite.py", line 122 in run File "/home/dje/cpython-buildarea/3.x.edelsohn-rhel8-z.lto-pgo/build/Lib/unittest/suite.py", line 84 in __call__ File "/home/dje/cpython-buildarea/3.x.edelsohn-rhel8-z.lto-pgo/build/Lib/unittest/suite.py", line 122 in run File "/home/dje/cpython-buildarea/3.x.edelsohn-rhel8-z.lto-pgo/build/Lib/unittest/suite.py", line 84 in __call__ File "/home/dje/cpython-buildarea/3.x.edelsohn-rhel8-z.lto-pgo/build/Lib/unittest/suite.py", line 122 in run File "/home/dje/cpython-buildarea/3.x.edelsohn-rhel8-z.lto-pgo/build/Lib/unittest/suite.py", line 84 in __call__ File "/home/dje/cpython-buildarea/3.x.edelsohn-rhel8-z.lto-pgo/build/Lib/unittest/runner.py", line 240 in run File "/home/dje/cpython-buildarea/3.x.edelsohn-rhel8-z.lto-pgo/build/Lib/test/support/__init__.py", line 1116 in _run_suite File "/home/dje/cpython-buildarea/3.x.edelsohn-rhel8-z.lto-pgo/build/Lib/test/support/__init__.py", line 1242 in run_unittest File "/home/dje/cpython-buildarea/3.x.edelsohn-rhel8-z.lto-pgo/build/Lib/test/libregrtest/runtest.py", line 294 in _test_module File "/home/dje/cpython-buildarea/3.x.edelsohn-rhel8-z.lto-pgo/build/Lib/test/libregrtest/runtest.py", line 330 in _runtest_inner2 File "/home/dje/cpython-buildarea/3.x.edelsohn-rhel8-z.lto-pgo/build/Lib/test/libregrtest/runtest.py", line 373 in _runtest_inner File "/home/dje/cpython-buildarea/3.x.edelsohn-rhel8-z.lto-pgo/build/Lib/test/libregrtest/runtest.py", line 248 in _runtest File "/home/dje/cpython-buildarea/3.x.edelsohn-rhel8-z.lto-pgo/build/Lib/test/libregrtest/runtest.py", line 278 in runtest File "/home/dje/cpython-buildarea/3.x.edelsohn-rhel8-z.lto-pgo/build/Lib/test/libregrtest/main.py", line 365 in rerun_failed_tests File "/home/dje/cpython-buildarea/3.x.edelsohn-rhel8-z.lto-pgo/build/Lib/test/libregrtest/main.py", line 803 in _main File "/home/dje/cpython-buildarea/3.x.edelsohn-rhel8-z.lto-pgo/build/Lib/test/libregrtest/main.py", line 758 in main File "/home/dje/cpython-buildarea/3.x.edelsohn-rhel8-z.lto-pgo/build/Lib/test/libregrtest/main.py", line 822 in main File "/home/dje/cpython-buildarea/3.x.edelsohn-rhel8-z.lto-pgo/build/Lib/test/__main__.py", line 2 in <module> File "<frozen runpy>", line 88 in _run_code File "<frozen runpy>", line 198 in _run_module_as_main make: *** [Makefile:2021: buildbottest] Error 1
Cannot open file '/home/dje/cpython-buildarea/3.x.edelsohn-rhel8-z.lto-pgo/build/test-results.xml' for upload
Test report
Failed tests:
- test_tools
Sincerely, -The Buildbot
participants (1)
-
buildbot@python.org