Buildbot failure in Python on AMD64 FreeBSD Shared 3.9
The Buildbot has detected a failed build on builder AMD64 FreeBSD Shared 3.9 while building python/cpython. Full details are available at: https://buildbot.python.org/all/#builders/720/builds/34
Buildbot URL: https://buildbot.python.org/all/
Worker for this Build: koobs-freebsd-564d
Build Reason: <unknown> Blamelist: Miss Islington (bot) <31488909+miss-islington@users.noreply.github.com>
BUILD FAILED: failed test (failure)
Summary of the results of the build (if available):
== Tests result: FAILURE then FAILURE ==
403 tests OK.
10 slowest tests:
- test_unicodedata: 20 min 39 sec
- test_lib2to3: 20 min 9 sec
- test_multiprocessing_forkserver: 15 min 51 sec
- test_concurrent_futures: 15 min 15 sec
- test_gdb: 14 min 2 sec
- test_subprocess: 11 min 50 sec
- test_multiprocessing_fork: 11 min 6 sec
- test_pickle: 11 min 4 sec
- test_capi: 11 min
- test_regrtest: 10 min 23 sec
2 tests failed: test__xxsubinterpreters test_concurrent_futures
19 tests skipped: test_dbm_gnu test_devpoll test_epoll test_idle test_ioctl test_msilib test_ossaudiodev test_spwd test_startfile test_tcl test_tix test_tk test_ttk_guionly test_ttk_textonly test_turtle test_winconsoleio test_winreg test_winsound test_zipfile64
5 re-run tests: test__xxsubinterpreters test_concurrent_futures test_multiprocessing_spawn test_tokenize test_unparse
Total duration: 2 hour 59 min
Captured traceback
Traceback (most recent call last): File "/usr/home/buildbot/python/3.9.koobs-freebsd-564d/build/Lib/test/test_concurrent_futures.py", line 481, in test_cancel_futures_wait_false self.assertEqual(out.strip(), b"apple") AssertionError: b'' != b'apple'
Traceback (most recent call last): File "/usr/home/buildbot/python/3.9.koobs-freebsd-564d/build/Lib/multiprocessing/process.py", line 315, in _bootstrap self.run() File "/usr/home/buildbot/python/3.9.koobs-freebsd-564d/build/Lib/multiprocessing/process.py", line 108, in run self._target(*self._args, **self._kwargs) File "/usr/home/buildbot/python/3.9.koobs-freebsd-564d/build/Lib/test/_test_multiprocessing.py", line 4834, in child join_process(p) File "/usr/home/buildbot/python/3.9.koobs-freebsd-564d/build/Lib/test/_test_multiprocessing.py", line 84, in join_process support.join_thread(process) File "/usr/home/buildbot/python/3.9.koobs-freebsd-564d/build/Lib/test/support/__init__.py", line 2105, in join_thread raise AssertionError(msg) AssertionError: failed to join the thread in 30.0 seconds Timeout (0:25:00)! Thread 0x0000000800b69000 (most recent call first): File "/usr/home/buildbot/python/3.9.koobs-freebsd-564d/build/Lib/selectors.py", line 415 in select File "/usr/home/buildbot/python/3.9.koobs-freebsd-564d/build/Lib/multiprocessing/connection.py", line 936 in wait File "/usr/home/buildbot/python/3.9.koobs-freebsd-564d/build/Lib/multiprocessing/popen_fork.py", line 40 in wait File "/usr/home/buildbot/python/3.9.koobs-freebsd-564d/build/Lib/multiprocessing/process.py", line 149 in join File "/usr/home/buildbot/python/3.9.koobs-freebsd-564d/build/Lib/test/support/__init__.py", line 2102 in join_thread File "/usr/home/buildbot/python/3.9.koobs-freebsd-564d/build/Lib/test/_test_multiprocessing.py", line 84 in join_process File "/usr/home/buildbot/python/3.9.koobs-freebsd-564d/build/Lib/test/_test_multiprocessing.py", line 881 in test_sys_exit File "/usr/home/buildbot/python/3.9.koobs-freebsd-564d/build/Lib/unittest/case.py", line 550 in _callTestMethod File "/usr/home/buildbot/python/3.9.koobs-freebsd-564d/build/Lib/unittest/case.py", line 593 in run File "/usr/home/buildbot/python/3.9.koobs-freebsd-564d/build/Lib/unittest/case.py", line 653 in __call__ File "/usr/home/buildbot/python/3.9.koobs-freebsd-564d/build/Lib/unittest/suite.py", line 122 in run File "/usr/home/buildbot/python/3.9.koobs-freebsd-564d/build/Lib/unittest/suite.py", line 84 in __call__ File "/usr/home/buildbot/python/3.9.koobs-freebsd-564d/build/Lib/unittest/suite.py", line 122 in run File "/usr/home/buildbot/python/3.9.koobs-freebsd-564d/build/Lib/unittest/suite.py", line 84 in __call__ File "/usr/home/buildbot/python/3.9.koobs-freebsd-564d/build/Lib/unittest/suite.py", line 122 in run File "/usr/home/buildbot/python/3.9.koobs-freebsd-564d/build/Lib/unittest/suite.py", line 84 in __call__ File "/usr/home/buildbot/python/3.9.koobs-freebsd-564d/build/Lib/unittest/runner.py", line 176 in run File "/usr/home/buildbot/python/3.9.koobs-freebsd-564d/build/Lib/test/support/__init__.py", line 1795 in _run_suite File "/usr/home/buildbot/python/3.9.koobs-freebsd-564d/build/Lib/test/support/__init__.py", line 1917 in run_unittest File "/usr/home/buildbot/python/3.9.koobs-freebsd-564d/build/Lib/test/libregrtest/runtest.py", line 209 in _test_module File "/usr/home/buildbot/python/3.9.koobs-freebsd-564d/build/Lib/test/libregrtest/runtest.py", line 234 in _runtest_inner2 File "/usr/home/buildbot/python/3.9.koobs-freebsd-564d/build/Lib/test/libregrtest/runtest.py", line 270 in _runtest_inner File "/usr/home/buildbot/python/3.9.koobs-freebsd-564d/build/Lib/test/libregrtest/runtest.py", line 140 in _runtest File "/usr/home/buildbot/python/3.9.koobs-freebsd-564d/build/Lib/test/libregrtest/runtest.py", line 193 in runtest File "/usr/home/buildbot/python/3.9.koobs-freebsd-564d/build/Lib/test/libregrtest/runtest_mp.py", line 80 in run_tests_worker File "/usr/home/buildbot/python/3.9.koobs-freebsd-564d/build/Lib/test/libregrtest/main.py", line 657 in _main File "/usr/home/buildbot/python/3.9.koobs-freebsd-564d/build/Lib/test/libregrtest/main.py", line 637 in main File "/usr/home/buildbot/python/3.9.koobs-freebsd-564d/build/Lib/test/libregrtest/main.py", line 715 in main File "/usr/home/buildbot/python/3.9.koobs-freebsd-564d/build/Lib/test/regrtest.py", line 43 in _main File "/usr/home/buildbot/python/3.9.koobs-freebsd-564d/build/Lib/test/regrtest.py", line 47 in <module> File "/usr/home/buildbot/python/3.9.koobs-freebsd-564d/build/Lib/runpy.py", line 87 in _run_code File "/usr/home/buildbot/python/3.9.koobs-freebsd-564d/build/Lib/runpy.py", line 197 in _run_module_as_main /usr/home/buildbot/python/3.9.koobs-freebsd-564d/build/Lib/multiprocessing/resource_tracker.py:216: UserWarning: resource_tracker: There appear to be 1 leaked shared_memory objects to clean up at shutdown warnings.warn('resource_tracker: There appear to be %d ' /usr/home/buildbot/python/3.9.koobs-freebsd-564d/build/Lib/multiprocessing/resource_tracker.py:229: UserWarning: resource_tracker: '/psm_9de2e630': [Errno 2] No such file or directory: '/psm_9de2e630' warnings.warn('resource_tracker: %r: %s' % (name, e))
Traceback (most recent call last): File "/usr/home/buildbot/python/3.9.koobs-freebsd-564d/build/Lib/test/test__xxsubinterpreters.py", line 748, in test_still_running self.assertTrue(interpreters.is_running(interp), AssertionError: False is not true : Interp 48 should be running before destruction.
Traceback (most recent call last): File "/usr/home/buildbot/python/3.9.koobs-freebsd-564d/build/Lib/test/test_concurrent_futures.py", line 992, in test_idle_process_reuse_one self.assertEqual(len(executor._processes), 1) AssertionError: 2 != 1
Traceback (most recent call last): File "/usr/home/buildbot/python/3.9.koobs-freebsd-564d/build/Lib/test/test__xxsubinterpreters.py", line 478, in test_subinterpreter self.assertTrue(interpreters.is_running(interp)) AssertionError: False is not true
Test report
Failed tests:
- test__xxsubinterpreters
- test_concurrent_futures
Failed subtests:
- test_still_running - test.test__xxsubinterpreters.DestroyTests
- test_subinterpreter - test.test__xxsubinterpreters.IsRunningTests
- test_cancel_futures_wait_false - test.test_concurrent_futures.ThreadPoolShutdownTest
- test_idle_process_reuse_one - test.test_concurrent_futures.ProcessPoolSpawnProcessPoolExecutorTest
Sincerely, -The Buildbot
participants (1)
-
buildbot@python.org