☠ Buildbot (Python): python/cpython - failed test (failure) (main)
The Buildbot has detected a new failure on builder ARM64 MacOS M1 Refleaks NoGIL 3.x while building python/cpython. Full details are available at: https://buildbot.python.org/#/builders/1368/builds/5352
Buildbot URL: https://buildbot.python.org/
Worker for this Build: itamaro-macos-arm64-aws
Build Reason: <unknown> Blamelist: An Long <aisk@users.noreply.github.com>, Aniket <148300120+Aniketsy@users.noreply.github.com>, Benjy Wiener <info@benjywiener.com>, Danny Lin <danny0838@gmail.com>, Donghee Na <donghee.na@python.org>, Hans Yu <github@shauny.anonaddy.me>, Inada Naoki <songofacandy@gmail.com>, Ivy Xu <fakeshadow1337@gmail.com>, Jacob Coffee <jacob@z7x.org>, Jelle Zijlstra <jelle.zijlstra@gmail.com>, Jonathan Dung <jonathandung@yahoo.com>, Kumar Aditya <kumaraditya@python.org>, László Kiss Kollár <kiss.kollar.laszlo@gmail.com>, Marc Mueller <30130371+cdce8p@users.noreply.github.com>, Marcel Martin <mail@marcelm.net>, Neil Schemenauer <nas-github@arctrix.com>, Pablo Galindo Salgado <Pablogsal@gmail.com>, Petr Viktorin <encukou@gmail.com>, Pieter Eendebak <pieter.eendebak@gmail.com>, Prakash Sellathurai <prakashsellathurai@gmail.com>, Raymond Hettinger <rhettinger@users.noreply.github.com>, Sergey B Kirpichev <skirpichev@gmail.com>, Serhiy Storchaka <storchaka@gmail.com>, Shahar Naveh <50263 213+ShaharNaveh@users.noreply.github.com>, Shardul Deshpande <iamsharduld@users.noreply.github.com>, Stan Ulbrych <stan@python.org>, Timofei <128279579+deadlovelll@users.noreply.github.com>, Victor Stinner <vstinner@python.org>, Zain Nadeem <zainnadeemzainnadeem80@gmail.com>, da-woods <dw-git@d-woods.co.uk>, ivonastojanovic <80911834+ivonastojanovic@users.noreply.github.com>, sobolevn <mail@sobolevn.me>, stevens <lipengyu@kylinos.cn>, stratakis <cstratak@redhat.com>, tonghuaroot (童话) <tonghuaroot@gmail.com>, Łukasz Langa <lukasz@langa.pl>
BUILD FAILED: failed test (failure)
Summary of the results of the build (if available):
==
Captured traceback
Traceback (most recent call last): File "/Users/buildbot/buildarea/3.x.itamaro-macos-arm64-aws.macos-with-brew.refleak.nogil/build/Lib/test/test_lazy_import/__init__.py", line 1698, in test_concurrent_lazy_import_reification self.assertEqual(errors, [], f"Errors occurred: {errors}") ~~~~~~~~~~~~~~~~^^^^^^^^^^^^^^^^^^^^^^^^^^^^^^^^^^^^^^^^^^ AssertionError: Lists differ: [(8, AttributeError("module 'test.test_laz[39 chars]'"))] != []
Traceback (most recent call last): File "/Users/buildbot/buildarea/3.x.itamaro-macos-arm64-aws.macos-with-brew.refleak.nogil/build/Lib/test/test_curses.py", line 2330, in test_textbox_unicode_insert_mode box.do_command(ch) ~~~~~~~~~~~~~~^^^^ File "/Users/buildbot/buildarea/3.x.itamaro-macos-arm64-aws.macos-with-brew.refleak.nogil/build/Lib/curses/textpad.py", line 125, in do_command self._insert_printable_char(ch) ~~~~~~~~~~~~~~~~~~~~~~~~~~~^^^^ File "/Users/buildbot/buildarea/3.x.itamaro-macos-arm64-aws.macos-with-brew.refleak.nogil/build/Lib/curses/textpad.py", line 103, in _insert_printable_char self.win.addch(ch) ~~~~~~~~~~~~~~^^^^ OverflowError: byte doesn't fit in chtype
Traceback (most recent call last): File "/Users/buildbot/buildarea/3.x.itamaro-macos-arm64-aws.macos-with-brew.refleak.nogil/build/Lib/test/test_curses.py", line 2319, in test_textbox_unicode box.do_command(ch) ~~~~~~~~~~~~~~^^^^ File "/Users/buildbot/buildarea/3.x.itamaro-macos-arm64-aws.macos-with-brew.refleak.nogil/build/Lib/curses/textpad.py", line 125, in do_command self._insert_printable_char(ch) ~~~~~~~~~~~~~~~~~~~~~~~~~~~^^^^ File "/Users/buildbot/buildarea/3.x.itamaro-macos-arm64-aws.macos-with-brew.refleak.nogil/build/Lib/curses/textpad.py", line 103, in _insert_printable_char self.win.addch(ch) ~~~~~~~~~~~~~~^^^^ OverflowError: byte doesn't fit in chtype
Traceback (most recent call last): File "/Users/buildbot/buildarea/3.x.itamaro-macos-arm64-aws.macos-with-brew.refleak.nogil/build/Lib/test/test_curses.py", line 2354, in test_textbox_edit_wide curses.unget_wch(c) ~~~~~~~~~~~~~~~~^^^ OverflowError: character does not fit in a single byte
Test report
Failed tests:
- test_curses
Failed subtests:
- test_textbox_edit_wide - test.test_curses.TestCurses.test_textbox_edit_wide
- test_textbox_unicode - test.test_curses.TestCurses.test_textbox_unicode
- test_textbox_unicode_insert_mode - test.test_curses.TestCurses.test_textbox_unicode_insert_mode
Sincerely, -The Buildbot
participants (1)
-
buildbot@python.org