☠ Buildbot (Python): python/cpython - failed test (failure) (main)
The Buildbot has detected a new failure on builder AMD64 Arch Linux Usan Function 3.x while building python/cpython. Full details are available at: https://buildbot.python.org/#/builders/1596/builds/1080
Buildbot URL: https://buildbot.python.org/
Worker for this Build: pablogsal-arch-x86_64
Build Reason: <unknown> Blamelist: Bob Kline <bkline@users.noreply.github.com>, Cody Maloney <cmaloney@users.noreply.github.com>, Gregory P. Smith <68491+gpshead@users.noreply.github.com>, Guo Ci <zguoci@gmail.com>, Hugo van Kemenade <1324225+hugovk@users.noreply.github.com>, Itamar Oren <itamarost@gmail.com>, Ken Jin <kenjin@python.org>, Kumar Aditya <kumaraditya@python.org>, Locked-chess-official <13140752715@163.com>, M Bussonnier <bussonniermatthias@gmail.com>, Michael Cho <michael@michaelcho.dev>, Mikhail Efimov <efimov.mikhail@gmail.com>, Osama Abdelkader <78818069+osamakader@users.noreply.github.com>, Pablo Galindo Salgado <Pablogsal@gmail.com>, Peter Bierma <zintensitydev@gmail.com>, Petr Viktorin <encukou@gmail.com>, Raymond Hettinger <rhettinger@users.noreply.github.com>, Russell Keith-Magee <russell@keith-magee.com>, Savannah Ostrowski <savannah@python.org>, Sergey Miryanov <sergey.miryanov@gmail.com>, Serhiy Storchaka <storchaka@gmail.com>, Shamil <ashm.tech@proton.me>, Stan Ulbrych <89152624+St anFromIreland@users.noreply.github.com>, Steve Dower <steve.dower@python.org>, Takuya UESHIN <ueshin@happy-camper.st>, Victor Stinner <vstinner@python.org>, dr-carlos <77367421+dr-carlos@users.noreply.github.com>
BUILD FAILED: failed test (failure)
Summary of the results of the build (if available):
==
Captured traceback
Traceback (most recent call last): File "/buildbot/buildarea/3.x.pablogsal-arch-x86_64.clang-ubsan-function/build/Lib/test/test_int.py", line 659, in test_denial_of_service_prevented_str_to_int self.assertLessEqual(sw_fail_extra_huge.seconds, sw_convert.seconds/2) ~~~~~~~~~~~~~~~~~~~~^^^^^^^^^^^^^^^^^^^^^^^^^^^^^^^^^^^^^^^^^^^^^^^^^^ AssertionError: 0.06207589618861675 not less than or equal to 0.018367729149758816
Test report
Failed tests:
- test_urllib2net
- test_int
Sincerely, -The Buildbot
participants (1)
-
buildbot@python.org