☠ Buildbot (Python): python/cpython - failed test (failure) (main)
The Buildbot has detected a new failure on builder AMD64 Ubuntu Shared 3.x while building python/cpython. Full details are available at: https://buildbot.python.org/#/builders/506/builds/11511
Buildbot URL: https://buildbot.python.org/
Worker for this Build: bolen-ubuntu
Build Reason: <unknown> Blamelist: Gordon Messmer <gordon.messmer@gmail.com>
BUILD FAILED: failed test (failure)
Summary of the results of the build (if available):
==
Captured traceback
Traceback (most recent call last): File "/srv/buildbot/buildarea/3.x.bolen-ubuntu/build/Lib/test/test_os.py", line 4644, in test_timerfd_ns_TFD_TIMER_ABSTIME self.assertLess(abs(next_expiration_ns - offset_ns), limit_error) ~~~~~~~~~~~~~~~^^^^^^^^^^^^^^^^^^^^^^^^^^^^^^^^^^^^^^^^^^^^^^^^^^^ AssertionError: 1062375 not less than 1000000
Traceback (most recent call last): File "/srv/buildbot/buildarea/3.x.bolen-ubuntu/build/Lib/test/support/__init__.py", line 837, in gc_collect gc.collect() ~~~~~~~~~~^^ ResourceWarning: unclosed file <_io.FileIO name=8 mode='rb' closefd=True> Warning -- Unraisable exception Exception ignored while finalizing file <_io.FileIO name=10 mode='rb' closefd=True>: Traceback (most recent call last): File "/srv/buildbot/buildarea/3.x.bolen-ubuntu/build/Lib/test/libregrtest/single.py", line 165, in _load_run_test regrtest_runner(result, test_func, runtests) ~~~~~~~~~~~~~~~^^^^^^^^^^^^^^^^^^^^^^^^^^^^^ File "/srv/buildbot/buildarea/3.x.bolen-ubuntu/build/Lib/test/libregrtest/single.py", line 118, in regrtest_runner test_result = test_func() File "/srv/buildbot/buildarea/3.x.bolen-ubuntu/build/Lib/test/libregrtest/single.py", line 162, in test_func return run_unittest(test_mod, runtests) File "/srv/buildbot/buildarea/3.x.bolen-ubuntu/build/Lib/test/libregrtest/single.py", line 42, in run_unittest return _run_suite(tests) File "/srv/buildbot/buildarea/3.x.bolen-ubuntu/build/Lib/test/libregrtest/single.py", line 105, in _run_suite raise support.TestFailedWithDetails(err, errors, failures, stats=stats)
Traceback (most recent call last): File "/srv/buildbot/buildarea/3.x.bolen-ubuntu/build/Lib/subprocess.py", line 1137, in __del__ _warn("subprocess %s is still running" % self.pid, ~~~~~^^^^^^^^^^^^^^^^^^^^^^^^^^^^^^^^^^^^^^^^^^^^^ ResourceWarning, source=self) ^^^^^^^^^^^^^^^^^^^^^^^^^^^^^ ResourceWarning: subprocess 1706007 is still running Warning -- Unraisable exception Exception ignored while finalizing file <_io.FileIO name=8 mode='rb' closefd=True>: Traceback (most recent call last): File "/srv/buildbot/buildarea/3.x.bolen-ubuntu/build/Lib/test/libregrtest/single.py", line 165, in _load_run_test regrtest_runner(result, test_func, runtests) ~~~~~~~~~~~~~~~^^^^^^^^^^^^^^^^^^^^^^^^^^^^^ File "/srv/buildbot/buildarea/3.x.bolen-ubuntu/build/Lib/test/libregrtest/single.py", line 118, in regrtest_runner test_result = test_func() File "/srv/buildbot/buildarea/3.x.bolen-ubuntu/build/Lib/test/libregrtest/single.py", line 162, in test_func return run_unittest(test_mod, runtests) File "/srv/buildbot/buildarea/3.x.bolen-ubuntu/build/Lib/test/libregrtest/single.py", line 42, in run_unittest return _run_suite(tests) File "/srv/buildbot/buildarea/3.x.bolen-ubuntu/build/Lib/test/libregrtest/single.py", line 105, in _run_suite raise support.TestFailedWithDetails(err, errors, failures, stats=stats)
Traceback (most recent call last): File "/srv/buildbot/buildarea/3.x.bolen-ubuntu/build/Lib/test/libregrtest/single.py", line 165, in _load_run_test regrtest_runner(result, test_func, runtests) ~~~~~~~~~~~~~~~^^^^^^^^^^^^^^^^^^^^^^^^^^^^^ File "/srv/buildbot/buildarea/3.x.bolen-ubuntu/build/Lib/test/libregrtest/single.py", line 118, in regrtest_runner test_result = test_func() File "/srv/buildbot/buildarea/3.x.bolen-ubuntu/build/Lib/test/libregrtest/single.py", line 162, in test_func return run_unittest(test_mod, runtests) File "/srv/buildbot/buildarea/3.x.bolen-ubuntu/build/Lib/test/libregrtest/single.py", line 42, in run_unittest return _run_suite(tests) File "/srv/buildbot/buildarea/3.x.bolen-ubuntu/build/Lib/test/libregrtest/single.py", line 105, in _run_suite raise support.TestFailedWithDetails(err, errors, failures, stats=stats)
Traceback (most recent call last): File "/srv/buildbot/buildarea/3.x.bolen-ubuntu/build/Lib/subprocess.py", line 1137, in __del__ _warn("subprocess %s is still running" % self.pid, ~~~~~^^^^^^^^^^^^^^^^^^^^^^^^^^^^^^^^^^^^^^^^^^^^^ ResourceWarning, source=self) ^^^^^^^^^^^^^^^^^^^^^^^^^^^^^ ResourceWarning: subprocess 1668708 is still running Warning -- Unraisable exception Exception ignored while finalizing file <_io.FileIO name=8 mode='rb' closefd=True>: Traceback (most recent call last): File "/srv/buildbot/buildarea/3.x.bolen-ubuntu/build/Lib/test/libregrtest/single.py", line 165, in _load_run_test regrtest_runner(result, test_func, runtests) ~~~~~~~~~~~~~~~^^^^^^^^^^^^^^^^^^^^^^^^^^^^^ File "/srv/buildbot/buildarea/3.x.bolen-ubuntu/build/Lib/test/libregrtest/single.py", line 118, in regrtest_runner test_result = test_func() File "/srv/buildbot/buildarea/3.x.bolen-ubuntu/build/Lib/test/libregrtest/single.py", line 162, in test_func return run_unittest(test_mod, runtests) File "/srv/buildbot/buildarea/3.x.bolen-ubuntu/build/Lib/test/libregrtest/single.py", line 42, in run_unittest return _run_suite(tests) File "/srv/buildbot/buildarea/3.x.bolen-ubuntu/build/Lib/test/libregrtest/single.py", line 105, in _run_suite raise support.TestFailedWithDetails(err, errors, failures, stats=stats)
Traceback (most recent call last): File "/srv/buildbot/buildarea/3.x.bolen-ubuntu/build/Lib/test/support/__init__.py", line 837, in gc_collect gc.collect() ~~~~~~~~~~^^ ResourceWarning: unclosed file <_io.FileIO name=10 mode='rb' closefd=True>
Traceback (most recent call last): File "/srv/buildbot/buildarea/3.x.bolen-ubuntu/build/Lib/test/test_pyrepl/test_unix_console.py", line 362, in test_repl_eio _, err = proc.communicate(timeout=5) # sleep for pty to settle ~~~~~~~~~~~~~~~~^^^^^^^^^^^ File "/srv/buildbot/buildarea/3.x.bolen-ubuntu/build/Lib/subprocess.py", line 1219, in communicate stdout, stderr = self._communicate(input, endtime, timeout) ~~~~~~~~~~~~~~~~~^^^^^^^^^^^^^^^^^^^^^^^^^ File "/srv/buildbot/buildarea/3.x.bolen-ubuntu/build/Lib/subprocess.py", line 2126, in _communicate self._check_timeout(endtime, orig_timeout, stdout, stderr) ~~~~~~~~~~~~~~~~~~~^^^^^^^^^^^^^^^^^^^^^^^^^^^^^^^^^^^^^^^ File "/srv/buildbot/buildarea/3.x.bolen-ubuntu/build/Lib/subprocess.py", line 1266, in _check_timeout raise TimeoutExpired( ...<2 lines>... stderr=b''.join(stderr_seq) if stderr_seq else None) subprocess.TimeoutExpired: Command '['/srv/buildbot/buildarea/3.x.bolen-ubuntu/build/python', '-E', '-S', '/srv/buildbot/buildarea/3.x.bolen-ubuntu/build/Lib/test/test_pyrepl/eio_test_script.py']' timed out after 5 seconds
Test report
Failed tests:
- test_pyrepl
Failed subtests:
- test_timerfd_ns_TFD_TIMER_ABSTIME - test.test_os.TimerfdTests.test_timerfd_ns_TFD_TIMER_ABSTIME
- test_repl_eio - test.test_pyrepl.test_unix_console.TestUnixConsoleEIOHandling.test_repl_eio
Sincerely, -The Buildbot
participants (1)
-
buildbot@python.org