☠ Buildbot (Python): python/cpython - failed test (failure) (3.13)
The Buildbot has detected a new failure on builder s390x Fedora Stable LTO 3.13 while building python/cpython. Full details are available at: https://buildbot.python.org/#/builders/1637/builds/962
Buildbot URL: https://buildbot.python.org/
Worker for this Build: cstratak-fedora-stable-s390x
Build Reason: <unknown> Blamelist: Gregory P. Smith <68491+gpshead@users.noreply.github.com>, Miss Islington (bot) <31488909+miss-islington@users.noreply.github.com>
BUILD FAILED: failed test (failure)
Summary of the results of the build (if available):
==
Captured traceback
Traceback (most recent call last): File "/var/lib/buildbot/worker/cstratak-fedora-stable-s390x/3.13.cstratak-fedora-stable-s390x.lto/build/Lib/test/test_os.py", line 4414, in test_timerfd_poll self.check_timerfd_poll(False) ~~~~~~~~~~~~~~~~~~~~~~~^^^^^^^ File "/var/lib/buildbot/worker/cstratak-fedora-stable-s390x/3.13.cstratak-fedora-stable-s390x.lto/build/Lib/test/test_os.py", line 4402, in check_timerfd_poll self.assertEqual(self.read_count_signaled(fd), 1) ~~~~~~~~~~~~~~~~^^^^^^^^^^^^^^^^^^^^^^^^^^^^^^^^^ AssertionError: 2 != 1
Test report
Failed tests:
- test_os
Failed subtests:
- test_timerfd_poll - test.test_os.TimerfdTests.test_timerfd_poll
Sincerely, -The Buildbot
participants (1)
-
buildbot@python.org