Buildbot failure in Python on s390x Fedora Rawhide Clang Installed 3.x
The Buildbot has detected a failed build on builder s390x Fedora Rawhide Clang Installed 3.x while building python/cpython. Full details are available at: https://buildbot.python.org/all/#builders/207/builds/268
Buildbot URL: https://buildbot.python.org/all/
Worker for this Build: edelsohn-fedora-rawhide-z
Build Reason: <unknown> Blamelist: Alexey Izbyshev <izbyshev@ispras.ru>, kj <28750310+Fidget-Spinner@users.noreply.github.com>
BUILD FAILED: failed test (failure)
Summary of the results of the build (if available):
== Tests result: FAILURE then FAILURE ==
405 tests OK.
1 test failed: test_zipimport
18 tests skipped: test_asdl_parser test_check_c_globals test_clinic test_devpoll test_gdb test_ioctl test_kqueue test_msilib test_nis test_ossaudiodev test_startfile test_tix test_tk test_ttk_guionly test_winconsoleio test_winreg test_winsound test_zipfile64
1 re-run test: test_zipimport
Total duration: 3 min 40 sec
Captured traceback
Traceback (test.test_zipimport.CompressedZipImportTestCase) ... ok
Traceback (most recent call last): File "/home/dje/cpython-buildarea/3.x.edelsohn-fedora-rawhide-z.clang-installed/build/target/lib/python3.10/test/test_zipimport.py", line 194, in testBoth self.doTest(pyc_ext, files, TESTMOD) File "/home/dje/cpython-buildarea/3.x.edelsohn-fedora-rawhide-z.clang-installed/build/target/lib/python3.10/test/test_zipimport.py", line 148, in doTest self.assertEqual(file, os.path.join(TEMP_ZIP, AssertionError: '/tmp[14 chars]204æ/test_python_worker_11588æ/junk95142.zip/ziptestmodule.py' != '/tmp[14 chars]204æ/test_python_worker_11588æ/junk95142.zip/ziptestmodule.pyc'
- /tmp/test_python_1204æ/test_python_worker_11588æ/junk95142.zip/ziptestmodule.py
- /tmp/test_python_1204æ/test_python_worker_11588æ/junk95142.zip/ziptestmodule.pyc ? +
Traceback (most recent call last): File "/home/dje/cpython-buildarea/3.x.edelsohn-fedora-rawhide-z.clang-installed/build/target/lib/python3.10/test/test_zipimport.py", line 594, in testGetCompiledSource self.doTest(pyc_ext, files, TESTMOD, call=self.assertModuleSource) File "/home/dje/cpython-buildarea/3.x.edelsohn-fedora-rawhide-z.clang-installed/build/target/lib/python3.10/test/test_zipimport.py", line 148, in doTest self.assertEqual(file, os.path.join(TEMP_ZIP, AssertionError: '/tmp[14 chars]204æ/test_python_worker_11588æ/junk95142.zip/ziptestmodule.py' != '/tmp[14 chars]204æ/test_python_worker_11588æ/junk95142.zip/ziptestmodule.pyc'
- /tmp/test_python_1204æ/test_python_worker_11588æ/junk95142.zip/ziptestmodule.py
- /tmp/test_python_1204æ/test_python_worker_11588æ/junk95142.zip/ziptestmodule.pyc ? +
Traceback (most recent call last): File "/home/dje/cpython-buildarea/3.x.edelsohn-fedora-rawhide-z.clang-installed/build/target/lib/python3.10/test/test_zipimport.py", line 194, in testBoth self.doTest(pyc_ext, files, TESTMOD) File "/home/dje/cpython-buildarea/3.x.edelsohn-fedora-rawhide-z.clang-installed/build/target/lib/python3.10/test/test_zipimport.py", line 148, in doTest self.assertEqual(file, os.path.join(TEMP_ZIP, AssertionError: '/tmp/test_python_1204æ/junk95142.zip/ziptestmodule.py' != '/tmp/test_python_1204æ/junk95142.zip/ziptestmodule.pyc'
- /tmp/test_python_1204æ/junk95142.zip/ziptestmodule.py
- /tmp/test_python_1204æ/junk95142.zip/ziptestmodule.pyc ? +
Traceback (test.test_zipimport.UncompressedZipImportTestCase) ... ok
Traceback (most recent call last): File "/home/dje/cpython-buildarea/3.x.edelsohn-fedora-rawhide-z.clang-installed/build/target/lib/python3.10/test/test_zipimport.py", line 594, in testGetCompiledSource self.doTest(pyc_ext, files, TESTMOD, call=self.assertModuleSource) File "/home/dje/cpython-buildarea/3.x.edelsohn-fedora-rawhide-z.clang-installed/build/target/lib/python3.10/test/test_zipimport.py", line 148, in doTest self.assertEqual(file, os.path.join(TEMP_ZIP, AssertionError: '/tmp/test_python_1204æ/junk95142.zip/ziptestmodule.py' != '/tmp/test_python_1204æ/junk95142.zip/ziptestmodule.pyc'
- /tmp/test_python_1204æ/junk95142.zip/ziptestmodule.py
- /tmp/test_python_1204æ/junk95142.zip/ziptestmodule.pyc ? +
Test report
Failed tests:
- test_zipimport
Failed subtests:
- testBoth - test.test_zipimport.UncompressedZipImportTestCase
- testGetCompiledSource - test.test_zipimport.UncompressedZipImportTestCase
- testBoth - test.test_zipimport.CompressedZipImportTestCase
- testGetCompiledSource - test.test_zipimport.CompressedZipImportTestCase
Sincerely, -The Buildbot
https://bugs.python.org/issue42231 test_zipimport failure
Le dim. 1 nov. 2020 à 07:13, <buildbot@python.org> a écrit :
The Buildbot has detected a failed build on builder s390x Fedora Rawhide Clang Installed 3.x while building python/cpython. Full details are available at: https://buildbot.python.org/all/#builders/207/builds/268
Buildbot URL: https://buildbot.python.org/all/
Worker for this Build: edelsohn-fedora-rawhide-z
Build Reason: <unknown> Blamelist: Alexey Izbyshev <izbyshev@ispras.ru>, kj <28750310+Fidget-Spinner@users.noreply.github.com>
BUILD FAILED: failed test (failure)
Summary of the results of the build (if available):
== Tests result: FAILURE then FAILURE ==
405 tests OK.
1 test failed: test_zipimport
18 tests skipped: test_asdl_parser test_check_c_globals test_clinic test_devpoll test_gdb test_ioctl test_kqueue test_msilib test_nis test_ossaudiodev test_startfile test_tix test_tk test_ttk_guionly test_winconsoleio test_winreg test_winsound test_zipfile64
1 re-run test: test_zipimport
Total duration: 3 min 40 sec
Captured traceback
Traceback (test.test_zipimport.CompressedZipImportTestCase) ... ok
Traceback (most recent call last): File "/home/dje/cpython-buildarea/3.x.edelsohn-fedora-rawhide-z.clang-installed/build/target/lib/python3.10/test/test_zipimport.py", line 194, in testBoth self.doTest(pyc_ext, files, TESTMOD) File "/home/dje/cpython-buildarea/3.x.edelsohn-fedora-rawhide-z.clang-installed/build/target/lib/python3.10/test/test_zipimport.py", line 148, in doTest self.assertEqual(file, os.path.join(TEMP_ZIP, AssertionError: '/tmp[14 chars]204æ/test_python_worker_11588æ/junk95142.zip/ziptestmodule.py' != '/tmp[14 chars]204æ/test_python_worker_11588æ/junk95142.zip/ziptestmodule.pyc'
- /tmp/test_python_1204æ/test_python_worker_11588æ/junk95142.zip/ziptestmodule.py
- /tmp/test_python_1204æ/test_python_worker_11588æ/junk95142.zip/ziptestmodule.pyc ? +
Traceback (most recent call last): File "/home/dje/cpython-buildarea/3.x.edelsohn-fedora-rawhide-z.clang-installed/build/target/lib/python3.10/test/test_zipimport.py", line 594, in testGetCompiledSource self.doTest(pyc_ext, files, TESTMOD, call=self.assertModuleSource) File "/home/dje/cpython-buildarea/3.x.edelsohn-fedora-rawhide-z.clang-installed/build/target/lib/python3.10/test/test_zipimport.py", line 148, in doTest self.assertEqual(file, os.path.join(TEMP_ZIP, AssertionError: '/tmp[14 chars]204æ/test_python_worker_11588æ/junk95142.zip/ziptestmodule.py' != '/tmp[14 chars]204æ/test_python_worker_11588æ/junk95142.zip/ziptestmodule.pyc'
- /tmp/test_python_1204æ/test_python_worker_11588æ/junk95142.zip/ziptestmodule.py
- /tmp/test_python_1204æ/test_python_worker_11588æ/junk95142.zip/ziptestmodule.pyc ? +
Traceback (most recent call last): File "/home/dje/cpython-buildarea/3.x.edelsohn-fedora-rawhide-z.clang-installed/build/target/lib/python3.10/test/test_zipimport.py", line 194, in testBoth self.doTest(pyc_ext, files, TESTMOD) File "/home/dje/cpython-buildarea/3.x.edelsohn-fedora-rawhide-z.clang-installed/build/target/lib/python3.10/test/test_zipimport.py", line 148, in doTest self.assertEqual(file, os.path.join(TEMP_ZIP, AssertionError: '/tmp/test_python_1204æ/junk95142.zip/ziptestmodule.py' != '/tmp/test_python_1204æ/junk95142.zip/ziptestmodule.pyc'
- /tmp/test_python_1204æ/junk95142.zip/ziptestmodule.py
- /tmp/test_python_1204æ/junk95142.zip/ziptestmodule.pyc ? +
Traceback (test.test_zipimport.UncompressedZipImportTestCase) ... ok
Traceback (most recent call last): File "/home/dje/cpython-buildarea/3.x.edelsohn-fedora-rawhide-z.clang-installed/build/target/lib/python3.10/test/test_zipimport.py", line 594, in testGetCompiledSource self.doTest(pyc_ext, files, TESTMOD, call=self.assertModuleSource) File "/home/dje/cpython-buildarea/3.x.edelsohn-fedora-rawhide-z.clang-installed/build/target/lib/python3.10/test/test_zipimport.py", line 148, in doTest self.assertEqual(file, os.path.join(TEMP_ZIP, AssertionError: '/tmp/test_python_1204æ/junk95142.zip/ziptestmodule.py' != '/tmp/test_python_1204æ/junk95142.zip/ziptestmodule.pyc'
- /tmp/test_python_1204æ/junk95142.zip/ziptestmodule.py
- /tmp/test_python_1204æ/junk95142.zip/ziptestmodule.pyc ? +
Test report
Failed tests:
- test_zipimport
Failed subtests:
- testBoth - test.test_zipimport.UncompressedZipImportTestCase
- testGetCompiledSource - test.test_zipimport.UncompressedZipImportTestCase
- testBoth - test.test_zipimport.CompressedZipImportTestCase
- testGetCompiledSource - test.test_zipimport.CompressedZipImportTestCase
Sincerely, -The Buildbot
Buildbot-status mailing list -- buildbot-status@python.org To unsubscribe send an email to buildbot-status-leave@python.org https://mail.python.org/mailman3/lists/buildbot-status.python.org/ Member address: vstinner@python.org
-- Night gathers, and now my watch begins. It shall not end until my death.
participants (2)
-
buildbot@python.org -
Victor Stinner